{"text_format":"1","workbook":"xlsx","n_sheets":5,"sheets":["Forside 2018","J11 2018","G11 2018","J12 2018","G12 2018"],"not_rendered":{"charts":0,"images":8,"macros":0,"external_links":0,"defined_names":4,"comments":0,"pivot_tables":0},"unopened":[],"bounds":{"document_bytes":16777216,"sheet_cells":100000,"rows_first":2000,"rows_last":500,"rows_between":2000,"halvings":0,"cell_chars":16384,"cell_head_chars":4096},"cells_cut":0,"cells_raw":0,"read":"whole","date_system":"1900"}

{"sheet":"Forside 2018","index":0,"n_rows":24,"n_cols":1,"rows_kept":24,"cut":false,"hidden":false,"merged":[]}
["Resultatliste Oslo Cup 2017"]
["Etter 7 av 8 renn"]
[]
[]
["- Oslo Cup arrangeres av Oslo Skikrets i samarbeid med IRS, Heming, Ready, Njård, HSIL og Kjelsås"]
["- 8 renn, arrangert av de samarbeidende klubbene, inngår i Oslo Cup "]
["- Det konkurreres i separate årsklasser, J11, G11, J12 og G12"]
["- Sammenlagtresultatene beregnes med World Cup poeng + deltakerpoeng."]
["- De fire beste resultatene er tellende sammenlagt, men alle deltakerpoengene teller med i totalresultatet"]
["- Premiering av de tre beste sammenlagt i hver klasse"]
[]
[]
["Poengsystem:"]
["- World Cup poeng for plasseringer (100 poeng for seier, 80 for andre plass osv). "]
["- De fire beste resultatene er tellende i sammendraget"]
["- Det gis 5 deltakerpoeng pr. renn, uanhengig av resultat og om resultatet er tellende i sammendraget"]
[]
[]
["Forklaring på overskriften i resultatlistene:"]
["- Plass = plassering i rennet "]
["- Res. = resultatpoeng etter World Cup skala "]
["- Del. = deltakerpoeng, 5 poeng for deltakelse "]
["- Tot. = totalpoeng for rennet, sum av resultatpoeng og deltakerpoeng "]
["- Resultater/poeng som ikke er tellende for de som har kjørt flere enn fire renn er markert/skravert med grått"]

{"sheet":"J11 2018","index":1,"n_rows":53,"n_cols":76,"rows_kept":53,"cut":false,"hidden":false,"merged":[[0,42,0,45],[2,26,2,29],[2,31,2,34],[2,36,2,39],[2,41,2,44],[3,62,3,64],[4,7,4,14],[4,17,4,24],[2,51,2,54],[2,56,2,59],[2,61,2,64],[3,27,3,29],[3,32,3,34],[3,37,3,39],[3,42,3,44],[3,47,3,49],[3,52,3,54],[3,57,3,59],[2,46,2,49]]}
["Resultatliste Oslo Cup 2018 - Jenter 11 år"]
[{"$f":"'Forside 2018'!A2","v":"Etter 7 av 8 renn"}]
[null,null,null,null,null,null,null,"IRS Rennet","Ljan Rennet","Njård Rennet","Ready Rennet","Telenor Arena Cup","Euro-tecfarten","Oslo Alpinfestival SL","Oslo Alpinfestival SSL",null,null,"IRS Rennet","Ljan Rennet","Njård Rennet","Ready Rennet","Telenor Arena Cup","Euro-tecfarten","Oslo Alpinfestival SL","Oslo Alpinfestival SSL",null,"--------IRS Rennet----------",null,null,null,null,"----------Ljan Rennet---------",null,null,null,null,"--------Njård Rennet----------",null,null,null,null,"--------Ready Rennet---------",null,null,null,null,"-----Telenor Arena Cup----",null,null,null,null,"------Euro-tecfarten--------",null,null,null,null,"---Oslo Alpinfestival SL---",null,null,null,null,"---Oslo Alpinfestival SSL---"]
[null,null,null,null,null,"Antall",null,"2018-02-03","2018-02-04","2018-02-10","2018-02-11","2018-02-14","2018-02-28","2018-03-03","2018-03-04",null,"Poeng","2018-02-03","2018-02-04","2018-02-10","2018-02-11","2018-02-14","2018-02-28","2018-03-03","2018-03-04",null,null,"--------Poeng--------",null,null,null,null,"--------Poeng--------",null,null,null,null,"-------Poeng---------",null,null,null,null,"-------Poeng---------",null,null,null,null,"-------Poeng---------",null,null,null,null,"-------Poeng---------",null,null,null,null,"-------Poeng---------",null,null,null,null,"-------Poeng---------",null,null,null,null,null,"Løpere med ","Løpere med ","Løpere med ","Løpere med ","Løpere med ","Løpere med ","Løpere med ","Løpere med "]
["Plass","Etternavn","Fornavn","Klubb","Poeng","renn",null,"------------------------------Plassering i rennene---------------------------------",null,null,null,null,null,null,null,null,"brutto","----------------Resultatpoeng hvis mer enn 4 renn----------------",null,null,null,null,null,null,null,null,"Plass","Res.","Del.","Tot.",null,"Plass","Res.","Del.","Tot.",null,"Plass","Res.","Del.","Tot.",null,"Plass","Res.","Del.","Tot.",null,"Plass","Res.","Del.","Tot.",null,"Plass","Res.","Del.","Tot.",null,"Plass","Res.","Del.","Tot.",null,"Plass","Res.","Del.","Tot.",null,"Plass","Poeng","8 renn","7 renn","6 renn","5 renn","4 renn","3 renn","2 renn","kun 1 renn"]
[{"$f":"IF(E6<E5,BO6,A5)","v":1},"Grobstok","Emilie Smedsrud","Ready",{"$f":"IF(F6<=4,Q6,(Q6-SUM(SMALL(R6:Y6,{1;2;3;4}))))","v":385},{"$f":"(IF(AC6=5,1,0)+IF(AH6=5,1,0)+IF(AM6=5,1,0)+IF(AR6=5,1,0)+IF(AW6=5,1,0)+IF(BB6=5,1,0)+IF(BG6=5,1,0)+IF(BL6=5,1,0))","v":5},null,{"$f":"IF(AA6=\"\",\"\",AA6)","v":""},{"$f":"IF(AF6=\"\",\"\",AF6)","v":""},{"$f":"IF(AK6=\"\",\"\",AK6)","v":2},{"$f":"IF(AP6=\"\",\"\",AP6)","v":2},{"$f":"IF(AU6=\"\",\"\",AU6)","v":1},{"$f":"IF(AZ6=\"\",\"\",AZ6)","v":1},{"$f":"IF(BE6=\"\",\"\",BE6)","v":"dnf"},{"$f":"IF(BJ6=\"\",\"\",BJ6)","v":""},null,{"$f":"AD6+AI6+AN6+AS6+AX6+BC6+BH6","v":385},{"$f":"IF($F6>=5,IF(AB6=\"\",\"\",AB6),\"\")","v":0},{"$f":"IF($F6>=5,IF(AG6=\"\",\"\",AG6),\"\")","v":0},{"$f":"IF($F6>=5,IF(AL6=\"\",\"\",AL6),\"\")","v":80},{"$f":"IF($F6>=5,IF(AQ6=\"\",\"\",AQ6),\"\")","v":80},{"$f":"IF($F6>=5,IF(AV6=\"\",\"\",AV6),\"\")","v":100},{"$f":"IF($F6>=5,IF(BA6=\"\",\"\",BA6),\"\")","v":100},{"$f":"IF($F6>=5,IF(BF6=\"\",\"\",BF6),\"\")","v":0},{"$f":"IF($F6>=5,IF(BK6=\"\",\"\",BK6),\"\")","v":0},null,null,{"$f":"IF(ISNUMBER(AA6),(VLOOKUP(AA6,$BO$6:$BP$50,2)),0)","v":0},{"$f":"IF(AA6<>\"\",5,0)","v":0},{"$f":"AB6+AC6","v":0},null,null,{"$f":"IF(ISNUMBER(AF6),(VLOOKUP(AF6,$BO$6:$BP$50,2)),0)","v":0},{"$f":"IF(AF6<>\"\",5,0)","v":0},{"$f":"AG6+AH6","v":0},null,2,{"$f":"IF(ISNUMBER(AK6),(VLOOKUP(AK6,$BO$6:$BP$50,2)),0)","v":80},{"$f":"IF(AK6<>\"\",5,0)","v":5},{"$f":"AL6+AM6","v":85},null,2,{"$f":"IF(ISNUMBER(AP6),(VLOOKUP(AP6,$BO$6:$BP$50,2)),0)","v":80},{"$f":"IF(AP6<>\"\",5,0)","v":5},{"$f":"AQ6+AR6","v":85},null,1,{"$f":"IF(ISNUMBER(AU6),(VLOOKUP(AU6,$BO$6:$BP$50,2)),0)","v":100},{"$f":"IF(AU6<>\"\",5,0)","v":5},{"$f":"AV6+AW6","v":105},null,1,{"$f":"IF(ISNUMBER(AZ6),(VLOOKUP(AZ6,$BO$6:$BP$50,2)),0)","v":100},{"$f":"IF(AZ6<>\"\",5,0)","v":5},{"$f":"BA6+BB6","v":105},null,"dnf",{"$f":"IF(ISNUMBER(BE6),(VLOOKUP(BE6,$BO$6:$BP$50,2)),0)","v":0},{"$f":"IF(BE6<>\"\",5,0)","v":5},{"$f":"BF6+BG6","v":5},null,null,{"$f":"IF(ISNUMBER(BJ6),(VLOOKUP(BJ6,$BO$6:$BP$50,2)),0)","v":0},{"$f":"IF(BJ6<>\"\",5,0)","v":0},{"$f":"BK6+BL6","v":0},null,1,100,{"$f":"IF($F6=8,1,0)","v":0},{"$f":"IF($F6=7,1,0)","v":0},{"$f":"IF($F6=6,1,0)","v":0},{"$f":"IF($F6=5,1,0)","v":1},{"$f":"IF($F6=4,1,0)","v":0},{"$f":"IF($F6=3,1,0)","v":0},{"$f":"IF($F6=2,1,0)","v":0},{"$f":"IF($F6=1,1,0)","v":0}]
[{"$f":"IF(E7<E6,BO7,A6)","v":2},"Sande","Malene Louise Gaunt","Heming",{"$f":"IF(F7<=4,Q7,(Q7-SUM(SMALL(R7:Y7,{1;2;3;4}))))","v":350},{"$f":"(IF(AC7=5,1,0)+IF(AH7=5,1,0)+IF(AM7=5,1,0)+IF(AR7=5,1,0)+IF(AW7=5,1,0)+IF(BB7=5,1,0)+IF(BG7=5,1,0)+IF(BL7=5,1,0))","v":4},null,{"$f":"IF(AA7=\"\",\"\",AA7)","v":""},{"$f":"IF(AF7=\"\",\"\",AF7)","v":""},{"$f":"IF(AK7=\"\",\"\",AK7)","v":1},{"$f":"IF(AP7=\"\",\"\",AP7)","v":1},{"$f":"IF(AU7=\"\",\"\",AU7)","v":2},{"$f":"IF(AZ7=\"\",\"\",AZ7)","v":""},{"$f":"IF(BE7=\"\",\"\",BE7)","v":4},{"$f":"IF(BJ7=\"\",\"\",BJ7)","v":""},null,{"$f":"AD7+AI7+AN7+AS7+AX7+BC7+BH7","v":350},{"$f":"IF($F7>=5,IF(AB7=\"\",\"\",AB7),\"\")","v":""},{"$f":"IF($F7>=5,IF(AG7=\"\",\"\",AG7),\"\")","v":""},{"$f":"IF($F7>=5,IF(AL7=\"\",\"\",AL7),\"\")","v":""},{"$f":"IF($F7>=5,IF(AQ7=\"\",\"\",AQ7),\"\")","v":""},{"$f":"IF($F7>=5,IF(AV7=\"\",\"\",AV7),\"\")","v":""},{"$f":"IF($F7>=5,IF(BA7=\"\",\"\",BA7),\"\")","v":""},{"$f":"IF($F7>=5,IF(BF7=\"\",\"\",BF7),\"\")","v":""},{"$f":"IF($F7>=5,IF(BK7=\"\",\"\",BK7),\"\")","v":""},null,null,{"$f":"IF(ISNUMBER(AA7),(VLOOKUP(AA7,$BO$6:$BP$50,2)),0)","v":0},{"$f":"IF(AA7<>\"\",5,0)","v":0},{"$f":"AB7+AC7","v":0},null,null,{"$f":"IF(ISNUMBER(AF7),(VLOOKUP(AF7,$BO$6:$BP$50,2)),0)","v":0},{"$f":"IF(AF7<>\"\",5,0)","v":0},{"$f":"AG7+AH7","v":0},null,1,{"$f":"IF(ISNUMBER(AK7),(VLOOKUP(AK7,$BO$6:$BP$50,2)),0)","v":100},{"$f":"IF(AK7<>\"\",5,0)","v":5},{"$f":"AL7+AM7","v":105},null,1,{"$f":"IF(ISNUMBER(AP7),(VLOOKUP(AP7,$BO$6:$BP$50,2)),0)","v":100},{"$f":"IF(AP7<>\"\",5,0)","v":5},{"$f":"AQ7+AR7","v":105},null,2,{"$f":"IF(ISNUMBER(AU7),(VLOOKUP(AU7,$BO$6:$BP$50,2)),0)","v":80},{"$f":"IF(AU7<>\"\",5,0)","v":5},{"$f":"AV7+AW7","v":85},null,null,{"$f":"IF(ISNUMBER(AZ7),(VLOOKUP(AZ7,$BO$6:$BP$50,2)),0)","v":0},{"$f":"IF(AZ7<>\"\",5,0)","v":0},{"$f":"BA7+BB7","v":0},null,4,{"$f":"IF(ISNUMBER(BE7),(VLOOKUP(BE7,$BO$6:$BP$50,2)),0)","v":50},{"$f":"IF(BE7<>\"\",5,0)","v":5},{"$f":"BF7+BG7","v":55},null,null,{"$f":"IF(ISNUMBER(BJ7),(VLOOKUP(BJ7,$BO$6:$BP$50,2)),0)","v":0},{"$f":"IF(BJ7<>\"\",5,0)","v":0},{"$f":"BK7+BL7","v":0},null,2,80,{"$f":"IF($F7=8,1,0)","v":0},0,0,0,1,0,0,0]
[{"$f":"IF(E8<E7,BO8,A7)","v":3},"Grøndalen","Eira Marie","Ljan",{"$f":"IF(F8<=4,Q8,(Q8-SUM(SMALL(R8:Y8,{1;2;3;4}))))","v":345},{"$f":"(IF(AC8=5,1,0)+IF(AH8=5,1,0)+IF(AM8=5,1,0)+IF(AR8=5,1,0)+IF(AW8=5,1,0)+IF(BB8=5,1,0)+IF(BG8=5,1,0)+IF(BL8=5,1,0))","v":7},null,{"$f":"IF(AA8=\"\",\"\",AA8)","v":2},{"$f":"IF(AF8=\"\",\"\",AF8)","v":2},{"$f":"IF(AK8=\"\",\"\",AK8)","v":8},{"$f":"IF(AP8=\"\",\"\",AP8)","v":5},{"$f":"IF(AU8=\"\",\"\",AU8)","v":13},{"$f":"IF(AZ8=\"\",\"\",AZ8)","v":4},{"$f":"IF(BE8=\"\",\"\",BE8)","v":1},{"$f":"IF(BJ8=\"\",\"\",BJ8)","v":""},null,{"$f":"AD8+AI8+AN8+AS8+AX8+BC8+BH8","v":442},{"$f":"IF($F8>=5,IF(AB8=\"\",\"\",AB8),\"\")","v":80},{"$f":"IF($F8>=5,IF(AG8=\"\",\"\",AG8),\"\")","v":80},{"$f":"IF($F8>=5,IF(AL8=\"\",\"\",AL8),\"\")","v":32},{"$f":"IF($F8>=5,IF(AQ8=\"\",\"\",AQ8),\"\")","v":45},{"$f":"IF($F8>=5,IF(AV8=\"\",\"\",AV8),\"\")","v":20},{"$f":"IF($F8>=5,IF(BA8=\"\",\"\",BA8),\"\")","v":50},{"$f":"IF($F8>=5,IF(BF8=\"\",\"\",BF8),\"\")","v":100},{"$f":"IF($F8>=5,IF(BK8=\"\",\"\",BK8),\"\")","v":0},null,2,{"$f":"IF(ISNUMBER(AA8),(VLOOKUP(AA8,$BO$6:$BP$50,2)),0)","v":80},{"$f":"IF(AA8<>\"\",5,0)","v":5},{"$f":"AB8+AC8","v":85},null,2,{"$f":"IF(ISNUMBER(AF8),(VLOOKUP(AF8,$BO$6:$BP$50,2)),0)","v":80},{"$f":"IF(AF8<>\"\",5,0)","v":5},{"$f":"AG8+AH8","v":85},null,8,{"$f":"IF(ISNUMBER(AK8),(VLOOKUP(AK8,$BO$6:$BP$50,2)),0)","v":32},{"$f":"IF(AK8<>\"\",5,0)","v":5},{"$f":"AL8+AM8","v":37},null,5,{"$f":"IF(ISNUMBER(AP8),(VLOOKUP(AP8,$BO$6:$BP$50,2)),0)","v":45},{"$f":"IF(AP8<>\"\",5,0)","v":5},{"$f":"AQ8+AR8","v":50},null,13,{"$f":"IF(ISNUMBER(AU8),(VLOOKUP(AU8,$BO$6:$BP$50,2)),0)","v":20},{"$f":"IF(AU8<>\"\",5,0)","v":5},{"$f":"AV8+AW8","v":25},null,4,{"$f":"IF(ISNUMBER(AZ8),(VLOOKUP(AZ8,$BO$6:$BP$50,2)),0)","v":50},{"$f":"IF(AZ8<>\"\",5,0)","v":5},{"$f":"BA8+BB8","v":55},null,1,{"$f":"IF(ISNUMBER(BE8),(VLOOKUP(BE8,$BO$6:$BP$50,2)),0)","v":100},{"$f":"IF(BE8<>\"\",5,0)","v":5},{"$f":"BF8+BG8","v":105},null,null,{"$f":"IF(ISNUMBER(BJ8),(VLOOKUP(BJ8,$BO$6:$BP$50,2)),0)","v":0},{"$f":"IF(BJ8<>\"\",5,0)","v":0},{"$f":"BK8+BL8","v":0},null,3,60,0,1,0,0,0,0,0,0]
[{"$f":"IF(E9<E8,BO9,A8)","v":4},"Schei","Julie Haakaas","IRS",{"$f":"IF(F9<=4,Q9,(Q9-SUM(SMALL(R9:Y9,{1;2;3;4}))))","v":325},{"$f":"(IF(AC9=5,1,0)+IF(AH9=5,1,0)+IF(AM9=5,1,0)+IF(AR9=5,1,0)+IF(AW9=5,1,0)+IF(BB9=5,1,0)+IF(BG9=5,1,0)+IF(BL9=5,1,0))","v":6},null,{"$f":"IF(AA9=\"\",\"\",AA9)","v":1},{"$f":"IF(AF9=\"\",\"\",AF9)","v":1},{"$f":"IF(AK9=\"\",\"\",AK9)","v":4},{"$f":"IF(AP9=\"\",\"\",AP9)","v":9},{"$f":"IF(AU9=\"\",\"\",AU9)","v":5},{"$f":"IF(AZ9=\"\",\"\",AZ9)","v":""},{"$f":"IF(BE9=\"\",\"\",BE9)","v":"dsq"},{"$f":"IF(BJ9=\"\",\"\",BJ9)","v":""},null,{"$f":"AD9+AI9+AN9+AS9+AX9+BC9+BH9","v":354},{"$f":"IF($F9>=5,IF(AB9=\"\",\"\",AB9),\"\")","v":100},{"$f":"IF($F9>=5,IF(AG9=\"\",\"\",AG9),\"\")","v":100},{"$f":"IF($F9>=5,IF(AL9=\"\",\"\",AL9),\"\")","v":50},{"$f":"IF($F9>=5,IF(AQ9=\"\",\"\",AQ9),\"\")","v":29},{"$f":"IF($F9>=5,IF(AV9=\"\",\"\",AV9),\"\")","v":45},{"$f":"IF($F9>=5,IF(BA9=\"\",\"\",BA9),\"\")","v":0},{"$f":"IF($F9>=5,IF(BF9=\"\",\"\",BF9),\"\")","v":0},{"$f":"IF($F9>=5,IF(BK9=\"\",\"\",BK9),\"\")","v":0},null,1,{"$f":"IF(ISNUMBER(AA9),(VLOOKUP(AA9,$BO$6:$BP$50,2)),0)","v":100},{"$f":"IF(AA9<>\"\",5,0)","v":5},{"$f":"AB9+AC9","v":105},null,1,{"$f":"IF(ISNUMBER(AF9),(VLOOKUP(AF9,$BO$6:$BP$50,2)),0)","v":100},{"$f":"IF(AF9<>\"\",5,0)","v":5},{"$f":"AG9+AH9","v":105},null,4,{"$f":"IF(ISNUMBER(AK9),(VLOOKUP(AK9,$BO$6:$BP$50,2)),0)","v":50},{"$f":"IF(AK9<>\"\",5,0)","v":5},{"$f":"AL9+AM9","v":55},null,9,{"$f":"IF(ISNUMBER(AP9),(VLOOKUP(AP9,$BO$6:$BP$50,2)),0)","v":29},{"$f":"IF(AP9<>\"\",5,0)","v":5},{"$f":"AQ9+AR9","v":34},null,5,{"$f":"IF(ISNUMBER(AU9),(VLOOKUP(AU9,$BO$6:$BP$50,2)),0)","v":45},{"$f":"IF(AU9<>\"\",5,0)","v":5},{"$f":"AV9+AW9","v":50},null,null,{"$f":"IF(ISNUMBER(AZ9),(VLOOKUP(AZ9,$BO$6:$BP$50,2)),0)","v":0},{"$f":"IF(AZ9<>\"\",5,0)","v":0},{"$f":"BA9+BB9","v":0},null,"dsq",{"$f":"IF(ISNUMBER(BE9),(VLOOKUP(BE9,$BO$6:$BP$50,2)),0)","v":0},{"$f":"IF(BE9<>\"\",5,0)","v":5},{"$f":"BF9+BG9","v":5},null,null,{"$f":"IF(ISNUMBER(BJ9),(VLOOKUP(BJ9,$BO$6:$BP$50,2)),0)","v":0},{"$f":"IF(BJ9<>\"\",5,0)","v":0},{"$f":"BK9+BL9","v":0},null,4,50,0,0,1,0,0,0,0,0]
[{"$f":"IF(E10<E9,BO10,A9)","v":5},"Elmenhorst-Larsen","Sina","Ready",{"$f":"IF(F10<=4,Q10,(Q10-SUM(SMALL(R10:Y10,{1;2;3;4}))))","v":280},{"$f":"(IF(AC10=5,1,0)+IF(AH10=5,1,0)+IF(AM10=5,1,0)+IF(AR10=5,1,0)+IF(AW10=5,1,0)+IF(BB10=5,1,0)+IF(BG10=5,1,0)+IF(BL10=5,1,0))","v":6},null,{"$f":"IF(AA10=\"\",\"\",AA10)","v":3},{"$f":"IF(AF10=\"\",\"\",AF10)","v":""},{"$f":"IF(AK10=\"\",\"\",AK10)","v":5},{"$f":"IF(AP10=\"\",\"\",AP10)","v":4},{"$f":"IF(AU10=\"\",\"\",AU10)","v":6},{"$f":"IF(AZ10=\"\",\"\",AZ10)","v":3},{"$f":"IF(BE10=\"\",\"\",BE10)","v":2},{"$f":"IF(BJ10=\"\",\"\",BJ10)","v":""},null,{"$f":"AD10+AI10+AN10+AS10+AX10+BC10+BH10","v":365},{"$f":"IF($F10>=5,IF(AB10=\"\",\"\",AB10),\"\")","v":60},{"$f":"IF($F10>=5,IF(AG10=\"\",\"\",AG10),\"\")","v":0},{"$f":"IF($F10>=5,IF(AL10=\"\",\"\",AL10),\"\")","v":45},{"$f":"IF($F10>=5,IF(AQ10=\"\",\"\",AQ10),\"\")","v":50},{"$f":"IF($F10>=5,IF(AV10=\"\",\"\",AV10),\"\")","v":40},{"$f":"IF($F10>=5,IF(BA10=\"\",\"\",BA10),\"\")","v":60},{"$f":"IF($F10>=5,IF(BF10=\"\",\"\",BF10),\"\")","v":80},{"$f":"IF($F10>=5,IF(BK10=\"\",\"\",BK10),\"\")","v":0},null,3,{"$f":"IF(ISNUMBER(AA10),(VLOOKUP(AA10,$BO$6:$BP$50,2)),0)","v":60},{"$f":"IF(AA10<>\"\",5,0)","v":5},{"$f":"AB10+AC10","v":65},null,null,{"$f":"IF(ISNUMBER(AF10),(VLOOKUP(AF10,$BO$6:$BP$50,2)),0)","v":0},{"$f":"IF(AF10<>\"\",5,0)","v":0},{"$f":"AG10+AH10","v":0},null,5,{"$f":"IF(ISNUMBER(AK10),(VLOOKUP(AK10,$BO$6:$BP$50,2)),0)","v":45},{"$f":"IF(AK10<>\"\",5,0)","v":5},{"$f":"AL10+AM10","v":50},null,4,{"$f":"IF(ISNUMBER(AP10),(VLOOKUP(AP10,$BO$6:$BP$50,2)),0)","v":50},{"$f":"IF(AP10<>\"\",5,0)","v":5},{"$f":"AQ10+AR10","v":55},null,6,{"$f":"IF(ISNUMBER(AU10),(VLOOKUP(AU10,$BO$6:$BP$50,2)),0)","v":40},{"$f":"IF(AU10<>\"\",5,0)","v":5},{"$f":"AV10+AW10","v":45},null,3,{"$f":"IF(ISNUMBER(AZ10),(VLOOKUP(AZ10,$BO$6:$BP$50,2)),0)","v":60},{"$f":"IF(AZ10<>\"\",5,0)","v":5},{"$f":"BA10+BB10","v":65},null,2,{"$f":"IF(ISNUMBER(BE10),(VLOOKUP(BE10,$BO$6:$BP$50,2)),0)","v":80},{"$f":"IF(BE10<>\"\",5,0)","v":5},{"$f":"BF10+BG10","v":85},null,null,{"$f":"IF(ISNUMBER(BJ10),(VLOOKUP(BJ10,$BO$6:$BP$50,2)),0)","v":0},{"$f":"IF(BJ10<>\"\",5,0)","v":0},{"$f":"BK10+BL10","v":0},null,5,45,0,0,1,0,0,0,0,0]
[{"$f":"IF(E11<E10,BO11,A10)","v":6},"Semmelmann","Ellisif Marie","Heming",{"$f":"IF(F11<=4,Q11,(Q11-SUM(SMALL(R11:Y11,{1;2;3;4}))))","v":260},{"$f":"(IF(AC11=5,1,0)+IF(AH11=5,1,0)+IF(AM11=5,1,0)+IF(AR11=5,1,0)+IF(AW11=5,1,0)+IF(BB11=5,1,0)+IF(BG11=5,1,0)+IF(BL11=5,1,0))","v":4},null,{"$f":"IF(AA11=\"\",\"\",AA11)","v":""},{"$f":"IF(AF11=\"\",\"\",AF11)","v":""},{"$f":"IF(AK11=\"\",\"\",AK11)","v":6},{"$f":"IF(AP11=\"\",\"\",AP11)","v":3},{"$f":"IF(AU11=\"\",\"\",AU11)","v":3},{"$f":"IF(AZ11=\"\",\"\",AZ11)","v":2},{"$f":"IF(BE11=\"\",\"\",BE11)","v":""},{"$f":"IF(BJ11=\"\",\"\",BJ11)","v":""},null,{"$f":"AD11+AI11+AN11+AS11+AX11+BC11+BH11","v":260},{"$f":"IF($F11>=5,IF(AB11=\"\",\"\",AB11),\"\")","v":""},{"$f":"IF($F11>=5,IF(AG11=\"\",\"\",AG11),\"\")","v":""},{"$f":"IF($F11>=5,IF(AL11=\"\",\"\",AL11),\"\")","v":""},{"$f":"IF($F11>=5,IF(AQ11=\"\",\"\",AQ11),\"\")","v":""},{"$f":"IF($F11>=5,IF(AV11=\"\",\"\",AV11),\"\")","v":""},{"$f":"IF($F11>=5,IF(BA11=\"\",\"\",BA11),\"\")","v":""},{"$f":"IF($F11>=5,IF(BF11=\"\",\"\",BF11),\"\")","v":""},{"$f":"IF($F11>=5,IF(BK11=\"\",\"\",BK11),\"\")","v":""},null,null,{"$f":"IF(ISNUMBER(AA11),(VLOOKUP(AA11,$BO$6:$BP$50,2)),0)","v":0},{"$f":"IF(AA11<>\"\",5,0)","v":0},{"$f":"AB11+AC11","v":0},null,null,{"$f":"IF(ISNUMBER(AF11),(VLOOKUP(AF11,$BO$6:$BP$50,2)),0)","v":0},{"$f":"IF(AF11<>\"\",5,0)","v":0},{"$f":"AG11+AH11","v":0},null,6,{"$f":"IF(ISNUMBER(AK11),(VLOOKUP(AK11,$BO$6:$BP$50,2)),0)","v":40},{"$f":"IF(AK11<>\"\",5,0)","v":5},{"$f":"AL11+AM11","v":45},null,3,{"$f":"IF(ISNUMBER(AP11),(VLOOKUP(AP11,$BO$6:$BP$50,2)),0)","v":60},{"$f":"IF(AP11<>\"\",5,0)","v":5},{"$f":"AQ11+AR11","v":65},null,3,{"$f":"IF(ISNUMBER(AU11),(VLOOKUP(AU11,$BO$6:$BP$50,2)),0)","v":60},{"$f":"IF(AU11<>\"\",5,0)","v":5},{"$f":"AV11+AW11","v":65},null,2,{"$f":"IF(ISNUMBER(AZ11),(VLOOKUP(AZ11,$BO$6:$BP$50,2)),0)","v":80},{"$f":"IF(AZ11<>\"\",5,0)","v":5},{"$f":"BA11+BB11","v":85},null,null,{"$f":"IF(ISNUMBER(BE11),(VLOOKUP(BE11,$BO$6:$BP$50,2)),0)","v":0},{"$f":"IF(BE11<>\"\",5,0)","v":0},{"$f":"BF11+BG11","v":0},null,null,{"$f":"IF(ISNUMBER(BJ11),(VLOOKUP(BJ11,$BO$6:$BP$50,2)),0)","v":0},{"$f":"IF(BJ11<>\"\",5,0)","v":0},{"$f":"BK11+BL11","v":0},null,6,40,0,0,0,0,1,0,0,0]
[{"$f":"IF(E12<E11,BO12,A11)","v":7},"Holter","Vilde Emilie","Ullensaker",{"$f":"IF(F12<=4,Q12,(Q12-SUM(SMALL(R12:Y12,{1;2;3;4}))))","v":176},{"$f":"(IF(AC12=5,1,0)+IF(AH12=5,1,0)+IF(AM12=5,1,0)+IF(AR12=5,1,0)+IF(AW12=5,1,0)+IF(BB12=5,1,0)+IF(BG12=5,1,0)+IF(BL12=5,1,0))","v":4},null,{"$f":"IF(AA12=\"\",\"\",AA12)","v":""},{"$f":"IF(AF12=\"\",\"\",AF12)","v":""},{"$f":"IF(AK12=\"\",\"\",AK12)","v":3},{"$f":"IF(AP12=\"\",\"\",AP12)","v":""},{"$f":"IF(AU12=\"\",\"\",AU12)","v":7},{"$f":"IF(AZ12=\"\",\"\",AZ12)","v":6},{"$f":"IF(BE12=\"\",\"\",BE12)","v":13},{"$f":"IF(BJ12=\"\",\"\",BJ12)","v":""},null,{"$f":"AD12+AI12+AN12+AS12+AX12+BC12+BH12","v":176},{"$f":"IF($F12>=5,IF(AB12=\"\",\"\",AB12),\"\")","v":""},{"$f":"IF($F12>=5,IF(AG12=\"\",\"\",AG12),\"\")","v":""},{"$f":"IF($F12>=5,IF(AL12=\"\",\"\",AL12),\"\")","v":""},{"$f":"IF($F12>=5,IF(AQ12=\"\",\"\",AQ12),\"\")","v":""},{"$f":"IF($F12>=5,IF(AV12=\"\",\"\",AV12),\"\")","v":""},{"$f":"IF($F12>=5,IF(BA12=\"\",\"\",BA12),\"\")","v":""},{"$f":"IF($F12>=5,IF(BF12=\"\",\"\",BF12),\"\")","v":""},{"$f":"IF($F12>=5,IF(BK12=\"\",\"\",BK12),\"\")","v":""},null,null,{"$f":"IF(ISNUMBER(AA12),(VLOOKUP(AA12,$BO$6:$BP$50,2)),0)","v":0},{"$f":"IF(AA12<>\"\",5,0)","v":0},{"$f":"AB12+AC12","v":0},null,null,{"$f":"IF(ISNUMBER(AF12),(VLOOKUP(AF12,$BO$6:$BP$50,2)),0)","v":0},{"$f":"IF(AF12<>\"\",5,0)","v":0},{"$f":"AG12+AH12","v":0},null,3,{"$f":"IF(ISNUMBER(AK12),(VLOOKUP(AK12,$BO$6:$BP$50,2)),0)","v":60},{"$f":"IF(AK12<>\"\",5,0)","v":5},{"$f":"AL12+AM12","v":65},null,null,{"$f":"IF(ISNUMBER(AP12),(VLOOKUP(AP12,$BO$6:$BP$50,2)),0)","v":0},{"$f":"IF(AP12<>\"\",5,0)","v":0},{"$f":"AQ12+AR12","v":0},null,7,{"$f":"IF(ISNUMBER(AU12),(VLOOKUP(AU12,$BO$6:$BP$50,2)),0)","v":36},{"$f":"IF(AU12<>\"\",5,0)","v":5},{"$f":"AV12+AW12","v":41},null,6,{"$f":"IF(ISNUMBER(AZ12),(VLOOKUP(AZ12,$BO$6:$BP$50,2)),0)","v":40},{"$f":"IF(AZ12<>\"\",5,0)","v":5},{"$f":"BA12+BB12","v":45},null,13,{"$f":"IF(ISNUMBER(BE12),(VLOOKUP(BE12,$BO$6:$BP$50,2)),0)","v":20},{"$f":"IF(BE12<>\"\",5,0)","v":5},{"$f":"BF12+BG12","v":25},null,null,{"$f":"IF(ISNUMBER(BJ12),(VLOOKUP(BJ12,$BO$6:$BP$50,2)),0)","v":0},{"$f":"IF(BJ12<>\"\",5,0)","v":0},{"$f":"BK12+BL12","v":0},null,7,36,0,0,0,0,1,0,0,0]
[{"$f":"IF(E13<E12,BO13,A12)","v":8},"Heggelund","Hedda Ramstad","Ullensaker",{"$f":"IF(F13<=4,Q13,(Q13-SUM(SMALL(R13:Y13,{1;2;3;4}))))","v":169},{"$f":"(IF(AC13=5,1,0)+IF(AH13=5,1,0)+IF(AM13=5,1,0)+IF(AR13=5,1,0)+IF(AW13=5,1,0)+IF(BB13=5,1,0)+IF(BG13=5,1,0)+IF(BL13=5,1,0))","v":5},null,{"$f":"IF(AA13=\"\",\"\",AA13)","v":5},{"$f":"IF(AF13=\"\",\"\",AF13)","v":"dsq"},{"$f":"IF(AK13=\"\",\"\",AK13)","v":""},{"$f":"IF(AP13=\"\",\"\",AP13)","v":""},{"$f":"IF(AU13=\"\",\"\",AU13)","v":17},{"$f":"IF(AZ13=\"\",\"\",AZ13)","v":5},{"$f":"IF(BE13=\"\",\"\",BE13)","v":6},{"$f":"IF(BJ13=\"\",\"\",BJ13)","v":""},null,{"$f":"AD13+AI13+AN13+AS13+AX13+BC13+BH13","v":169},{"$f":"IF($F13>=5,IF(AB13=\"\",\"\",AB13),\"\")","v":45},{"$f":"IF($F13>=5,IF(AG13=\"\",\"\",AG13),\"\")","v":0},{"$f":"IF($F13>=5,IF(AL13=\"\",\"\",AL13),\"\")","v":0},{"$f":"IF($F13>=5,IF(AQ13=\"\",\"\",AQ13),\"\")","v":0},{"$f":"IF($F13>=5,IF(AV13=\"\",\"\",AV13),\"\")","v":14},{"$f":"IF($F13>=5,IF(BA13=\"\",\"\",BA13),\"\")","v":45},{"$f":"IF($F13>=5,IF(BF13=\"\",\"\",BF13),\"\")","v":40},{"$f":"IF($F13>=5,IF(BK13=\"\",\"\",BK13),\"\")","v":0},null,5,{"$f":"IF(ISNUMBER(AA13),(VLOOKUP(AA13,$BO$6:$BP$50,2)),0)","v":45},{"$f":"IF(AA13<>\"\",5,0)","v":5},{"$f":"AB13+AC13","v":50},null,"dsq",{"$f":"IF(ISNUMBER(AF13),(VLOOKUP(AF13,$BO$6:$BP$50,2)),0)","v":0},{"$f":"IF(AF13<>\"\",5,0)","v":5},{"$f":"AG13+AH13","v":5},null,null,{"$f":"IF(ISNUMBER(AK13),(VLOOKUP(AK13,$BO$6:$BP$50,2)),0)","v":0},{"$f":"IF(AK13<>\"\",5,0)","v":0},{"$f":"AL13+AM13","v":0},null,null,{"$f":"IF(ISNUMBER(AP13),(VLOOKUP(AP13,$BO$6:$BP$50,2)),0)","v":0},{"$f":"IF(AP13<>\"\",5,0)","v":0},{"$f":"AQ13+AR13","v":0},null,17,{"$f":"IF(ISNUMBER(AU13),(VLOOKUP(AU13,$BO$6:$BP$50,2)),0)","v":14},{"$f":"IF(AU13<>\"\",5,0)","v":5},{"$f":"AV13+AW13","v":19},null,5,{"$f":"IF(ISNUMBER(AZ13),(VLOOKUP(AZ13,$BO$6:$BP$50,2)),0)","v":45},{"$f":"IF(AZ13<>\"\",5,0)","v":5},{"$f":"BA13+BB13","v":50},null,6,{"$f":"IF(ISNUMBER(BE13),(VLOOKUP(BE13,$BO$6:$BP$50,2)),0)","v":40},{"$f":"IF(BE13<>\"\",5,0)","v":5},{"$f":"BF13+BG13","v":45},null,null,{"$f":"IF(ISNUMBER(BJ13),(VLOOKUP(BJ13,$BO$6:$BP$50,2)),0)","v":0},{"$f":"IF(BJ13<>\"\",5,0)","v":0},{"$f":"BK13+BL13","v":0},null,8,32,0,0,0,1,0,0,0,0]
[{"$f":"IF(E14<E13,BO14,A13)","v":9},"Bjørland","Vilde","Heming",{"$f":"IF(F14<=4,Q14,(Q14-SUM(SMALL(R14:Y14,{1;2;3;4}))))","v":149},{"$f":"(IF(AC14=5,1,0)+IF(AH14=5,1,0)+IF(AM14=5,1,0)+IF(AR14=5,1,0)+IF(AW14=5,1,0)+IF(BB14=5,1,0)+IF(BG14=5,1,0)+IF(BL14=5,1,0))","v":4},null,{"$f":"IF(AA14=\"\",\"\",AA14)","v":4},{"$f":"IF(AF14=\"\",\"\",AF14)","v":4},{"$f":"IF(AK14=\"\",\"\",AK14)","v":""},{"$f":"IF(AP14=\"\",\"\",AP14)","v":""},{"$f":"IF(AU14=\"\",\"\",AU14)","v":24},{"$f":"IF(AZ14=\"\",\"\",AZ14)","v":12},{"$f":"IF(BE14=\"\",\"\",BE14)","v":""},{"$f":"IF(BJ14=\"\",\"\",BJ14)","v":""},null,{"$f":"AD14+AI14+AN14+AS14+AX14+BC14+BH14","v":149},{"$f":"IF($F14>=5,IF(AB14=\"\",\"\",AB14),\"\")","v":""},{"$f":"IF($F14>=5,IF(AG14=\"\",\"\",AG14),\"\")","v":""},{"$f":"IF($F14>=5,IF(AL14=\"\",\"\",AL14),\"\")","v":""},{"$f":"IF($F14>=5,IF(AQ14=\"\",\"\",AQ14),\"\")","v":""},{"$f":"IF($F14>=5,IF(AV14=\"\",\"\",AV14),\"\")","v":""},{"$f":"IF($F14>=5,IF(BA14=\"\",\"\",BA14),\"\")","v":""},{"$f":"IF($F14>=5,IF(BF14=\"\",\"\",BF14),\"\")","v":""},{"$f":"IF($F14>=5,IF(BK14=\"\",\"\",BK14),\"\")","v":""},null,4,{"$f":"IF(ISNUMBER(AA14),(VLOOKUP(AA14,$BO$6:$BP$50,2)),0)","v":50},{"$f":"IF(AA14<>\"\",5,0)","v":5},{"$f":"AB14+AC14","v":55},null,4,{"$f":"IF(ISNUMBER(AF14),(VLOOKUP(AF14,$BO$6:$BP$50,2)),0)","v":50},{"$f":"IF(AF14<>\"\",5,0)","v":5},{"$f":"AG14+AH14","v":55},null,null,{"$f":"IF(ISNUMBER(AK14),(VLOOKUP(AK14,$BO$6:$BP$50,2)),0)","v":0},{"$f":"IF(AK14<>\"\",5,0)","v":0},{"$f":"AL14+AM14","v":0},null,null,{"$f":"IF(ISNUMBER(AP14),(VLOOKUP(AP14,$BO$6:$BP$50,2)),0)","v":0},{"$f":"IF(AP14<>\"\",5,0)","v":0},{"$f":"AQ14+AR14","v":0},null,24,{"$f":"IF(ISNUMBER(AU14),(VLOOKUP(AU14,$BO$6:$BP$50,2)),0)","v":7},{"$f":"IF(AU14<>\"\",5,0)","v":5},{"$f":"AV14+AW14","v":12},null,12,{"$f":"IF(ISNUMBER(AZ14),(VLOOKUP(AZ14,$BO$6:$BP$50,2)),0)","v":22},{"$f":"IF(AZ14<>\"\",5,0)","v":5},{"$f":"BA14+BB14","v":27},null,null,{"$f":"IF(ISNUMBER(BE14),(VLOOKUP(BE14,$BO$6:$BP$50,2)),0)","v":0},{"$f":"IF(BE14<>\"\",5,0)","v":0},{"$f":"BF14+BG14","v":0},null,null,{"$f":"IF(ISNUMBER(BJ14),(VLOOKUP(BJ14,$BO$6:$BP$50,2)),0)","v":0},{"$f":"IF(BJ14<>\"\",5,0)","v":0},{"$f":"BK14+BL14","v":0},null,9,29,0,0,0,0,1,0,0,0]
[{"$f":"IF(E15<E14,BO15,A14)","v":10},"Riiber","Kristiane","Heming",{"$f":"IF(F15<=4,Q15,(Q15-SUM(SMALL(R15:Y15,{1;2;3;4}))))","v":144},{"$f":"(IF(AC15=5,1,0)+IF(AH15=5,1,0)+IF(AM15=5,1,0)+IF(AR15=5,1,0)+IF(AW15=5,1,0)+IF(BB15=5,1,0)+IF(BG15=5,1,0)+IF(BL15=5,1,0))","v":5},null,{"$f":"IF(AA15=\"\",\"\",AA15)","v":""},{"$f":"IF(AF15=\"\",\"\",AF15)","v":""},{"$f":"IF(AK15=\"\",\"\",AK15)","v":10},{"$f":"IF(AP15=\"\",\"\",AP15)","v":8},{"$f":"IF(AU15=\"\",\"\",AU15)","v":9},{"$f":"IF(AZ15=\"\",\"\",AZ15)","v":9},{"$f":"IF(BE15=\"\",\"\",BE15)","v":9},{"$f":"IF(BJ15=\"\",\"\",BJ15)","v":""},null,{"$f":"AD15+AI15+AN15+AS15+AX15+BC15+BH15","v":170},{"$f":"IF($F15>=5,IF(AB15=\"\",\"\",AB15),\"\")","v":0},{"$f":"IF($F15>=5,IF(AG15=\"\",\"\",AG15),\"\")","v":0},{"$f":"IF($F15>=5,IF(AL15=\"\",\"\",AL15),\"\")","v":26},{"$f":"IF($F15>=5,IF(AQ15=\"\",\"\",AQ15),\"\")","v":32},{"$f":"IF($F15>=5,IF(AV15=\"\",\"\",AV15),\"\")","v":29},{"$f":"IF($F15>=5,IF(BA15=\"\",\"\",BA15),\"\")","v":29},{"$f":"IF($F15>=5,IF(BF15=\"\",\"\",BF15),\"\")","v":29},{"$f":"IF($F15>=5,IF(BK15=\"\",\"\",BK15),\"\")","v":0},null,null,{"$f":"IF(ISNUMBER(AA15),(VLOOKUP(AA15,$BO$6:$BP$50,2)),0)","v":0},{"$f":"IF(AA15<>\"\",5,0)","v":0},{"$f":"AB15+AC15","v":0},null,null,{"$f":"IF(ISNUMBER(AF15),(VLOOKUP(AF15,$BO$6:$BP$50,2)),0)","v":0},{"$f":"IF(AF15<>\"\",5,0)","v":0},{"$f":"AG15+AH15","v":0},null,10,{"$f":"IF(ISNUMBER(AK15),(VLOOKUP(AK15,$BO$6:$BP$50,2)),0)","v":26},{"$f":"IF(AK15<>\"\",5,0)","v":5},{"$f":"AL15+AM15","v":31},null,8,{"$f":"IF(ISNUMBER(AP15),(VLOOKUP(AP15,$BO$6:$BP$50,2)),0)","v":32},{"$f":"IF(AP15<>\"\",5,0)","v":5},{"$f":"AQ15+AR15","v":37},null,9,{"$f":"IF(ISNUMBER(AU15),(VLOOKUP(AU15,$BO$6:$BP$50,2)),0)","v":29},{"$f":"IF(AU15<>\"\",5,0)","v":5},{"$f":"AV15+AW15","v":34},null,9,{"$f":"IF(ISNUMBER(AZ15),(VLOOKUP(AZ15,$BO$6:$BP$50,2)),0)","v":29},{"$f":"IF(AZ15<>\"\",5,0)","v":5},{"$f":"BA15+BB15","v":34},null,9,{"$f":"IF(ISNUMBER(BE15),(VLOOKUP(BE15,$BO$6:$BP$50,2)),0)","v":29},{"$f":"IF(BE15<>\"\",5,0)","v":5},{"$f":"BF15+BG15","v":34},null,null,{"$f":"IF(ISNUMBER(BJ15),(VLOOKUP(BJ15,$BO$6:$BP$50,2)),0)","v":0},{"$f":"IF(BJ15<>\"\",5,0)","v":0},{"$f":"BK15+BL15","v":0},null,10,26,0,0,0,1,0,0,0,0]
[{"$f":"IF(E16<E15,BO16,A15)","v":11},"Ingebrigtsen","Nora Haugmoen","Heming",{"$f":"IF(F16<=4,Q16,(Q16-SUM(SMALL(R16:Y16,{1;2;3;4}))))","v":121},{"$f":"(IF(AC16=5,1,0)+IF(AH16=5,1,0)+IF(AM16=5,1,0)+IF(AR16=5,1,0)+IF(AW16=5,1,0)+IF(BB16=5,1,0)+IF(BG16=5,1,0)+IF(BL16=5,1,0))","v":4},null,{"$f":"IF(AA16=\"\",\"\",AA16)","v":""},{"$f":"IF(AF16=\"\",\"\",AF16)","v":""},{"$f":"IF(AK16=\"\",\"\",AK16)","v":9},{"$f":"IF(AP16=\"\",\"\",AP16)","v":6},{"$f":"IF(AU16=\"\",\"\",AU16)","v":"dsq"},{"$f":"IF(AZ16=\"\",\"\",AZ16)","v":""},{"$f":"IF(BE16=\"\",\"\",BE16)","v":8},{"$f":"IF(BJ16=\"\",\"\",BJ16)","v":""},null,{"$f":"AD16+AI16+AN16+AS16+AX16+BC16+BH16","v":121},{"$f":"IF($F16>=5,IF(AB16=\"\",\"\",AB16),\"\")","v":""},{"$f":"IF($F16>=5,IF(AG16=\"\",\"\",AG16),\"\")","v":""},{"$f":"IF($F16>=5,IF(AL16=\"\",\"\",AL16),\"\")","v":""},{"$f":"IF($F16>=5,IF(AQ16=\"\",\"\",AQ16),\"\")","v":""},{"$f":"IF($F16>=5,IF(AV16=\"\",\"\",AV16),\"\")","v":""},{"$f":"IF($F16>=5,IF(BA16=\"\",\"\",BA16),\"\")","v":""},{"$f":"IF($F16>=5,IF(BF16=\"\",\"\",BF16),\"\")","v":""},{"$f":"IF($F16>=5,IF(BK16=\"\",\"\",BK16),\"\")","v":""},null,null,{"$f":"IF(ISNUMBER(AA16),(VLOOKUP(AA16,$BO$6:$BP$50,2)),0)","v":0},{"$f":"IF(AA16<>\"\",5,0)","v":0},{"$f":"AB16+AC16","v":0},null,null,{"$f":"IF(ISNUMBER(AF16),(VLOOKUP(AF16,$BO$6:$BP$50,2)),0)","v":0},{"$f":"IF(AF16<>\"\",5,0)","v":0},{"$f":"AG16+AH16","v":0},null,9,{"$f":"IF(ISNUMBER(AK16),(VLOOKUP(AK16,$BO$6:$BP$50,2)),0)","v":29},{"$f":"IF(AK16<>\"\",5,0)","v":5},{"$f":"AL16+AM16","v":34},null,6,{"$f":"IF(ISNUMBER(AP16),(VLOOKUP(AP16,$BO$6:$BP$50,2)),0)","v":40},{"$f":"IF(AP16<>\"\",5,0)","v":5},{"$f":"AQ16+AR16","v":45},null,"dsq",{"$f":"IF(ISNUMBER(AU16),(VLOOKUP(AU16,$BO$6:$BP$50,2)),0)","v":0},{"$f":"IF(AU16<>\"\",5,0)","v":5},{"$f":"AV16+AW16","v":5},null,null,{"$f":"IF(ISNUMBER(AZ16),(VLOOKUP(AZ16,$BO$6:$BP$50,2)),0)","v":0},{"$f":"IF(AZ16<>\"\",5,0)","v":0},{"$f":"BA16+BB16","v":0},null,8,{"$f":"IF(ISNUMBER(BE16),(VLOOKUP(BE16,$BO$6:$BP$50,2)),0)","v":32},{"$f":"IF(BE16<>\"\",5,0)","v":5},{"$f":"BF16+BG16","v":37},null,null,{"$f":"IF(ISNUMBER(BJ16),(VLOOKUP(BJ16,$BO$6:$BP$50,2)),0)","v":0},{"$f":"IF(BJ16<>\"\",5,0)","v":0},{"$f":"BK16+BL16","v":0},null,11,24,0,0,0,0,1,0,0,0]
[{"$f":"IF(E17<E16,BO17,A16)","v":12},"Borge-Andersen","Felin","Heming",{"$f":"IF(F17<=4,Q17,(Q17-SUM(SMALL(R17:Y17,{1;2;3;4}))))","v":114},{"$f":"(IF(AC17=5,1,0)+IF(AH17=5,1,0)+IF(AM17=5,1,0)+IF(AR17=5,1,0)+IF(AW17=5,1,0)+IF(BB17=5,1,0)+IF(BG17=5,1,0)+IF(BL17=5,1,0))","v":4},null,{"$f":"IF(AA17=\"\",\"\",AA17)","v":""},{"$f":"IF(AF17=\"\",\"\",AF17)","v":""},{"$f":"IF(AK17=\"\",\"\",AK17)","v":7},{"$f":"IF(AP17=\"\",\"\",AP17)","v":7},{"$f":"IF(AU17=\"\",\"\",AU17)","v":12},{"$f":"IF(AZ17=\"\",\"\",AZ17)","v":""},{"$f":"IF(BE17=\"\",\"\",BE17)","v":"dsq"},{"$f":"IF(BJ17=\"\",\"\",BJ17)","v":""},null,{"$f":"AD17+AI17+AN17+AS17+AX17+BC17+BH17","v":114},{"$f":"IF($F17>=5,IF(AB17=\"\",\"\",AB17),\"\")","v":""},{"$f":"IF($F17>=5,IF(AG17=\"\",\"\",AG17),\"\")","v":""},{"$f":"IF($F17>=5,IF(AL17=\"\",\"\",AL17),\"\")","v":""},{"$f":"IF($F17>=5,IF(AQ17=\"\",\"\",AQ17),\"\")","v":""},{"$f":"IF($F17>=5,IF(AV17=\"\",\"\",AV17),\"\")","v":""},{"$f":"IF($F17>=5,IF(BA17=\"\",\"\",BA17),\"\")","v":""},{"$f":"IF($F17>=5,IF(BF17=\"\",\"\",BF17),\"\")","v":""},{"$f":"IF($F17>=5,IF(BK17=\"\",\"\",BK17),\"\")","v":""},null,null,{"$f":"IF(ISNUMBER(AA17),(VLOOKUP(AA17,$BO$6:$BP$50,2)),0)","v":0},{"$f":"IF(AA17<>\"\",5,0)","v":0},{"$f":"AB17+AC17","v":0},null,null,{"$f":"IF(ISNUMBER(AF17),(VLOOKUP(AF17,$BO$6:$BP$50,2)),0)","v":0},{"$f":"IF(AF17<>\"\",5,0)","v":0},{"$f":"AG17+AH17","v":0},null,7,{"$f":"IF(ISNUMBER(AK17),(VLOOKUP(AK17,$BO$6:$BP$50,2)),0)","v":36},{"$f":"IF(AK17<>\"\",5,0)","v":5},{"$f":"AL17+AM17","v":41},null,7,{"$f":"IF(ISNUMBER(AP17),(VLOOKUP(AP17,$BO$6:$BP$50,2)),0)","v":36},{"$f":"IF(AP17<>\"\",5,0)","v":5},{"$f":"AQ17+AR17","v":41},null,12,{"$f":"IF(ISNUMBER(AU17),(VLOOKUP(AU17,$BO$6:$BP$50,2)),0)","v":22},{"$f":"IF(AU17<>\"\",5,0)","v":5},{"$f":"AV17+AW17","v":27},null,null,{"$f":"IF(ISNUMBER(AZ17),(VLOOKUP(AZ17,$BO$6:$BP$50,2)),0)","v":0},{"$f":"IF(AZ17<>\"\",5,0)","v":0},{"$f":"BA17+BB17","v":0},null,"dsq",{"$f":"IF(ISNUMBER(BE17),(VLOOKUP(BE17,$BO$6:$BP$50,2)),0)","v":0},{"$f":"IF(BE17<>\"\",5,0)","v":5},{"$f":"BF17+BG17","v":5},null,null,{"$f":"IF(ISNUMBER(BJ17),(VLOOKUP(BJ17,$BO$6:$BP$50,2)),0)","v":0},{"$f":"IF(BJ17<>\"\",5,0)","v":0},{"$f":"BK17+BL17","v":0},null,12,22,0,0,0,0,1,0,0,0]
[{"$f":"IF(E18<E17,BO18,A17)","v":13},"Ardem","Emilie Caroline","Kjelsås",{"$f":"IF(F18<=4,Q18,(Q18-SUM(SMALL(R18:Y18,{1;2;3;4}))))","v":111},{"$f":"(IF(AC18=5,1,0)+IF(AH18=5,1,0)+IF(AM18=5,1,0)+IF(AR18=5,1,0)+IF(AW18=5,1,0)+IF(BB18=5,1,0)+IF(BG18=5,1,0)+IF(BL18=5,1,0))","v":5},null,{"$f":"IF(AA18=\"\",\"\",AA18)","v":""},{"$f":"IF(AF18=\"\",\"\",AF18)","v":""},{"$f":"IF(AK18=\"\",\"\",AK18)","v":15},{"$f":"IF(AP18=\"\",\"\",AP18)","v":12},{"$f":"IF(AU18=\"\",\"\",AU18)","v":19},{"$f":"IF(AZ18=\"\",\"\",AZ18)","v":7},{"$f":"IF(BE18=\"\",\"\",BE18)","v":"dsq"},{"$f":"IF(BJ18=\"\",\"\",BJ18)","v":""},null,{"$f":"AD18+AI18+AN18+AS18+AX18+BC18+BH18","v":111},{"$f":"IF($F18>=5,IF(AB18=\"\",\"\",AB18),\"\")","v":0},{"$f":"IF($F18>=5,IF(AG18=\"\",\"\",AG18),\"\")","v":0},{"$f":"IF($F18>=5,IF(AL18=\"\",\"\",AL18),\"\")","v":16},{"$f":"IF($F18>=5,IF(AQ18=\"\",\"\",AQ18),\"\")","v":22},{"$f":"IF($F18>=5,IF(AV18=\"\",\"\",AV18),\"\")","v":12},{"$f":"IF($F18>=5,IF(BA18=\"\",\"\",BA18),\"\")","v":36},{"$f":"IF($F18>=5,IF(BF18=\"\",\"\",BF18),\"\")","v":0},{"$f":"IF($F18>=5,IF(BK18=\"\",\"\",BK18),\"\")","v":0},null,null,{"$f":"IF(ISNUMBER(AA18),(VLOOKUP(AA18,$BO$6:$BP$50,2)),0)","v":0},{"$f":"IF(AA18<>\"\",5,0)","v":0},{"$f":"AB18+AC18","v":0},null,null,{"$f":"IF(ISNUMBER(AF18),(VLOOKUP(AF18,$BO$6:$BP$50,2)),0)","v":0},{"$f":"IF(AF18<>\"\",5,0)","v":0},{"$f":"AG18+AH18","v":0},null,15,{"$f":"IF(ISNUMBER(AK18),(VLOOKUP(AK18,$BO$6:$BP$50,2)),0)","v":16},{"$f":"IF(AK18<>\"\",5,0)","v":5},{"$f":"AL18+AM18","v":21},null,12,{"$f":"IF(ISNUMBER(AP18),(VLOOKUP(AP18,$BO$6:$BP$50,2)),0)","v":22},{"$f":"IF(AP18<>\"\",5,0)","v":5},{"$f":"AQ18+AR18","v":27},null,19,{"$f":"IF(ISNUMBER(AU18),(VLOOKUP(AU18,$BO$6:$BP$50,2)),0)","v":12},{"$f":"IF(AU18<>\"\",5,0)","v":5},{"$f":"AV18+AW18","v":17},null,7,{"$f":"IF(ISNUMBER(AZ18),(VLOOKUP(AZ18,$BO$6:$BP$50,2)),0)","v":36},{"$f":"IF(AZ18<>\"\",5,0)","v":5},{"$f":"BA18+BB18","v":41},null,"dsq",{"$f":"IF(ISNUMBER(BE18),(VLOOKUP(BE18,$BO$6:$BP$50,2)),0)","v":0},{"$f":"IF(BE18<>\"\",5,0)","v":5},{"$f":"BF18+BG18","v":5},null,null,{"$f":"IF(ISNUMBER(BJ18),(VLOOKUP(BJ18,$BO$6:$BP$50,2)),0)","v":0},{"$f":"IF(BJ18<>\"\",5,0)","v":0},{"$f":"BK18+BL18","v":0},null,13,20,0,{"$f":"IF($F17=7,1,0)","v":0},{"$f":"IF($F17=6,1,0)","v":0},{"$f":"IF($F17=5,1,0)","v":0},{"$f":"IF($F17=4,1,0)","v":1},{"$f":"IF($F17=3,1,0)","v":0},{"$f":"IF($F17=2,1,0)","v":0},{"$f":"IF($F17=1,1,0)","v":0}]
[{"$f":"IF(E19<E18,BO19,A18)","v":14},"Wilhelmsen","Victoria Pandher","Ready",{"$f":"IF(F19<=4,Q19,(Q19-SUM(SMALL(R19:Y19,{1;2;3;4}))))","v":109},{"$f":"(IF(AC19=5,1,0)+IF(AH19=5,1,0)+IF(AM19=5,1,0)+IF(AR19=5,1,0)+IF(AW19=5,1,0)+IF(BB19=5,1,0)+IF(BG19=5,1,0)+IF(BL19=5,1,0))","v":5},null,{"$f":"IF(AA19=\"\",\"\",AA19)","v":""},{"$f":"IF(AF19=\"\",\"\",AF19)","v":""},{"$f":"IF(AK19=\"\",\"\",AK19)","v":"dnf"},{"$f":"IF(AP19=\"\",\"\",AP19)","v":14},{"$f":"IF(AU19=\"\",\"\",AU19)","v":21},{"$f":"IF(AZ19=\"\",\"\",AZ19)","v":8},{"$f":"IF(BE19=\"\",\"\",BE19)","v":11},{"$f":"IF(BJ19=\"\",\"\",BJ19)","v":""},null,{"$f":"AD19+AI19+AN19+AS19+AX19+BC19+BH19","v":109},{"$f":"IF($F19>=5,IF(AB19=\"\",\"\",AB19),\"\")","v":0},{"$f":"IF($F19>=5,IF(AG19=\"\",\"\",AG19),\"\")","v":0},{"$f":"IF($F19>=5,IF(AL19=\"\",\"\",AL19),\"\")","v":0},{"$f":"IF($F19>=5,IF(AQ19=\"\",\"\",AQ19),\"\")","v":18},{"$f":"IF($F19>=5,IF(AV19=\"\",\"\",AV19),\"\")","v":10},{"$f":"IF($F19>=5,IF(BA19=\"\",\"\",BA19),\"\")","v":32},{"$f":"IF($F19>=5,IF(BF19=\"\",\"\",BF19),\"\")","v":24},{"$f":"IF($F19>=5,IF(BK19=\"\",\"\",BK19),\"\")","v":0},null,null,{"$f":"IF(ISNUMBER(AA19),(VLOOKUP(AA19,$BO$6:$BP$50,2)),0)","v":0},{"$f":"IF(AA19<>\"\",5,0)","v":0},{"$f":"AB19+AC19","v":0},null,null,{"$f":"IF(ISNUMBER(AF19),(VLOOKUP(AF19,$BO$6:$BP$50,2)),0)","v":0},{"$f":"IF(AF19<>\"\",5,0)","v":0},{"$f":"AG19+AH19","v":0},null,"dnf",{"$f":"IF(ISNUMBER(AK19),(VLOOKUP(AK19,$BO$6:$BP$50,2)),0)","v":0},{"$f":"IF(AK19<>\"\",5,0)","v":5},{"$f":"AL19+AM19","v":5},null,14,{"$f":"IF(ISNUMBER(AP19),(VLOOKUP(AP19,$BO$6:$BP$50,2)),0)","v":18},{"$f":"IF(AP19<>\"\",5,0)","v":5},{"$f":"AQ19+AR19","v":23},null,21,{"$f":"IF(ISNUMBER(AU19),(VLOOKUP(AU19,$BO$6:$BP$50,2)),0)","v":10},{"$f":"IF(AU19<>\"\",5,0)","v":5},{"$f":"AV19+AW19","v":15},null,8,{"$f":"IF(ISNUMBER(AZ19),(VLOOKUP(AZ19,$BO$6:$BP$50,2)),0)","v":32},{"$f":"IF(AZ19<>\"\",5,0)","v":5},{"$f":"BA19+BB19","v":37},null,11,{"$f":"IF(ISNUMBER(BE19),(VLOOKUP(BE19,$BO$6:$BP$50,2)),0)","v":24},{"$f":"IF(BE19<>\"\",5,0)","v":5},{"$f":"BF19+BG19","v":29},null,null,{"$f":"IF(ISNUMBER(BJ19),(VLOOKUP(BJ19,$BO$6:$BP$50,2)),0)","v":0},{"$f":"IF(BJ19<>\"\",5,0)","v":0},{"$f":"BK19+BL19","v":0},null,14,18,0,{"$f":"IF($F18=7,1,0)","v":0},{"$f":"IF($F18=6,1,0)","v":0},{"$f":"IF($F18=5,1,0)","v":1},{"$f":"IF($F18=4,1,0)","v":0},{"$f":"IF($F18=3,1,0)","v":0},{"$f":"IF($F18=2,1,0)","v":0},{"$f":"IF($F18=1,1,0)","v":0}]
[{"$f":"IF(E20<E19,BO20,A19)","v":15},"Braathen","Elisabeth Texnæs","Heming",{"$f":"IF(F20<=4,Q20,(Q20-SUM(SMALL(R20:Y20,{1;2;3;4}))))","v":108},{"$f":"(IF(AC20=5,1,0)+IF(AH20=5,1,0)+IF(AM20=5,1,0)+IF(AR20=5,1,0)+IF(AW20=5,1,0)+IF(BB20=5,1,0)+IF(BG20=5,1,0)+IF(BL20=5,1,0))","v":5},null,{"$f":"IF(AA20=\"\",\"\",AA20)","v":""},{"$f":"IF(AF20=\"\",\"\",AF20)","v":""},{"$f":"IF(AK20=\"\",\"\",AK20)","v":12},{"$f":"IF(AP20=\"\",\"\",AP20)","v":11},{"$f":"IF(AU20=\"\",\"\",AU20)","v":20},{"$f":"IF(AZ20=\"\",\"\",AZ20)","v":"dsq"},{"$f":"IF(BE20=\"\",\"\",BE20)","v":10},{"$f":"IF(BJ20=\"\",\"\",BJ20)","v":""},null,{"$f":"AD20+AI20+AN20+AS20+AX20+BC20+BH20","v":108},{"$f":"IF($F20>=5,IF(AB20=\"\",\"\",AB20),\"\")","v":0},{"$f":"IF($F20>=5,IF(AG20=\"\",\"\",AG20),\"\")","v":0},{"$f":"IF($F20>=5,IF(AL20=\"\",\"\",AL20),\"\")","v":22},{"$f":"IF($F20>=5,IF(AQ20=\"\",\"\",AQ20),\"\")","v":24},{"$f":"IF($F20>=5,IF(AV20=\"\",\"\",AV20),\"\")","v":11},{"$f":"IF($F20>=5,IF(BA20=\"\",\"\",BA20),\"\")","v":0},{"$f":"IF($F20>=5,IF(BF20=\"\",\"\",BF20),\"\")","v":26},{"$f":"IF($F20>=5,IF(BK20=\"\",\"\",BK20),\"\")","v":0},null,null,{"$f":"IF(ISNUMBER(AA20),(VLOOKUP(AA20,$BO$6:$BP$50,2)),0)","v":0},{"$f":"IF(AA20<>\"\",5,0)","v":0},{"$f":"AB20+AC20","v":0},null,null,{"$f":"IF(ISNUMBER(AF20),(VLOOKUP(AF20,$BO$6:$BP$50,2)),0)","v":0},{"$f":"IF(AF20<>\"\",5,0)","v":0},{"$f":"AG20+AH20","v":0},null,12,{"$f":"IF(ISNUMBER(AK20),(VLOOKUP(AK20,$BO$6:$BP$50,2)),0)","v":22},{"$f":"IF(AK20<>\"\",5,0)","v":5},{"$f":"AL20+AM20","v":27},null,11,{"$f":"IF(ISNUMBER(AP20),(VLOOKUP(AP20,$BO$6:$BP$50,2)),0)","v":24},{"$f":"IF(AP20<>\"\",5,0)","v":5},{"$f":"AQ20+AR20","v":29},null,20,{"$f":"IF(ISNUMBER(AU20),(VLOOKUP(AU20,$BO$6:$BP$50,2)),0)","v":11},{"$f":"IF(AU20<>\"\",5,0)","v":5},{"$f":"AV20+AW20","v":16},null,"dsq",{"$f":"IF(ISNUMBER(AZ20),(VLOOKUP(AZ20,$BO$6:$BP$50,2)),0)","v":0},{"$f":"IF(AZ20<>\"\",5,0)","v":5},{"$f":"BA20+BB20","v":5},null,10,{"$f":"IF(ISNUMBER(BE20),(VLOOKUP(BE20,$BO$6:$BP$50,2)),0)","v":26},{"$f":"IF(BE20<>\"\",5,0)","v":5},{"$f":"BF20+BG20","v":31},null,null,{"$f":"IF(ISNUMBER(BJ20),(VLOOKUP(BJ20,$BO$6:$BP$50,2)),0)","v":0},{"$f":"IF(BJ20<>\"\",5,0)","v":0},{"$f":"BK20+BL20","v":0},null,15,16,0,{"$f":"IF($F19=7,1,0)","v":0},{"$f":"IF($F19=6,1,0)","v":0},{"$f":"IF($F19=5,1,0)","v":1},{"$f":"IF($F19=4,1,0)","v":0},{"$f":"IF($F19=3,1,0)","v":0},{"$f":"IF($F19=2,1,0)","v":0},{"$f":"IF($F19=1,1,0)","v":0}]
[{"$f":"IF(E21<E20,BO21,A20)","v":16},"Meidell","Lucie Marie","Heming",{"$f":"IF(F21<=4,Q21,(Q21-SUM(SMALL(R21:Y21,{1;2;3;4}))))","v":102},{"$f":"(IF(AC21=5,1,0)+IF(AH21=5,1,0)+IF(AM21=5,1,0)+IF(AR21=5,1,0)+IF(AW21=5,1,0)+IF(BB21=5,1,0)+IF(BG21=5,1,0)+IF(BL21=5,1,0))","v":2},null,{"$f":"IF(AA21=\"\",\"\",AA21)","v":""},{"$f":"IF(AF21=\"\",\"\",AF21)","v":""},{"$f":"IF(AK21=\"\",\"\",AK21)","v":""},{"$f":"IF(AP21=\"\",\"\",AP21)","v":""},{"$f":"IF(AU21=\"\",\"\",AU21)","v":8},{"$f":"IF(AZ21=\"\",\"\",AZ21)","v":""},{"$f":"IF(BE21=\"\",\"\",BE21)","v":3},{"$f":"IF(BJ21=\"\",\"\",BJ21)","v":""},null,{"$f":"AD21+AI21+AN21+AS21+AX21+BC21+BH21","v":102},{"$f":"IF($F21>=5,IF(AB21=\"\",\"\",AB21),\"\")","v":""},{"$f":"IF($F21>=5,IF(AG21=\"\",\"\",AG21),\"\")","v":""},{"$f":"IF($F21>=5,IF(AL21=\"\",\"\",AL21),\"\")","v":""},{"$f":"IF($F21>=5,IF(AQ21=\"\",\"\",AQ21),\"\")","v":""},{"$f":"IF($F21>=5,IF(AV21=\"\",\"\",AV21),\"\")","v":""},{"$f":"IF($F21>=5,IF(BA21=\"\",\"\",BA21),\"\")","v":""},{"$f":"IF($F21>=5,IF(BF21=\"\",\"\",BF21),\"\")","v":""},{"$f":"IF($F21>=5,IF(BK21=\"\",\"\",BK21),\"\")","v":""},null,null,{"$f":"IF(ISNUMBER(AA21),(VLOOKUP(AA21,$BO$6:$BP$50,2)),0)","v":0},{"$f":"IF(AA21<>\"\",5,0)","v":0},{"$f":"AB21+AC21","v":0},null,null,{"$f":"IF(ISNUMBER(AF21),(VLOOKUP(AF21,$BO$6:$BP$50,2)),0)","v":0},{"$f":"IF(AF21<>\"\",5,0)","v":0},{"$f":"AG21+AH21","v":0},null,null,{"$f":"IF(ISNUMBER(AK21),(VLOOKUP(AK21,$BO$6:$BP$50,2)),0)","v":0},{"$f":"IF(AK21<>\"\",5,0)","v":0},{"$f":"AL21+AM21","v":0},null,null,{"$f":"IF(ISNUMBER(AP21),(VLOOKUP(AP21,$BO$6:$BP$50,2)),0)","v":0},{"$f":"IF(AP21<>\"\",5,0)","v":0},{"$f":"AQ21+AR21","v":0},null,8,{"$f":"IF(ISNUMBER(AU21),(VLOOKUP(AU21,$BO$6:$BP$50,2)),0)","v":32},{"$f":"IF(AU21<>\"\",5,0)","v":5},{"$f":"AV21+AW21","v":37},null,null,{"$f":"IF(ISNUMBER(AZ21),(VLOOKUP(AZ21,$BO$6:$BP$50,2)),0)","v":0},{"$f":"IF(AZ21<>\"\",5,0)","v":0},{"$f":"BA21+BB21","v":0},null,3,{"$f":"IF(ISNUMBER(BE21),(VLOOKUP(BE21,$BO$6:$BP$50,2)),0)","v":60},{"$f":"IF(BE21<>\"\",5,0)","v":5},{"$f":"BF21+BG21","v":65},null,null,{"$f":"IF(ISNUMBER(BJ21),(VLOOKUP(BJ21,$BO$6:$BP$50,2)),0)","v":0},{"$f":"IF(BJ21<>\"\",5,0)","v":0},{"$f":"BK21+BL21","v":0},null,16,15,0,{"$f":"IF($F19=7,1,0)","v":0},{"$f":"IF($F19=6,1,0)","v":0},{"$f":"IF($F19=5,1,0)","v":1},{"$f":"IF($F19=4,1,0)","v":0},{"$f":"IF($F19=3,1,0)","v":0},{"$f":"IF($F19=2,1,0)","v":0},{"$f":"IF($F19=1,1,0)","v":0}]
[{"$f":"IF(E22<E21,BO22,A21)","v":17},"Roll","Celine Amelie","Ready",{"$f":"IF(F22<=4,Q22,(Q22-SUM(SMALL(R22:Y22,{1;2;3;4}))))","v":89},{"$f":"(IF(AC22=5,1,0)+IF(AH22=5,1,0)+IF(AM22=5,1,0)+IF(AR22=5,1,0)+IF(AW22=5,1,0)+IF(BB22=5,1,0)+IF(BG22=5,1,0)+IF(BL22=5,1,0))","v":5},null,{"$f":"IF(AA22=\"\",\"\",AA22)","v":""},{"$f":"IF(AF22=\"\",\"\",AF22)","v":""},{"$f":"IF(AK22=\"\",\"\",AK22)","v":11},{"$f":"IF(AP22=\"\",\"\",AP22)","v":17},{"$f":"IF(AU22=\"\",\"\",AU22)","v":10},{"$f":"IF(AZ22=\"\",\"\",AZ22)","v":"dsq"},{"$f":"IF(BE22=\"\",\"\",BE22)","v":"dsq"},{"$f":"IF(BJ22=\"\",\"\",BJ22)","v":""},null,{"$f":"AD22+AI22+AN22+AS22+AX22+BC22+BH22","v":89},{"$f":"IF($F22>=5,IF(AB22=\"\",\"\",AB22),\"\")","v":0},{"$f":"IF($F22>=5,IF(AG22=\"\",\"\",AG22),\"\")","v":0},{"$f":"IF($F22>=5,IF(AL22=\"\",\"\",AL22),\"\")","v":24},{"$f":"IF($F22>=5,IF(AQ22=\"\",\"\",AQ22),\"\")","v":14},{"$f":"IF($F22>=5,IF(AV22=\"\",\"\",AV22),\"\")","v":26},{"$f":"IF($F22>=5,IF(BA22=\"\",\"\",BA22),\"\")","v":0},{"$f":"IF($F22>=5,IF(BF22=\"\",\"\",BF22),\"\")","v":0},{"$f":"IF($F22>=5,IF(BK22=\"\",\"\",BK22),\"\")","v":0},null,null,{"$f":"IF(ISNUMBER(AA22),(VLOOKUP(AA22,$BO$6:$BP$50,2)),0)","v":0},{"$f":"IF(AA22<>\"\",5,0)","v":0},{"$f":"AB22+AC22","v":0},null,null,{"$f":"IF(ISNUMBER(AF22),(VLOOKUP(AF22,$BO$6:$BP$50,2)),0)","v":0},{"$f":"IF(AF22<>\"\",5,0)","v":0},{"$f":"AG22+AH22","v":0},null,11,{"$f":"IF(ISNUMBER(AK22),(VLOOKUP(AK22,$BO$6:$BP$50,2)),0)","v":24},{"$f":"IF(AK22<>\"\",5,0)","v":5},{"$f":"AL22+AM22","v":29},null,17,{"$f":"IF(ISNUMBER(AP22),(VLOOKUP(AP22,$BO$6:$BP$50,2)),0)","v":14},{"$f":"IF(AP22<>\"\",5,0)","v":5},{"$f":"AQ22+AR22","v":19},null,10,{"$f":"IF(ISNUMBER(AU22),(VLOOKUP(AU22,$BO$6:$BP$50,2)),0)","v":26},{"$f":"IF(AU22<>\"\",5,0)","v":5},{"$f":"AV22+AW22","v":31},null,"dsq",{"$f":"IF(ISNUMBER(AZ22),(VLOOKUP(AZ22,$BO$6:$BP$50,2)),0)","v":0},{"$f":"IF(AZ22<>\"\",5,0)","v":5},{"$f":"BA22+BB22","v":5},null,"dsq",{"$f":"IF(ISNUMBER(BE22),(VLOOKUP(BE22,$BO$6:$BP$50,2)),0)","v":0},{"$f":"IF(BE22<>\"\",5,0)","v":5},{"$f":"BF22+BG22","v":5},null,null,{"$f":"IF(ISNUMBER(BJ22),(VLOOKUP(BJ22,$BO$6:$BP$50,2)),0)","v":0},{"$f":"IF(BJ22<>\"\",5,0)","v":0},{"$f":"BK22+BL22","v":0},null,17,14,0,0,0,1,0,0,0,0]
[{"$f":"IF(E23<E22,BO23,A22)","v":18},"Kolbjørnsrud","Ingrid","Kjelsås",{"$f":"IF(F23<=4,Q23,(Q23-SUM(SMALL(R23:Y23,{1;2;3;4}))))","v":82},{"$f":"(IF(AC23=5,1,0)+IF(AH23=5,1,0)+IF(AM23=5,1,0)+IF(AR23=5,1,0)+IF(AW23=5,1,0)+IF(BB23=5,1,0)+IF(BG23=5,1,0)+IF(BL23=5,1,0))","v":5},null,{"$f":"IF(AA23=\"\",\"\",AA23)","v":""},{"$f":"IF(AF23=\"\",\"\",AF23)","v":""},{"$f":"IF(AK23=\"\",\"\",AK23)","v":17},{"$f":"IF(AP23=\"\",\"\",AP23)","v":"dnf"},{"$f":"IF(AU23=\"\",\"\",AU23)","v":26},{"$f":"IF(AZ23=\"\",\"\",AZ23)","v":13},{"$f":"IF(BE23=\"\",\"\",BE23)","v":14},{"$f":"IF(BJ23=\"\",\"\",BJ23)","v":""},null,{"$f":"AD23+AI23+AN23+AS23+AX23+BC23+BH23","v":82},{"$f":"IF($F23>=5,IF(AB23=\"\",\"\",AB23),\"\")","v":0},{"$f":"IF($F23>=5,IF(AG23=\"\",\"\",AG23),\"\")","v":0},{"$f":"IF($F23>=5,IF(AL23=\"\",\"\",AL23),\"\")","v":14},{"$f":"IF($F23>=5,IF(AQ23=\"\",\"\",AQ23),\"\")","v":0},{"$f":"IF($F23>=5,IF(AV23=\"\",\"\",AV23),\"\")","v":5},{"$f":"IF($F23>=5,IF(BA23=\"\",\"\",BA23),\"\")","v":20},{"$f":"IF($F23>=5,IF(BF23=\"\",\"\",BF23),\"\")","v":18},{"$f":"IF($F23>=5,IF(BK23=\"\",\"\",BK23),\"\")","v":0},null,null,{"$f":"IF(ISNUMBER(AA23),(VLOOKUP(AA23,$BO$6:$BP$50,2)),0)","v":0},{"$f":"IF(AA23<>\"\",5,0)","v":0},{"$f":"AB23+AC23","v":0},null,null,{"$f":"IF(ISNUMBER(AF23),(VLOOKUP(AF23,$BO$6:$BP$50,2)),0)","v":0},{"$f":"IF(AF23<>\"\",5,0)","v":0},{"$f":"AG23+AH23","v":0},null,17,{"$f":"IF(ISNUMBER(AK23),(VLOOKUP(AK23,$BO$6:$BP$50,2)),0)","v":14},{"$f":"IF(AK23<>\"\",5,0)","v":5},{"$f":"AL23+AM23","v":19},null,"dnf",{"$f":"IF(ISNUMBER(AP23),(VLOOKUP(AP23,$BO$6:$BP$50,2)),0)","v":0},{"$f":"IF(AP23<>\"\",5,0)","v":5},{"$f":"AQ23+AR23","v":5},null,26,{"$f":"IF(ISNUMBER(AU23),(VLOOKUP(AU23,$BO$6:$BP$50,2)),0)","v":5},{"$f":"IF(AU23<>\"\",5,0)","v":5},{"$f":"AV23+AW23","v":10},null,13,{"$f":"IF(ISNUMBER(AZ23),(VLOOKUP(AZ23,$BO$6:$BP$50,2)),0)","v":20},{"$f":"IF(AZ23<>\"\",5,0)","v":5},{"$f":"BA23+BB23","v":25},null,14,{"$f":"IF(ISNUMBER(BE23),(VLOOKUP(BE23,$BO$6:$BP$50,2)),0)","v":18},{"$f":"IF(BE23<>\"\",5,0)","v":5},{"$f":"BF23+BG23","v":23},null,null,{"$f":"IF(ISNUMBER(BJ23),(VLOOKUP(BJ23,$BO$6:$BP$50,2)),0)","v":0},{"$f":"IF(BJ23<>\"\",5,0)","v":0},{"$f":"BK23+BL23","v":0},null,18,13,0,0,0,0,0,0,1,0]
[{"$f":"IF(E24<E23,BO24,A23)","v":19},"Danielsen","Hedvig Aabel","Heming",{"$f":"IF(F24<=4,Q24,(Q24-SUM(SMALL(R24:Y24,{1;2;3;4}))))","v":79},{"$f":"(IF(AC24=5,1,0)+IF(AH24=5,1,0)+IF(AM24=5,1,0)+IF(AR24=5,1,0)+IF(AW24=5,1,0)+IF(BB24=5,1,0)+IF(BG24=5,1,0)+IF(BL24=5,1,0))","v":5},null,{"$f":"IF(AA24=\"\",\"\",AA24)","v":""},{"$f":"IF(AF24=\"\",\"\",AF24)","v":""},{"$f":"IF(AK24=\"\",\"\",AK24)","v":19},{"$f":"IF(AP24=\"\",\"\",AP24)","v":18},{"$f":"IF(AU24=\"\",\"\",AU24)","v":28},{"$f":"IF(AZ24=\"\",\"\",AZ24)","v":10},{"$f":"IF(BE24=\"\",\"\",BE24)","v":"dnf"},{"$f":"IF(BJ24=\"\",\"\",BJ24)","v":""},null,{"$f":"AD24+AI24+AN24+AS24+AX24+BC24+BH24","v":79},{"$f":"IF($F24>=5,IF(AB24=\"\",\"\",AB24),\"\")","v":0},{"$f":"IF($F24>=5,IF(AG24=\"\",\"\",AG24),\"\")","v":0},{"$f":"IF($F24>=5,IF(AL24=\"\",\"\",AL24),\"\")","v":12},{"$f":"IF($F24>=5,IF(AQ24=\"\",\"\",AQ24),\"\")","v":13},{"$f":"IF($F24>=5,IF(AV24=\"\",\"\",AV24),\"\")","v":3},{"$f":"IF($F24>=5,IF(BA24=\"\",\"\",BA24),\"\")","v":26},{"$f":"IF($F24>=5,IF(BF24=\"\",\"\",BF24),\"\")","v":0},{"$f":"IF($F24>=5,IF(BK24=\"\",\"\",BK24),\"\")","v":0},null,null,{"$f":"IF(ISNUMBER(AA24),(VLOOKUP(AA24,$BO$6:$BP$50,2)),0)","v":0},{"$f":"IF(AA24<>\"\",5,0)","v":0},{"$f":"AB24+AC24","v":0},null,null,{"$f":"IF(ISNUMBER(AF24),(VLOOKUP(AF24,$BO$6:$BP$50,2)),0)","v":0},{"$f":"IF(AF24<>\"\",5,0)","v":0},{"$f":"AG24+AH24","v":0},null,19,{"$f":"IF(ISNUMBER(AK24),(VLOOKUP(AK24,$BO$6:$BP$50,2)),0)","v":12},{"$f":"IF(AK24<>\"\",5,0)","v":5},{"$f":"AL24+AM24","v":17},null,18,{"$f":"IF(ISNUMBER(AP24),(VLOOKUP(AP24,$BO$6:$BP$50,2)),0)","v":13},{"$f":"IF(AP24<>\"\",5,0)","v":5},{"$f":"AQ24+AR24","v":18},null,28,{"$f":"IF(ISNUMBER(AU24),(VLOOKUP(AU24,$BO$6:$BP$50,2)),0)","v":3},{"$f":"IF(AU24<>\"\",5,0)","v":5},{"$f":"AV24+AW24","v":8},null,10,{"$f":"IF(ISNUMBER(AZ24),(VLOOKUP(AZ24,$BO$6:$BP$50,2)),0)","v":26},{"$f":"IF(AZ24<>\"\",5,0)","v":5},{"$f":"BA24+BB24","v":31},null,"dnf",{"$f":"IF(ISNUMBER(BE24),(VLOOKUP(BE24,$BO$6:$BP$50,2)),0)","v":0},{"$f":"IF(BE24<>\"\",5,0)","v":5},{"$f":"BF24+BG24","v":5},null,null,{"$f":"IF(ISNUMBER(BJ24),(VLOOKUP(BJ24,$BO$6:$BP$50,2)),0)","v":0},{"$f":"IF(BJ24<>\"\",5,0)","v":0},{"$f":"BK24+BL24","v":0},null,19,12,0,0,0,1,0,0,0,0]
[{"$f":"IF(E25<E24,BO25,A24)","v":20},"Eskeland","Helen Olivia","Heming",{"$f":"IF(F25<=4,Q25,(Q25-SUM(SMALL(R25:Y25,{1;2;3;4}))))","v":77},{"$f":"(IF(AC25=5,1,0)+IF(AH25=5,1,0)+IF(AM25=5,1,0)+IF(AR25=5,1,0)+IF(AW25=5,1,0)+IF(BB25=5,1,0)+IF(BG25=5,1,0)+IF(BL25=5,1,0))","v":3},null,{"$f":"IF(AA25=\"\",\"\",AA25)","v":""},{"$f":"IF(AF25=\"\",\"\",AF25)","v":""},{"$f":"IF(AK25=\"\",\"\",AK25)","v":13},{"$f":"IF(AP25=\"\",\"\",AP25)","v":10},{"$f":"IF(AU25=\"\",\"\",AU25)","v":15},{"$f":"IF(AZ25=\"\",\"\",AZ25)","v":""},{"$f":"IF(BE25=\"\",\"\",BE25)","v":""},{"$f":"IF(BJ25=\"\",\"\",BJ25)","v":""},null,{"$f":"AD25+AI25+AN25+AS25+AX25+BC25+BH25","v":77},{"$f":"IF($F25>=5,IF(AB25=\"\",\"\",AB25),\"\")","v":""},{"$f":"IF($F25>=5,IF(AG25=\"\",\"\",AG25),\"\")","v":""},{"$f":"IF($F25>=5,IF(AL25=\"\",\"\",AL25),\"\")","v":""},{"$f":"IF($F25>=5,IF(AQ25=\"\",\"\",AQ25),\"\")","v":""},{"$f":"IF($F25>=5,IF(AV25=\"\",\"\",AV25),\"\")","v":""},{"$f":"IF($F25>=5,IF(BA25=\"\",\"\",BA25),\"\")","v":""},{"$f":"IF($F25>=5,IF(BF25=\"\",\"\",BF25),\"\")","v":""},{"$f":"IF($F25>=5,IF(BK25=\"\",\"\",BK25),\"\")","v":""},null,null,{"$f":"IF(ISNUMBER(AA25),(VLOOKUP(AA25,$BO$6:$BP$50,2)),0)","v":0},{"$f":"IF(AA25<>\"\",5,0)","v":0},{"$f":"AB25+AC25","v":0},null,null,{"$f":"IF(ISNUMBER(AF25),(VLOOKUP(AF25,$BO$6:$BP$50,2)),0)","v":0},{"$f":"IF(AF25<>\"\",5,0)","v":0},{"$f":"AG25+AH25","v":0},null,13,{"$f":"IF(ISNUMBER(AK25),(VLOOKUP(AK25,$BO$6:$BP$50,2)),0)","v":20},{"$f":"IF(AK25<>\"\",5,0)","v":5},{"$f":"AL25+AM25","v":25},null,10,{"$f":"IF(ISNUMBER(AP25),(VLOOKUP(AP25,$BO$6:$BP$50,2)),0)","v":26},{"$f":"IF(AP25<>\"\",5,0)","v":5},{"$f":"AQ25+AR25","v":31},null,15,{"$f":"IF(ISNUMBER(AU25),(VLOOKUP(AU25,$BO$6:$BP$50,2)),0)","v":16},{"$f":"IF(AU25<>\"\",5,0)","v":5},{"$f":"AV25+AW25","v":21},null,null,{"$f":"IF(ISNUMBER(AZ25),(VLOOKUP(AZ25,$BO$6:$BP$50,2)),0)","v":0},{"$f":"IF(AZ25<>\"\",5,0)","v":0},{"$f":"BA25+BB25","v":0},null,null,{"$f":"IF(ISNUMBER(BE25),(VLOOKUP(BE25,$BO$6:$BP$50,2)),0)","v":0},{"$f":"IF(BE25<>\"\",5,0)","v":0},{"$f":"BF25+BG25","v":0},null,null,{"$f":"IF(ISNUMBER(BJ25),(VLOOKUP(BJ25,$BO$6:$BP$50,2)),0)","v":0},{"$f":"IF(BJ25<>\"\",5,0)","v":0},{"$f":"BK25+BL25","v":0},null,20,11,0,0,0,1,0,0,0,0]
[{"$f":"IF(E26<E25,BO26,A25)","v":21},"Fleischer","Elise Victoria","Heming",{"$f":"IF(F26<=4,Q26,(Q26-SUM(SMALL(R26:Y26,{1;2;3;4}))))","v":70},{"$f":"(IF(AC26=5,1,0)+IF(AH26=5,1,0)+IF(AM26=5,1,0)+IF(AR26=5,1,0)+IF(AW26=5,1,0)+IF(BB26=5,1,0)+IF(BG26=5,1,0)+IF(BL26=5,1,0))","v":2},null,{"$f":"IF(AA26=\"\",\"\",AA26)","v":""},{"$f":"IF(AF26=\"\",\"\",AF26)","v":""},{"$f":"IF(AK26=\"\",\"\",AK26)","v":""},{"$f":"IF(AP26=\"\",\"\",AP26)","v":""},{"$f":"IF(AU26=\"\",\"\",AU26)","v":16},{"$f":"IF(AZ26=\"\",\"\",AZ26)","v":""},{"$f":"IF(BE26=\"\",\"\",BE26)","v":5},{"$f":"IF(BJ26=\"\",\"\",BJ26)","v":""},null,{"$f":"AD26+AI26+AN26+AS26+AX26+BC26+BH26","v":70},{"$f":"IF($F26>=5,IF(AB26=\"\",\"\",AB26),\"\")","v":""},{"$f":"IF($F26>=5,IF(AG26=\"\",\"\",AG26),\"\")","v":""},{"$f":"IF($F26>=5,IF(AL26=\"\",\"\",AL26),\"\")","v":""},{"$f":"IF($F26>=5,IF(AQ26=\"\",\"\",AQ26),\"\")","v":""},null,{"$f":"IF($F26>=5,IF(BA26=\"\",\"\",BA26),\"\")","v":""},{"$f":"IF($F26>=5,IF(BF26=\"\",\"\",BF26),\"\")","v":""},{"$f":"IF($F26>=5,IF(BK26=\"\",\"\",BK26),\"\")","v":""},null,null,{"$f":"IF(ISNUMBER(AA26),(VLOOKUP(AA26,$BO$6:$BP$50,2)),0)","v":0},{"$f":"IF(AA26<>\"\",5,0)","v":0},{"$f":"AB26+AC26","v":0},null,null,{"$f":"IF(ISNUMBER(AF26),(VLOOKUP(AF26,$BO$6:$BP$50,2)),0)","v":0},{"$f":"IF(AF26<>\"\",5,0)","v":0},{"$f":"AG26+AH26","v":0},null,null,{"$f":"IF(ISNUMBER(AK26),(VLOOKUP(AK26,$BO$6:$BP$50,2)),0)","v":0},{"$f":"IF(AK26<>\"\",5,0)","v":0},{"$f":"AL26+AM26","v":0},null,null,{"$f":"IF(ISNUMBER(AP26),(VLOOKUP(AP26,$BO$6:$BP$50,2)),0)","v":0},{"$f":"IF(AP26<>\"\",5,0)","v":0},{"$f":"AQ26+AR26","v":0},null,16,{"$f":"IF(ISNUMBER(AU26),(VLOOKUP(AU26,$BO$6:$BP$50,2)),0)","v":15},{"$f":"IF(AU26<>\"\",5,0)","v":5},{"$f":"AV26+AW26","v":20},null,null,{"$f":"IF(ISNUMBER(AZ26),(VLOOKUP(AZ26,$BO$6:$BP$50,2)),0)","v":0},{"$f":"IF(AZ26<>\"\",5,0)","v":0},{"$f":"BA26+BB26","v":0},null,5,{"$f":"IF(ISNUMBER(BE26),(VLOOKUP(BE26,$BO$6:$BP$50,2)),0)","v":45},{"$f":"IF(BE26<>\"\",5,0)","v":5},{"$f":"BF26+BG26","v":50},null,null,{"$f":"IF(ISNUMBER(BJ26),(VLOOKUP(BJ26,$BO$6:$BP$50,2)),0)","v":0},{"$f":"IF(BJ26<>\"\",5,0)","v":0},{"$f":"BK26+BL26","v":0},null,21,10,0,0,0,1,0,0,0,0]
[{"$f":"IF(E27<E26,BO27,A26)","v":22},"Rivelsrud","Matilde Sofia","Heming",{"$f":"IF(F27<=4,Q27,(Q27-SUM(SMALL(R27:Y27,{1;2;3;4}))))","v":66},{"$f":"(IF(AC27=5,1,0)+IF(AH27=5,1,0)+IF(AM27=5,1,0)+IF(AR27=5,1,0)+IF(AW27=5,1,0)+IF(BB27=5,1,0)+IF(BG27=5,1,0)+IF(BL27=5,1,0))","v":4},null,{"$f":"IF(AA27=\"\",\"\",AA27)","v":""},{"$f":"IF(AF27=\"\",\"\",AF27)","v":""},{"$f":"IF(AK27=\"\",\"\",AK27)","v":14},{"$f":"IF(AP27=\"\",\"\",AP27)","v":13},{"$f":"IF(AU27=\"\",\"\",AU27)","v":23},{"$f":"IF(AZ27=\"\",\"\",AZ27)","v":""},{"$f":"IF(BE27=\"\",\"\",BE27)","v":"dsq"},{"$f":"IF(BJ27=\"\",\"\",BJ27)","v":""},null,{"$f":"AD27+AI27+AN27+AS27+AX27+BC27+BH27","v":66},{"$f":"IF($F27>=5,IF(AB27=\"\",\"\",AB27),\"\")","v":""},{"$f":"IF($F27>=5,IF(AG27=\"\",\"\",AG27),\"\")","v":""},{"$f":"IF($F27>=5,IF(AL27=\"\",\"\",AL27),\"\")","v":""},{"$f":"IF($F27>=5,IF(AQ27=\"\",\"\",AQ27),\"\")","v":""},{"$f":"IF($F27>=5,IF(AV27=\"\",\"\",AV27),\"\")","v":""},{"$f":"IF($F27>=5,IF(BA27=\"\",\"\",BA27),\"\")","v":""},{"$f":"IF($F27>=5,IF(BF27=\"\",\"\",BF27),\"\")","v":""},{"$f":"IF($F27>=5,IF(BK27=\"\",\"\",BK27),\"\")","v":""},null,null,{"$f":"IF(ISNUMBER(AA27),(VLOOKUP(AA27,$BO$6:$BP$50,2)),0)","v":0},{"$f":"IF(AA27<>\"\",5,0)","v":0},{"$f":"AB27+AC27","v":0},null,null,{"$f":"IF(ISNUMBER(AF27),(VLOOKUP(AF27,$BO$6:$BP$50,2)),0)","v":0},{"$f":"IF(AF27<>\"\",5,0)","v":0},{"$f":"AG27+AH27","v":0},null,14,{"$f":"IF(ISNUMBER(AK27),(VLOOKUP(AK27,$BO$6:$BP$50,2)),0)","v":18},{"$f":"IF(AK27<>\"\",5,0)","v":5},{"$f":"AL27+AM27","v":23},null,13,{"$f":"IF(ISNUMBER(AP27),(VLOOKUP(AP27,$BO$6:$BP$50,2)),0)","v":20},{"$f":"IF(AP27<>\"\",5,0)","v":5},{"$f":"AQ27+AR27","v":25},null,23,{"$f":"IF(ISNUMBER(AU27),(VLOOKUP(AU27,$BO$6:$BP$50,2)),0)","v":8},{"$f":"IF(AU27<>\"\",5,0)","v":5},{"$f":"AV27+AW27","v":13},null,null,{"$f":"IF(ISNUMBER(AZ27),(VLOOKUP(AZ27,$BO$6:$BP$50,2)),0)","v":0},{"$f":"IF(AZ27<>\"\",5,0)","v":0},{"$f":"BA27+BB27","v":0},null,"dsq",{"$f":"IF(ISNUMBER(BE27),(VLOOKUP(BE27,$BO$6:$BP$50,2)),0)","v":0},{"$f":"IF(BE27<>\"\",5,0)","v":5},{"$f":"BF27+BG27","v":5},null,null,{"$f":"IF(ISNUMBER(BJ27),(VLOOKUP(BJ27,$BO$6:$BP$50,2)),0)","v":0},{"$f":"IF(BJ27<>\"\",5,0)","v":0},{"$f":"BK27+BL27","v":0},null,22,9,0,0,0,0,0,1,0,0]
[{"$f":"IF(E28<E27,BO28,A27)","v":23},"Dahl","Olea","Ljan",{"$f":"IF(F28<=4,Q28,(Q28-SUM(SMALL(R28:Y28,{1;2;3;4}))))","v":65},{"$f":"(IF(AC28=5,1,0)+IF(AH28=5,1,0)+IF(AM28=5,1,0)+IF(AR28=5,1,0)+IF(AW28=5,1,0)+IF(BB28=5,1,0)+IF(BG28=5,1,0)+IF(BL28=5,1,0))","v":1},null,{"$f":"IF(AA28=\"\",\"\",AA28)","v":""},{"$f":"IF(AF28=\"\",\"\",AF28)","v":3},{"$f":"IF(AK28=\"\",\"\",AK28)","v":""},{"$f":"IF(AP28=\"\",\"\",AP28)","v":""},{"$f":"IF(AU28=\"\",\"\",AU28)","v":""},{"$f":"IF(AZ28=\"\",\"\",AZ28)","v":""},{"$f":"IF(BE28=\"\",\"\",BE28)","v":""},{"$f":"IF(BJ28=\"\",\"\",BJ28)","v":""},null,{"$f":"AD28+AI28+AN28+AS28+AX28+BC28+BH28","v":65},{"$f":"IF($F28>=5,IF(AB28=\"\",\"\",AB28),\"\")","v":""},{"$f":"IF($F28>=5,IF(AG28=\"\",\"\",AG28),\"\")","v":""},{"$f":"IF($F28>=5,IF(AL28=\"\",\"\",AL28),\"\")","v":""},{"$f":"IF($F28>=5,IF(AQ28=\"\",\"\",AQ28),\"\")","v":""},{"$f":"IF($F28>=5,IF(AV28=\"\",\"\",AV28),\"\")","v":""},{"$f":"IF($F28>=5,IF(BA28=\"\",\"\",BA28),\"\")","v":""},{"$f":"IF($F28>=5,IF(BF28=\"\",\"\",BF28),\"\")","v":""},{"$f":"IF($F28>=5,IF(BK28=\"\",\"\",BK28),\"\")","v":""},null,null,{"$f":"IF(ISNUMBER(AA28),(VLOOKUP(AA28,$BO$6:$BP$50,2)),0)","v":0},{"$f":"IF(AA28<>\"\",5,0)","v":0},{"$f":"AB28+AC28","v":0},null,3,{"$f":"IF(ISNUMBER(AF28),(VLOOKUP(AF28,$BO$6:$BP$50,2)),0)","v":60},{"$f":"IF(AF28<>\"\",5,0)","v":5},{"$f":"AG28+AH28","v":65},null,null,{"$f":"IF(ISNUMBER(AK28),(VLOOKUP(AK28,$BO$6:$BP$50,2)),0)","v":0},{"$f":"IF(AK28<>\"\",5,0)","v":0},{"$f":"AL28+AM28","v":0},null,null,{"$f":"IF(ISNUMBER(AP28),(VLOOKUP(AP28,$BO$6:$BP$50,2)),0)","v":0},{"$f":"IF(AP28<>\"\",5,0)","v":0},{"$f":"AQ28+AR28","v":0},null,null,{"$f":"IF(ISNUMBER(AU28),(VLOOKUP(AU28,$BO$6:$BP$50,2)),0)","v":0},{"$f":"IF(AU28<>\"\",5,0)","v":0},{"$f":"AV28+AW28","v":0},null,null,{"$f":"IF(ISNUMBER(AZ28),(VLOOKUP(AZ28,$BO$6:$BP$50,2)),0)","v":0},{"$f":"IF(AZ28<>\"\",5,0)","v":0},{"$f":"BA28+BB28","v":0},null,null,{"$f":"IF(ISNUMBER(BE28),(VLOOKUP(BE28,$BO$6:$BP$50,2)),0)","v":0},{"$f":"IF(BE28<>\"\",5,0)","v":0},{"$f":"BF28+BG28","v":0},null,null,{"$f":"IF(ISNUMBER(BJ28),(VLOOKUP(BJ28,$BO$6:$BP$50,2)),0)","v":0},{"$f":"IF(BJ28<>\"\",5,0)","v":0},{"$f":"BK28+BL28","v":0},null,23,8,0,{"$f":"IF($F23=7,1,0)","v":0},{"$f":"IF($F23=6,1,0)","v":0},{"$f":"IF($F23=5,1,0)","v":1},{"$f":"IF($F23=4,1,0)","v":0},{"$f":"IF($F23=3,1,0)","v":0},{"$f":"IF($F23=2,1,0)","v":0},{"$f":"IF($F23=1,1,0)","v":0}]
[{"$f":"IF(E29<E28,BO29,A28)","v":24},"Bunæs-Røyr","Cornelia","Stabæk",{"$f":"IF(F29<=4,Q29,(Q29-SUM(SMALL(R29:Y29,{1;2;3;4}))))","v":55},{"$f":"(IF(AC29=5,1,0)+IF(AH29=5,1,0)+IF(AM29=5,1,0)+IF(AR29=5,1,0)+IF(AW29=5,1,0)+IF(BB29=5,1,0)+IF(BG29=5,1,0)+IF(BL29=5,1,0))","v":1},null,{"$f":"IF(AA29=\"\",\"\",AA29)","v":""},{"$f":"IF(AF29=\"\",\"\",AF29)","v":""},{"$f":"IF(AK29=\"\",\"\",AK29)","v":""},{"$f":"IF(AP29=\"\",\"\",AP29)","v":""},{"$f":"IF(AU29=\"\",\"\",AU29)","v":4},{"$f":"IF(AZ29=\"\",\"\",AZ29)","v":""},{"$f":"IF(BE29=\"\",\"\",BE29)","v":""},{"$f":"IF(BJ29=\"\",\"\",BJ29)","v":""},null,{"$f":"AD29+AI29+AN29+AS29+AX29+BC29+BH29","v":55},{"$f":"IF($F29>=5,IF(AB29=\"\",\"\",AB29),\"\")","v":""},{"$f":"IF($F29>=5,IF(AG29=\"\",\"\",AG29),\"\")","v":""},{"$f":"IF($F29>=5,IF(AL29=\"\",\"\",AL29),\"\")","v":""},{"$f":"IF($F29>=5,IF(AQ29=\"\",\"\",AQ29),\"\")","v":""},{"$f":"IF($F29>=5,IF(AV29=\"\",\"\",AV29),\"\")","v":""},{"$f":"IF($F29>=5,IF(BA29=\"\",\"\",BA29),\"\")","v":""},{"$f":"IF($F29>=5,IF(BF29=\"\",\"\",BF29),\"\")","v":""},{"$f":"IF($F29>=5,IF(BK29=\"\",\"\",BK29),\"\")","v":""},null,null,{"$f":"IF(ISNUMBER(AA29),(VLOOKUP(AA29,$BO$6:$BP$50,2)),0)","v":0},{"$f":"IF(AA29<>\"\",5,0)","v":0},{"$f":"AB29+AC29","v":0},null,null,{"$f":"IF(ISNUMBER(AF29),(VLOOKUP(AF29,$BO$6:$BP$50,2)),0)","v":0},{"$f":"IF(AF29<>\"\",5,0)","v":0},{"$f":"AG29+AH29","v":0},null,null,{"$f":"IF(ISNUMBER(AK29),(VLOOKUP(AK29,$BO$6:$BP$50,2)),0)","v":0},{"$f":"IF(AK29<>\"\",5,0)","v":0},{"$f":"AL29+AM29","v":0},null,null,{"$f":"IF(ISNUMBER(AP29),(VLOOKUP(AP29,$BO$6:$BP$50,2)),0)","v":0},{"$f":"IF(AP29<>\"\",5,0)","v":0},{"$f":"AQ29+AR29","v":0},null,4,{"$f":"IF(ISNUMBER(AU29),(VLOOKUP(AU29,$BO$6:$BP$50,2)),0)","v":50},{"$f":"IF(AU29<>\"\",5,0)","v":5},{"$f":"AV29+AW29","v":55},null,null,{"$f":"IF(ISNUMBER(AZ29),(VLOOKUP(AZ29,$BO$6:$BP$50,2)),0)","v":0},{"$f":"IF(AZ29<>\"\",5,0)","v":0},{"$f":"BA29+BB29","v":0},null,null,{"$f":"IF(ISNUMBER(BE29),(VLOOKUP(BE29,$BO$6:$BP$50,2)),0)","v":0},{"$f":"IF(BE29<>\"\",5,0)","v":0},{"$f":"BF29+BG29","v":0},null,null,{"$f":"IF(ISNUMBER(BJ29),(VLOOKUP(BJ29,$BO$6:$BP$50,2)),0)","v":0},{"$f":"IF(BJ29<>\"\",5,0)","v":0},{"$f":"BK29+BL29","v":0},null,24,7,0,{"$f":"IF($F24=7,1,0)","v":0},{"$f":"IF($F24=6,1,0)","v":0},{"$f":"IF($F24=5,1,0)","v":1},{"$f":"IF($F24=4,1,0)","v":0},{"$f":"IF($F24=3,1,0)","v":0},{"$f":"IF($F24=2,1,0)","v":0},{"$f":"IF($F24=1,1,0)","v":0}]
[{"$f":"IF(E30<E29,BO30,A29)","v":25},"Hovdenak","Selma Stenersen","Njård",{"$f":"IF(F30<=4,Q30,(Q30-SUM(SMALL(R30:Y30,{1;2;3;4}))))","v":49},{"$f":"(IF(AC30=5,1,0)+IF(AH30=5,1,0)+IF(AM30=5,1,0)+IF(AR30=5,1,0)+IF(AW30=5,1,0)+IF(BB30=5,1,0)+IF(BG30=5,1,0)+IF(BL30=5,1,0))","v":3},null,{"$f":"IF(AA30=\"\",\"\",AA30)","v":""},{"$f":"IF(AF30=\"\",\"\",AF30)","v":""},{"$f":"IF(AK30=\"\",\"\",AK30)","v":18},{"$f":"IF(AP30=\"\",\"\",AP30)","v":16},{"$f":"IF(AU30=\"\",\"\",AU30)","v":25},{"$f":"IF(AZ30=\"\",\"\",AZ30)","v":""},{"$f":"IF(BE30=\"\",\"\",BE30)","v":""},{"$f":"IF(BJ30=\"\",\"\",BJ30)","v":""},null,{"$f":"AD30+AI30+AN30+AS30+AX30+BC30+BH30","v":49},{"$f":"IF($F30>=5,IF(AB30=\"\",\"\",AB30),\"\")","v":""},{"$f":"IF($F30>=5,IF(AG30=\"\",\"\",AG30),\"\")","v":""},{"$f":"IF($F30>=5,IF(AL30=\"\",\"\",AL30),\"\")","v":""},{"$f":"IF($F30>=5,IF(AQ30=\"\",\"\",AQ30),\"\")","v":""},{"$f":"IF($F30>=5,IF(AV30=\"\",\"\",AV30),\"\")","v":""},{"$f":"IF($F30>=5,IF(BA30=\"\",\"\",BA30),\"\")","v":""},{"$f":"IF($F30>=5,IF(BF30=\"\",\"\",BF30),\"\")","v":""},{"$f":"IF($F30>=5,IF(BK30=\"\",\"\",BK30),\"\")","v":""},null,null,{"$f":"IF(ISNUMBER(AA30),(VLOOKUP(AA30,$BO$6:$BP$50,2)),0)","v":0},{"$f":"IF(AA30<>\"\",5,0)","v":0},{"$f":"AB30+AC30","v":0},null,null,{"$f":"IF(ISNUMBER(AF30),(VLOOKUP(AF30,$BO$6:$BP$50,2)),0)","v":0},{"$f":"IF(AF30<>\"\",5,0)","v":0},{"$f":"AG30+AH30","v":0},null,18,{"$f":"IF(ISNUMBER(AK30),(VLOOKUP(AK30,$BO$6:$BP$50,2)),0)","v":13},{"$f":"IF(AK30<>\"\",5,0)","v":5},{"$f":"AL30+AM30","v":18},null,16,{"$f":"IF(ISNUMBER(AP30),(VLOOKUP(AP30,$BO$6:$BP$50,2)),0)","v":15},{"$f":"IF(AP30<>\"\",5,0)","v":5},{"$f":"AQ30+AR30","v":20},null,25,{"$f":"IF(ISNUMBER(AU30),(VLOOKUP(AU30,$BO$6:$BP$50,2)),0)","v":6},{"$f":"IF(AU30<>\"\",5,0)","v":5},{"$f":"AV30+AW30","v":11},null,null,{"$f":"IF(ISNUMBER(AZ30),(VLOOKUP(AZ30,$BO$6:$BP$50,2)),0)","v":0},{"$f":"IF(AZ30<>\"\",5,0)","v":0},{"$f":"BA30+BB30","v":0},null,null,{"$f":"IF(ISNUMBER(BE30),(VLOOKUP(BE30,$BO$6:$BP$50,2)),0)","v":0},{"$f":"IF(BE30<>\"\",5,0)","v":0},{"$f":"BF30+BG30","v":0},null,null,{"$f":"IF(ISNUMBER(BJ30),(VLOOKUP(BJ30,$BO$6:$BP$50,2)),0)","v":0},{"$f":"IF(BJ30<>\"\",5,0)","v":0},{"$f":"BK30+BL30","v":0},null,25,6,0,{"$f":"IF($F25=7,1,0)","v":0},{"$f":"IF($F25=6,1,0)","v":0},{"$f":"IF($F25=5,1,0)","v":0},{"$f":"IF($F25=4,1,0)","v":0},{"$f":"IF($F25=3,1,0)","v":1},{"$f":"IF($F25=2,1,0)","v":0},{"$f":"IF($F25=1,1,0)","v":0}]
[{"$f":"IF(E31<E30,BO31,A30)","v":26},"Vigstad-Petersen","Tina","HSIL",{"$f":"IF(F31<=4,Q31,(Q31-SUM(SMALL(R31:Y31,{1;2;3;4}))))","v":46},{"$f":"(IF(AC31=5,1,0)+IF(AH31=5,1,0)+IF(AM31=5,1,0)+IF(AR31=5,1,0)+IF(AW31=5,1,0)+IF(BB31=5,1,0)+IF(BG31=5,1,0)+IF(BL31=5,1,0))","v":2},null,{"$f":"IF(AA31=\"\",\"\",AA31)","v":""},{"$f":"IF(AF31=\"\",\"\",AF31)","v":""},{"$f":"IF(AK31=\"\",\"\",AK31)","v":""},{"$f":"IF(AP31=\"\",\"\",AP31)","v":""},{"$f":"IF(AU31=\"\",\"\",AU31)","v":""},{"$f":"IF(AZ31=\"\",\"\",AZ31)","v":"dsq"},{"$f":"IF(BE31=\"\",\"\",BE31)","v":7},{"$f":"IF(BJ31=\"\",\"\",BJ31)","v":""},null,{"$f":"AD31+AI31+AN31+AS31+AX31+BC31+BH31","v":46},{"$f":"IF($F31>=5,IF(AB31=\"\",\"\",AB31),\"\")","v":""},{"$f":"IF($F31>=5,IF(AG31=\"\",\"\",AG31),\"\")","v":""},{"$f":"IF($F31>=5,IF(AL31=\"\",\"\",AL31),\"\")","v":""},{"$f":"IF($F31>=5,IF(AQ31=\"\",\"\",AQ31),\"\")","v":""},{"$f":"IF($F31>=5,IF(AV31=\"\",\"\",AV31),\"\")","v":""},{"$f":"IF($F31>=5,IF(BA31=\"\",\"\",BA31),\"\")","v":""},{"$f":"IF($F31>=5,IF(BF31=\"\",\"\",BF31),\"\")","v":""},{"$f":"IF($F31>=5,IF(BK31=\"\",\"\",BK31),\"\")","v":""},null,null,{"$f":"IF(ISNUMBER(AA31),(VLOOKUP(AA31,$BO$6:$BP$50,2)),0)","v":0},{"$f":"IF(AA31<>\"\",5,0)","v":0},{"$f":"AB31+AC31","v":0},null,null,{"$f":"IF(ISNUMBER(AF31),(VLOOKUP(AF31,$BO$6:$BP$50,2)),0)","v":0},{"$f":"IF(AF31<>\"\",5,0)","v":0},{"$f":"AG31+AH31","v":0},null,null,{"$f":"IF(ISNUMBER(AK31),(VLOOKUP(AK31,$BO$6:$BP$50,2)),0)","v":0},{"$f":"IF(AK31<>\"\",5,0)","v":0},{"$f":"AL31+AM31","v":0},null,null,{"$f":"IF(ISNUMBER(AP31),(VLOOKUP(AP31,$BO$6:$BP$50,2)),0)","v":0},{"$f":"IF(AP31<>\"\",5,0)","v":0},{"$f":"AQ31+AR31","v":0},null,null,{"$f":"IF(ISNUMBER(AU31),(VLOOKUP(AU31,$BO$6:$BP$50,2)),0)","v":0},{"$f":"IF(AU31<>\"\",5,0)","v":0},{"$f":"AV31+AW31","v":0},null,"dsq",{"$f":"IF(ISNUMBER(AZ31),(VLOOKUP(AZ31,$BO$6:$BP$50,2)),0)","v":0},{"$f":"IF(AZ31<>\"\",5,0)","v":5},{"$f":"BA31+BB31","v":5},null,7,{"$f":"IF(ISNUMBER(BE31),(VLOOKUP(BE31,$BO$6:$BP$50,2)),0)","v":36},{"$f":"IF(BE31<>\"\",5,0)","v":5},{"$f":"BF31+BG31","v":41},null,null,{"$f":"IF(ISNUMBER(BJ31),(VLOOKUP(BJ31,$BO$6:$BP$50,2)),0)","v":0},{"$f":"IF(BJ31<>\"\",5,0)","v":0},{"$f":"BK31+BL31","v":0},null,26,5,0,{"$f":"IF($F25=7,1,0)","v":0},{"$f":"IF($F25=6,1,0)","v":0},{"$f":"IF($F25=5,1,0)","v":0},{"$f":"IF($F25=4,1,0)","v":0},{"$f":"IF($F25=3,1,0)","v":1},{"$f":"IF($F25=2,1,0)","v":0},{"$f":"IF($F25=1,1,0)","v":0}]
[{"$f":"IF(E32<E31,BO32,A31)","v":27},"Kristoffersen","Kajsa Dahl","Ready",{"$f":"IF(F32<=4,Q32,(Q32-SUM(SMALL(R32:Y32,{1;2;3;4}))))","v":42},{"$f":"(IF(AC32=5,1,0)+IF(AH32=5,1,0)+IF(AM32=5,1,0)+IF(AR32=5,1,0)+IF(AW32=5,1,0)+IF(BB32=5,1,0)+IF(BG32=5,1,0)+IF(BL32=5,1,0))","v":3},null,{"$f":"IF(AA32=\"\",\"\",AA32)","v":""},{"$f":"IF(AF32=\"\",\"\",AF32)","v":""},{"$f":"IF(AK32=\"\",\"\",AK32)","v":20},{"$f":"IF(AP32=\"\",\"\",AP32)","v":19},{"$f":"IF(AU32=\"\",\"\",AU32)","v":27},{"$f":"IF(AZ32=\"\",\"\",AZ32)","v":""},{"$f":"IF(BE32=\"\",\"\",BE32)","v":""},{"$f":"IF(BJ32=\"\",\"\",BJ32)","v":""},null,{"$f":"AD32+AI32+AN32+AS32+AX32+BC32+BH32","v":42},{"$f":"IF($F32>=5,IF(AB32=\"\",\"\",AB32),\"\")","v":""},{"$f":"IF($F32>=5,IF(AG32=\"\",\"\",AG32),\"\")","v":""},{"$f":"IF($F32>=5,IF(AL32=\"\",\"\",AL32),\"\")","v":""},{"$f":"IF($F32>=5,IF(AQ32=\"\",\"\",AQ32),\"\")","v":""},{"$f":"IF($F32>=5,IF(AV32=\"\",\"\",AV32),\"\")","v":""},{"$f":"IF($F32>=5,IF(BA32=\"\",\"\",BA32),\"\")","v":""},{"$f":"IF($F32>=5,IF(BF32=\"\",\"\",BF32),\"\")","v":""},{"$f":"IF($F32>=5,IF(BK32=\"\",\"\",BK32),\"\")","v":""},null,null,{"$f":"IF(ISNUMBER(AA32),(VLOOKUP(AA32,$BO$6:$BP$50,2)),0)","v":0},{"$f":"IF(AA32<>\"\",5,0)","v":0},{"$f":"AB32+AC32","v":0},null,null,{"$f":"IF(ISNUMBER(AF32),(VLOOKUP(AF32,$BO$6:$BP$50,2)),0)","v":0},{"$f":"IF(AF32<>\"\",5,0)","v":0},{"$f":"AG32+AH32","v":0},null,20,{"$f":"IF(ISNUMBER(AK32),(VLOOKUP(AK32,$BO$6:$BP$50,2)),0)","v":11},{"$f":"IF(AK32<>\"\",5,0)","v":5},{"$f":"AL32+AM32","v":16},null,19,{"$f":"IF(ISNUMBER(AP32),(VLOOKUP(AP32,$BO$6:$BP$50,2)),0)","v":12},{"$f":"IF(AP32<>\"\",5,0)","v":5},{"$f":"AQ32+AR32","v":17},null,27,{"$f":"IF(ISNUMBER(AU32),(VLOOKUP(AU32,$BO$6:$BP$50,2)),0)","v":4},{"$f":"IF(AU32<>\"\",5,0)","v":5},{"$f":"AV32+AW32","v":9},null,null,{"$f":"IF(ISNUMBER(AZ32),(VLOOKUP(AZ32,$BO$6:$BP$50,2)),0)","v":0},{"$f":"IF(AZ32<>\"\",5,0)","v":0},{"$f":"BA32+BB32","v":0},null,null,{"$f":"IF(ISNUMBER(BE32),(VLOOKUP(BE32,$BO$6:$BP$50,2)),0)","v":0},{"$f":"IF(BE32<>\"\",5,0)","v":0},{"$f":"BF32+BG32","v":0},null,null,{"$f":"IF(ISNUMBER(BJ32),(VLOOKUP(BJ32,$BO$6:$BP$50,2)),0)","v":0},{"$f":"IF(BJ32<>\"\",5,0)","v":0},{"$f":"BK32+BL32","v":0},null,27,4,0,{"$f":"IF($F26=7,1,0)","v":0},{"$f":"IF($F26=6,1,0)","v":0},{"$f":"IF($F26=5,1,0)","v":0},{"$f":"IF($F26=4,1,0)","v":0},{"$f":"IF($F26=3,1,0)","v":0},{"$f":"IF($F26=2,1,0)","v":1},{"$f":"IF($F26=1,1,0)","v":0}]
[{"$f":"IF(E33<E32,BO33,A32)","v":28},"Christiansen","Aleksandra","Try",{"$f":"IF(F33<=4,Q33,(Q33-SUM(SMALL(R33:Y33,{1;2;3;4}))))","v":39},{"$f":"(IF(AC33=5,1,0)+IF(AH33=5,1,0)+IF(AM33=5,1,0)+IF(AR33=5,1,0)+IF(AW33=5,1,0)+IF(BB33=5,1,0)+IF(BG33=5,1,0)+IF(BL33=5,1,0))","v":2},null,{"$f":"IF(AA33=\"\",\"\",AA33)","v":""},{"$f":"IF(AF33=\"\",\"\",AF33)","v":""},{"$f":"IF(AK33=\"\",\"\",AK33)","v":""},{"$f":"IF(AP33=\"\",\"\",AP33)","v":15},{"$f":"IF(AU33=\"\",\"\",AU33)","v":18},{"$f":"IF(AZ33=\"\",\"\",AZ33)","v":""},{"$f":"IF(BE33=\"\",\"\",BE33)","v":""},{"$f":"IF(BJ33=\"\",\"\",BJ33)","v":""},null,{"$f":"AD33+AI33+AN33+AS33+AX33+BC33+BH33","v":39},{"$f":"IF($F33>=5,IF(AB33=\"\",\"\",AB33),\"\")","v":""},{"$f":"IF($F33>=5,IF(AG33=\"\",\"\",AG33),\"\")","v":""},{"$f":"IF($F33>=5,IF(AL33=\"\",\"\",AL33),\"\")","v":""},{"$f":"IF($F33>=5,IF(AQ33=\"\",\"\",AQ33),\"\")","v":""},{"$f":"IF($F33>=5,IF(AV33=\"\",\"\",AV33),\"\")","v":""},{"$f":"IF($F33>=5,IF(BA33=\"\",\"\",BA33),\"\")","v":""},{"$f":"IF($F33>=5,IF(BF33=\"\",\"\",BF33),\"\")","v":""},{"$f":"IF($F33>=5,IF(BK33=\"\",\"\",BK33),\"\")","v":""},null,null,{"$f":"IF(ISNUMBER(AA33),(VLOOKUP(AA33,$BO$6:$BP$50,2)),0)","v":0},{"$f":"IF(AA33<>\"\",5,0)","v":0},{"$f":"AB33+AC33","v":0},null,null,{"$f":"IF(ISNUMBER(AF33),(VLOOKUP(AF33,$BO$6:$BP$50,2)),0)","v":0},{"$f":"IF(AF33<>\"\",5,0)","v":0},{"$f":"AG33+AH33","v":0},null,null,{"$f":"IF(ISNUMBER(AK33),(VLOOKUP(AK33,$BO$6:$BP$50,2)),0)","v":0},{"$f":"IF(AK33<>\"\",5,0)","v":0},{"$f":"AL33+AM33","v":0},null,15,{"$f":"IF(ISNUMBER(AP33),(VLOOKUP(AP33,$BO$6:$BP$50,2)),0)","v":16},{"$f":"IF(AP33<>\"\",5,0)","v":5},{"$f":"AQ33+AR33","v":21},null,18,{"$f":"IF(ISNUMBER(AU33),(VLOOKUP(AU33,$BO$6:$BP$50,2)),0)","v":13},{"$f":"IF(AU33<>\"\",5,0)","v":5},{"$f":"AV33+AW33","v":18},null,null,{"$f":"IF(ISNUMBER(AZ33),(VLOOKUP(AZ33,$BO$6:$BP$50,2)),0)","v":0},{"$f":"IF(AZ33<>\"\",5,0)","v":0},{"$f":"BA33+BB33","v":0},null,null,{"$f":"IF(ISNUMBER(BE33),(VLOOKUP(BE33,$BO$6:$BP$50,2)),0)","v":0},{"$f":"IF(BE33<>\"\",5,0)","v":0},{"$f":"BF33+BG33","v":0},null,null,{"$f":"IF(ISNUMBER(BJ33),(VLOOKUP(BJ33,$BO$6:$BP$50,2)),0)","v":0},{"$f":"IF(BJ33<>\"\",5,0)","v":0},{"$f":"BK33+BL33","v":0},null,28,3,0,0,0,0,1,0,0,0]
[{"$f":"IF(E34<E33,BO34,A33)","v":29},"Veiteberg","Anna Elise","Ullensaker",{"$f":"IF(F34<=4,Q34,(Q34-SUM(SMALL(R34:Y34,{1;2;3;4}))))","v":34},{"$f":"(IF(AC34=5,1,0)+IF(AH34=5,1,0)+IF(AM34=5,1,0)+IF(AR34=5,1,0)+IF(AW34=5,1,0)+IF(BB34=5,1,0)+IF(BG34=5,1,0)+IF(BL34=5,1,0))","v":2},null,{"$f":"IF(AA34=\"\",\"\",AA34)","v":""},{"$f":"IF(AF34=\"\",\"\",AF34)","v":""},{"$f":"IF(AK34=\"\",\"\",AK34)","v":""},{"$f":"IF(AP34=\"\",\"\",AP34)","v":""},{"$f":"IF(AU34=\"\",\"\",AU34)","v":"dsq"},{"$f":"IF(AZ34=\"\",\"\",AZ34)","v":11},{"$f":"IF(BE34=\"\",\"\",BE34)","v":""},{"$f":"IF(BJ34=\"\",\"\",BJ34)","v":""},null,{"$f":"AD34+AI34+AN34+AS34+AX34+BC34+BH34","v":34},{"$f":"IF($F34>=5,IF(AB34=\"\",\"\",AB34),\"\")","v":""},{"$f":"IF($F34>=5,IF(AG34=\"\",\"\",AG34),\"\")","v":""},{"$f":"IF($F34>=5,IF(AL34=\"\",\"\",AL34),\"\")","v":""},{"$f":"IF($F34>=5,IF(AQ34=\"\",\"\",AQ34),\"\")","v":""},{"$f":"IF($F34>=5,IF(AV34=\"\",\"\",AV34),\"\")","v":""},{"$f":"IF($F34>=5,IF(BA34=\"\",\"\",BA34),\"\")","v":""},{"$f":"IF($F34>=5,IF(BF34=\"\",\"\",BF34),\"\")","v":""},{"$f":"IF($F34>=5,IF(BK34=\"\",\"\",BK34),\"\")","v":""},null,null,{"$f":"IF(ISNUMBER(AA34),(VLOOKUP(AA34,$BO$6:$BP$50,2)),0)","v":0},{"$f":"IF(AA34<>\"\",5,0)","v":0},{"$f":"AB34+AC34","v":0},null,null,{"$f":"IF(ISNUMBER(AF34),(VLOOKUP(AF34,$BO$6:$BP$50,2)),0)","v":0},{"$f":"IF(AF34<>\"\",5,0)","v":0},{"$f":"AG34+AH34","v":0},null,null,{"$f":"IF(ISNUMBER(AK34),(VLOOKUP(AK34,$BO$6:$BP$50,2)),0)","v":0},{"$f":"IF(AK34<>\"\",5,0)","v":0},{"$f":"AL34+AM34","v":0},null,null,{"$f":"IF(ISNUMBER(AP34),(VLOOKUP(AP34,$BO$6:$BP$50,2)),0)","v":0},{"$f":"IF(AP34<>\"\",5,0)","v":0},{"$f":"AQ34+AR34","v":0},null,"dsq",{"$f":"IF(ISNUMBER(AU34),(VLOOKUP(AU34,$BO$6:$BP$50,2)),0)","v":0},{"$f":"IF(AU34<>\"\",5,0)","v":5},{"$f":"AV34+AW34","v":5},null,11,{"$f":"IF(ISNUMBER(AZ34),(VLOOKUP(AZ34,$BO$6:$BP$50,2)),0)","v":24},{"$f":"IF(AZ34<>\"\",5,0)","v":5},{"$f":"BA34+BB34","v":29},null,null,{"$f":"IF(ISNUMBER(BE34),(VLOOKUP(BE34,$BO$6:$BP$50,2)),0)","v":0},{"$f":"IF(BE34<>\"\",5,0)","v":0},{"$f":"BF34+BG34","v":0},null,null,{"$f":"IF(ISNUMBER(BJ34),(VLOOKUP(BJ34,$BO$6:$BP$50,2)),0)","v":0},{"$f":"IF(BJ34<>\"\",5,0)","v":0},{"$f":"BK34+BL34","v":0},null,29,2,0,0,0,0,0,0,0,1]
[{"$f":"IF(E35<E34,BO35,A34)","v":30},"Størmer-Nilsen","Filippa","Heming",{"$f":"IF(F35<=4,Q35,(Q35-SUM(SMALL(R35:Y35,{1;2;3;4}))))","v":29},{"$f":"(IF(AC35=5,1,0)+IF(AH35=5,1,0)+IF(AM35=5,1,0)+IF(AR35=5,1,0)+IF(AW35=5,1,0)+IF(BB35=5,1,0)+IF(BG35=5,1,0)+IF(BL35=5,1,0))","v":1},null,{"$f":"IF(AA35=\"\",\"\",AA35)","v":""},{"$f":"IF(AF35=\"\",\"\",AF35)","v":""},{"$f":"IF(AK35=\"\",\"\",AK35)","v":""},{"$f":"IF(AP35=\"\",\"\",AP35)","v":""},{"$f":"IF(AU35=\"\",\"\",AU35)","v":11},{"$f":"IF(AZ35=\"\",\"\",AZ35)","v":""},{"$f":"IF(BE35=\"\",\"\",BE35)","v":""},{"$f":"IF(BJ35=\"\",\"\",BJ35)","v":""},null,{"$f":"AD35+AI35+AN35+AS35+AX35+BC35+BH35","v":29},{"$f":"IF($F35>=5,IF(AB35=\"\",\"\",AB35),\"\")","v":""},{"$f":"IF($F35>=5,IF(AG35=\"\",\"\",AG35),\"\")","v":""},{"$f":"IF($F35>=5,IF(AL35=\"\",\"\",AL35),\"\")","v":""},{"$f":"IF($F35>=5,IF(AQ35=\"\",\"\",AQ35),\"\")","v":""},{"$f":"IF($F35>=5,IF(AV35=\"\",\"\",AV35),\"\")","v":""},{"$f":"IF($F35>=5,IF(BA35=\"\",\"\",BA35),\"\")","v":""},{"$f":"IF($F35>=5,IF(BF35=\"\",\"\",BF35),\"\")","v":""},{"$f":"IF($F35>=5,IF(BK35=\"\",\"\",BK35),\"\")","v":""},null,null,{"$f":"IF(ISNUMBER(AA35),(VLOOKUP(AA35,$BO$6:$BP$50,2)),0)","v":0},{"$f":"IF(AA35<>\"\",5,0)","v":0},{"$f":"AB35+AC35","v":0},null,null,{"$f":"IF(ISNUMBER(AF35),(VLOOKUP(AF35,$BO$6:$BP$50,2)),0)","v":0},{"$f":"IF(AF35<>\"\",5,0)","v":0},{"$f":"AG35+AH35","v":0},null,null,{"$f":"IF(ISNUMBER(AK35),(VLOOKUP(AK35,$BO$6:$BP$50,2)),0)","v":0},{"$f":"IF(AK35<>\"\",5,0)","v":0},{"$f":"AL35+AM35","v":0},null,null,{"$f":"IF(ISNUMBER(AP35),(VLOOKUP(AP35,$BO$6:$BP$50,2)),0)","v":0},{"$f":"IF(AP35<>\"\",5,0)","v":0},{"$f":"AQ35+AR35","v":0},null,11,{"$f":"IF(ISNUMBER(AU35),(VLOOKUP(AU35,$BO$6:$BP$50,2)),0)","v":24},{"$f":"IF(AU35<>\"\",5,0)","v":5},{"$f":"AV35+AW35","v":29},null,null,{"$f":"IF(ISNUMBER(AZ35),(VLOOKUP(AZ35,$BO$6:$BP$50,2)),0)","v":0},{"$f":"IF(AZ35<>\"\",5,0)","v":0},{"$f":"BA35+BB35","v":0},null,null,{"$f":"IF(ISNUMBER(BE35),(VLOOKUP(BE35,$BO$6:$BP$50,2)),0)","v":0},{"$f":"IF(BE35<>\"\",5,0)","v":0},{"$f":"BF35+BG35","v":0},null,null,{"$f":"IF(ISNUMBER(BJ35),(VLOOKUP(BJ35,$BO$6:$BP$50,2)),0)","v":0},{"$f":"IF(BJ35<>\"\",5,0)","v":0},{"$f":"BK35+BL35","v":0},null,30,1,0,{"$f":"IF($F26=7,1,0)","v":0},{"$f":"IF($F26=6,1,0)","v":0},{"$f":"IF($F26=5,1,0)","v":0},{"$f":"IF($F26=4,1,0)","v":0},{"$f":"IF($F26=3,1,0)","v":0},{"$f":"IF($F26=2,1,0)","v":1},{"$f":"IF($F26=1,1,0)","v":0}]
[{"$f":"IF(E36<E35,BO36,A35)","v":31},"Bergh","Karoline Molland","Heming",{"$f":"IF(F36<=4,Q36,(Q36-SUM(SMALL(R36:Y36,{1;2;3;4}))))","v":27},{"$f":"(IF(AC36=5,1,0)+IF(AH36=5,1,0)+IF(AM36=5,1,0)+IF(AR36=5,1,0)+IF(AW36=5,1,0)+IF(BB36=5,1,0)+IF(BG36=5,1,0)+IF(BL36=5,1,0))","v":1},null,{"$f":"IF(AA36=\"\",\"\",AA36)","v":""},{"$f":"IF(AF36=\"\",\"\",AF36)","v":""},{"$f":"IF(AK36=\"\",\"\",AK36)","v":""},{"$f":"IF(AP36=\"\",\"\",AP36)","v":""},{"$f":"IF(AU36=\"\",\"\",AU36)","v":""},{"$f":"IF(AZ36=\"\",\"\",AZ36)","v":""},{"$f":"IF(BE36=\"\",\"\",BE36)","v":12},{"$f":"IF(BJ36=\"\",\"\",BJ36)","v":""},null,{"$f":"AD36+AI36+AN36+AS36+AX36+BC36+BH36","v":27},{"$f":"IF($F36>=5,IF(AB36=\"\",\"\",AB36),\"\")","v":""},{"$f":"IF($F36>=5,IF(AG36=\"\",\"\",AG36),\"\")","v":""},{"$f":"IF($F36>=5,IF(AL36=\"\",\"\",AL36),\"\")","v":""},{"$f":"IF($F36>=5,IF(AQ36=\"\",\"\",AQ36),\"\")","v":""},{"$f":"IF($F36>=5,IF(AV36=\"\",\"\",AV36),\"\")","v":""},{"$f":"IF($F36>=5,IF(BA36=\"\",\"\",BA36),\"\")","v":""},{"$f":"IF($F36>=5,IF(BF36=\"\",\"\",BF36),\"\")","v":""},{"$f":"IF($F36>=5,IF(BK36=\"\",\"\",BK36),\"\")","v":""},null,null,{"$f":"IF(ISNUMBER(AA36),(VLOOKUP(AA36,$BO$6:$BP$50,2)),0)","v":0},{"$f":"IF(AA36<>\"\",5,0)","v":0},{"$f":"AB36+AC36","v":0},null,null,{"$f":"IF(ISNUMBER(AF36),(VLOOKUP(AF36,$BO$6:$BP$50,2)),0)","v":0},{"$f":"IF(AF36<>\"\",5,0)","v":0},{"$f":"AG36+AH36","v":0},null,null,{"$f":"IF(ISNUMBER(AK36),(VLOOKUP(AK36,$BO$6:$BP$50,2)),0)","v":0},{"$f":"IF(AK36<>\"\",5,0)","v":0},{"$f":"AL36+AM36","v":0},null,null,{"$f":"IF(ISNUMBER(AP36),(VLOOKUP(AP36,$BO$6:$BP$50,2)),0)","v":0},{"$f":"IF(AP36<>\"\",5,0)","v":0},{"$f":"AQ36+AR36","v":0},null,null,{"$f":"IF(ISNUMBER(AU36),(VLOOKUP(AU36,$BO$6:$BP$50,2)),0)","v":0},{"$f":"IF(AU36<>\"\",5,0)","v":0},{"$f":"AV36+AW36","v":0},null,null,{"$f":"IF(ISNUMBER(AZ36),(VLOOKUP(AZ36,$BO$6:$BP$50,2)),0)","v":0},{"$f":"IF(AZ36<>\"\",5,0)","v":0},{"$f":"BA36+BB36","v":0},null,12,{"$f":"IF(ISNUMBER(BE36),(VLOOKUP(BE36,$BO$6:$BP$50,2)),0)","v":22},{"$f":"IF(BE36<>\"\",5,0)","v":5},{"$f":"BF36+BG36","v":27},null,null,{"$f":"IF(ISNUMBER(BJ36),(VLOOKUP(BJ36,$BO$6:$BP$50,2)),0)","v":0},{"$f":"IF(BJ36<>\"\",5,0)","v":0},{"$f":"BK36+BL36","v":0},null,31,0,0,0,0,0,1,0,0,0]
[{"$f":"IF(E37<E36,BO37,A36)","v":32},"Mannion","Nora Isabel","Ullensaker",{"$f":"IF(F37<=4,Q37,(Q37-SUM(SMALL(R37:Y37,{1;2;3;4}))))","v":23},{"$f":"(IF(AC37=5,1,0)+IF(AH37=5,1,0)+IF(AM37=5,1,0)+IF(AR37=5,1,0)+IF(AW37=5,1,0)+IF(BB37=5,1,0)+IF(BG37=5,1,0)+IF(BL37=5,1,0))","v":1},null,{"$f":"IF(AA37=\"\",\"\",AA37)","v":""},{"$f":"IF(AF37=\"\",\"\",AF37)","v":""},{"$f":"IF(AK37=\"\",\"\",AK37)","v":""},{"$f":"IF(AP37=\"\",\"\",AP37)","v":""},{"$f":"IF(AU37=\"\",\"\",AU37)","v":14},{"$f":"IF(AZ37=\"\",\"\",AZ37)","v":""},{"$f":"IF(BE37=\"\",\"\",BE37)","v":""},{"$f":"IF(BJ37=\"\",\"\",BJ37)","v":""},null,{"$f":"AD37+AI37+AN37+AS37+AX37+BC37+BH37","v":23},{"$f":"IF($F37>=5,IF(AB37=\"\",\"\",AB37),\"\")","v":""},{"$f":"IF($F37>=5,IF(AG37=\"\",\"\",AG37),\"\")","v":""},{"$f":"IF($F37>=5,IF(AL37=\"\",\"\",AL37),\"\")","v":""},{"$f":"IF($F37>=5,IF(AQ37=\"\",\"\",AQ37),\"\")","v":""},{"$f":"IF($F37>=5,IF(AV37=\"\",\"\",AV37),\"\")","v":""},{"$f":"IF($F37>=5,IF(BA37=\"\",\"\",BA37),\"\")","v":""},{"$f":"IF($F37>=5,IF(BF37=\"\",\"\",BF37),\"\")","v":""},{"$f":"IF($F37>=5,IF(BK37=\"\",\"\",BK37),\"\")","v":""},null,null,{"$f":"IF(ISNUMBER(AA37),(VLOOKUP(AA37,$BO$6:$BP$50,2)),0)","v":0},{"$f":"IF(AA37<>\"\",5,0)","v":0},{"$f":"AB37+AC37","v":0},null,null,{"$f":"IF(ISNUMBER(AF37),(VLOOKUP(AF37,$BO$6:$BP$50,2)),0)","v":0},{"$f":"IF(AF37<>\"\",5,0)","v":0},{"$f":"AG37+AH37","v":0},null,null,{"$f":"IF(ISNUMBER(AK37),(VLOOKUP(AK37,$BO$6:$BP$50,2)),0)","v":0},{"$f":"IF(AK37<>\"\",5,0)","v":0},{"$f":"AL37+AM37","v":0},null,null,{"$f":"IF(ISNUMBER(AP37),(VLOOKUP(AP37,$BO$6:$BP$50,2)),0)","v":0},{"$f":"IF(AP37<>\"\",5,0)","v":0},{"$f":"AQ37+AR37","v":0},null,14,{"$f":"IF(ISNUMBER(AU37),(VLOOKUP(AU37,$BO$6:$BP$50,2)),0)","v":18},{"$f":"IF(AU37<>\"\",5,0)","v":5},{"$f":"AV37+AW37","v":23},null,null,{"$f":"IF(ISNUMBER(AZ37),(VLOOKUP(AZ37,$BO$6:$BP$50,2)),0)","v":0},{"$f":"IF(AZ37<>\"\",5,0)","v":0},{"$f":"BA37+BB37","v":0},null,null,{"$f":"IF(ISNUMBER(BE37),(VLOOKUP(BE37,$BO$6:$BP$50,2)),0)","v":0},{"$f":"IF(BE37<>\"\",5,0)","v":0},{"$f":"BF37+BG37","v":0},null,null,{"$f":"IF(ISNUMBER(BJ37),(VLOOKUP(BJ37,$BO$6:$BP$50,2)),0)","v":0},{"$f":"IF(BJ37<>\"\",5,0)","v":0},{"$f":"BK37+BL37","v":0},null,32,0,0,0,0,0,0,0,0,1]
[{"$f":"IF(E38<E37,BO38,A37)","v":33},"Karlstrøm","Tomine","Heming",{"$f":"IF(F38<=4,Q38,(Q38-SUM(SMALL(R38:Y38,{1;2;3;4}))))","v":20},{"$f":"(IF(AC38=5,1,0)+IF(AH38=5,1,0)+IF(AM38=5,1,0)+IF(AR38=5,1,0)+IF(AW38=5,1,0)+IF(BB38=5,1,0)+IF(BG38=5,1,0)+IF(BL38=5,1,0))","v":1},null,{"$f":"IF(AA38=\"\",\"\",AA38)","v":""},{"$f":"IF(AF38=\"\",\"\",AF38)","v":""},{"$f":"IF(AK38=\"\",\"\",AK38)","v":16},{"$f":"IF(AP38=\"\",\"\",AP38)","v":""},{"$f":"IF(AU38=\"\",\"\",AU38)","v":""},{"$f":"IF(AZ38=\"\",\"\",AZ38)","v":""},{"$f":"IF(BE38=\"\",\"\",BE38)","v":""},{"$f":"IF(BJ38=\"\",\"\",BJ38)","v":""},null,{"$f":"AD38+AI38+AN38+AS38+AX38+BC38+BH38","v":20},{"$f":"IF($F38>=5,IF(AB38=\"\",\"\",AB38),\"\")","v":""},{"$f":"IF($F38>=5,IF(AG38=\"\",\"\",AG38),\"\")","v":""},{"$f":"IF($F38>=5,IF(AL38=\"\",\"\",AL38),\"\")","v":""},{"$f":"IF($F38>=5,IF(AQ38=\"\",\"\",AQ38),\"\")","v":""},{"$f":"IF($F38>=5,IF(AV38=\"\",\"\",AV38),\"\")","v":""},{"$f":"IF($F38>=5,IF(BA38=\"\",\"\",BA38),\"\")","v":""},{"$f":"IF($F38>=5,IF(BF38=\"\",\"\",BF38),\"\")","v":""},{"$f":"IF($F38>=5,IF(BK38=\"\",\"\",BK38),\"\")","v":""},null,null,{"$f":"IF(ISNUMBER(AA38),(VLOOKUP(AA38,$BO$6:$BP$50,2)),0)","v":0},{"$f":"IF(AA38<>\"\",5,0)","v":0},{"$f":"AB38+AC38","v":0},null,null,{"$f":"IF(ISNUMBER(AF38),(VLOOKUP(AF38,$BO$6:$BP$50,2)),0)","v":0},{"$f":"IF(AF38<>\"\",5,0)","v":0},{"$f":"AG38+AH38","v":0},null,16,{"$f":"IF(ISNUMBER(AK38),(VLOOKUP(AK38,$BO$6:$BP$50,2)),0)","v":15},{"$f":"IF(AK38<>\"\",5,0)","v":5},{"$f":"AL38+AM38","v":20},null,null,{"$f":"IF(ISNUMBER(AP38),(VLOOKUP(AP38,$BO$6:$BP$50,2)),0)","v":0},{"$f":"IF(AP38<>\"\",5,0)","v":0},{"$f":"AQ38+AR38","v":0},null,null,{"$f":"IF(ISNUMBER(AU38),(VLOOKUP(AU38,$BO$6:$BP$50,2)),0)","v":0},{"$f":"IF(AU38<>\"\",5,0)","v":0},{"$f":"AV38+AW38","v":0},null,null,{"$f":"IF(ISNUMBER(AZ38),(VLOOKUP(AZ38,$BO$6:$BP$50,2)),0)","v":0},{"$f":"IF(AZ38<>\"\",5,0)","v":0},{"$f":"BA38+BB38","v":0},null,null,{"$f":"IF(ISNUMBER(BE38),(VLOOKUP(BE38,$BO$6:$BP$50,2)),0)","v":0},{"$f":"IF(BE38<>\"\",5,0)","v":0},{"$f":"BF38+BG38","v":0},null,null,{"$f":"IF(ISNUMBER(BJ38),(VLOOKUP(BJ38,$BO$6:$BP$50,2)),0)","v":0},{"$f":"IF(BJ38<>\"\",5,0)","v":0},{"$f":"BK38+BL38","v":0},null,33,0,0,0,0,0,0,0,0,1]
[{"$f":"IF(E39<E38,BO39,A38)","v":34},"Flaaten","Filippa","Heming",{"$f":"IF(F39<=4,Q39,(Q39-SUM(SMALL(R39:Y39,{1;2;3;4}))))","v":14},{"$f":"(IF(AC39=5,1,0)+IF(AH39=5,1,0)+IF(AM39=5,1,0)+IF(AR39=5,1,0)+IF(AW39=5,1,0)+IF(BB39=5,1,0)+IF(BG39=5,1,0)+IF(BL39=5,1,0))","v":1},null,{"$f":"IF(AA39=\"\",\"\",AA39)","v":""},{"$f":"IF(AF39=\"\",\"\",AF39)","v":""},{"$f":"IF(AK39=\"\",\"\",AK39)","v":""},{"$f":"IF(AP39=\"\",\"\",AP39)","v":""},{"$f":"IF(AU39=\"\",\"\",AU39)","v":22},{"$f":"IF(AZ39=\"\",\"\",AZ39)","v":""},{"$f":"IF(BE39=\"\",\"\",BE39)","v":""},{"$f":"IF(BJ39=\"\",\"\",BJ39)","v":""},null,{"$f":"AD39+AI39+AN39+AS39+AX39+BC39+BH39","v":14},{"$f":"IF($F30>=5,IF(AB39=\"\",\"\",AB39),\"\")","v":""},{"$f":"IF($F30>=5,IF(AG39=\"\",\"\",AG39),\"\")","v":""},{"$f":"IF($F30>=5,IF(AL39=\"\",\"\",AL39),\"\")","v":""},{"$f":"IF($F30>=5,IF(AQ39=\"\",\"\",AQ39),\"\")","v":""},{"$f":"IF($F30>=5,IF(AR39=\"\",\"\",AR39),\"\")","v":""},{"$f":"IF($F30>=5,IF(AV39=\"\",\"\",AV39),\"\")","v":""},{"$f":"IF($F30>=5,IF(BA39=\"\",\"\",BA39),\"\")","v":""},{"$f":"IF($F30>=5,IF(BF39=\"\",\"\",BF39),\"\")","v":""},null,null,{"$f":"IF(ISNUMBER(AA39),(VLOOKUP(AA39,$BO$6:$BP$50,2)),0)","v":0},{"$f":"IF(AA39<>\"\",5,0)","v":0},{"$f":"AB39+AC39","v":0},null,null,{"$f":"IF(ISNUMBER(AF39),(VLOOKUP(AF39,$BO$6:$BP$50,2)),0)","v":0},{"$f":"IF(AF39<>\"\",5,0)","v":0},{"$f":"AG39+AH39","v":0},null,null,{"$f":"IF(ISNUMBER(AK39),(VLOOKUP(AK39,$BO$6:$BP$50,2)),0)","v":0},{"$f":"IF(AK39<>\"\",5,0)","v":0},{"$f":"AL39+AM39","v":0},null,null,{"$f":"IF(ISNUMBER(AP39),(VLOOKUP(AP39,$BO$6:$BP$50,2)),0)","v":0},{"$f":"IF(AP39<>\"\",5,0)","v":0},{"$f":"AQ39+AR39","v":0},null,22,{"$f":"IF(ISNUMBER(AU39),(VLOOKUP(AU39,$BO$6:$BP$50,2)),0)","v":9},{"$f":"IF(AU39<>\"\",5,0)","v":5},{"$f":"AV39+AW39","v":14},null,null,{"$f":"IF(ISNUMBER(AZ39),(VLOOKUP(AZ39,$BO$6:$BP$50,2)),0)","v":0},{"$f":"IF(AZ39<>\"\",5,0)","v":0},{"$f":"BA39+BB39","v":0},null,null,{"$f":"IF(ISNUMBER(BE39),(VLOOKUP(BE39,$BO$6:$BP$50,2)),0)","v":0},{"$f":"IF(BE39<>\"\",5,0)","v":0},{"$f":"BF39+BG39","v":0},null,null,{"$f":"IF(ISNUMBER(BJ39),(VLOOKUP(BJ39,$BO$6:$BP$50,2)),0)","v":0},{"$f":"IF(BJ39<>\"\",5,0)","v":0},{"$f":"BK39+BL39","v":0},null,34,0,0,0,0,0,0,1,0,0]
[{"$f":"IF(E40<E39,BO40,A39)","v":35},"Myrbø","Maria Isabelle","Try",{"$f":"IF(F40<=4,Q40,(Q40-SUM(SMALL(R40:Y40,{1;2;3;4}))))","v":7},{"$f":"(IF(AC40=5,1,0)+IF(AH40=5,1,0)+IF(AM40=5,1,0)+IF(AR40=5,1,0)+IF(AW40=5,1,0)+IF(BB40=5,1,0)+IF(BG40=5,1,0)+IF(BL40=5,1,0))","v":1},null,{"$f":"IF(AA40=\"\",\"\",AA40)","v":""},{"$f":"IF(AF40=\"\",\"\",AF40)","v":""},{"$f":"IF(AK40=\"\",\"\",AK40)","v":""},{"$f":"IF(AP40=\"\",\"\",AP40)","v":""},{"$f":"IF(AU40=\"\",\"\",AU40)","v":29},{"$f":"IF(AZ40=\"\",\"\",AZ40)","v":""},{"$f":"IF(BE40=\"\",\"\",BE40)","v":""},{"$f":"IF(BJ40=\"\",\"\",BJ40)","v":""},null,{"$f":"AD40+AI40+AN40+AS40+AX40+BC40+BH40","v":7},{"$f":"IF($F31>=5,IF(AB40=\"\",\"\",AB40),\"\")","v":""},{"$f":"IF($F31>=5,IF(AG40=\"\",\"\",AG40),\"\")","v":""},{"$f":"IF($F31>=5,IF(AL40=\"\",\"\",AL40),\"\")","v":""},{"$f":"IF($F31>=5,IF(AQ40=\"\",\"\",AQ40),\"\")","v":""},{"$f":"IF($F31>=5,IF(AR40=\"\",\"\",AR40),\"\")","v":""},{"$f":"IF($F31>=5,IF(AV40=\"\",\"\",AV40),\"\")","v":""},{"$f":"IF($F31>=5,IF(BA40=\"\",\"\",BA40),\"\")","v":""},{"$f":"IF($F31>=5,IF(BF40=\"\",\"\",BF40),\"\")","v":""},null,null,{"$f":"IF(ISNUMBER(AA40),(VLOOKUP(AA40,$BO$6:$BP$50,2)),0)","v":0},{"$f":"IF(AA40<>\"\",5,0)","v":0},{"$f":"AB40+AC40","v":0},null,null,{"$f":"IF(ISNUMBER(AF40),(VLOOKUP(AF40,$BO$6:$BP$50,2)),0)","v":0},{"$f":"IF(AF40<>\"\",5,0)","v":0},{"$f":"AG40+AH40","v":0},null,null,{"$f":"IF(ISNUMBER(AK40),(VLOOKUP(AK40,$BO$6:$BP$50,2)),0)","v":0},{"$f":"IF(AK40<>\"\",5,0)","v":0},{"$f":"AL40+AM40","v":0},null,null,{"$f":"IF(ISNUMBER(AP40),(VLOOKUP(AP40,$BO$6:$BP$50,2)),0)","v":0},{"$f":"IF(AP40<>\"\",5,0)","v":0},{"$f":"AQ40+AR40","v":0},null,29,{"$f":"IF(ISNUMBER(AU40),(VLOOKUP(AU40,$BO$6:$BP$50,2)),0)","v":2},{"$f":"IF(AU40<>\"\",5,0)","v":5},{"$f":"AV40+AW40","v":7},null,null,{"$f":"IF(ISNUMBER(AZ40),(VLOOKUP(AZ40,$BO$6:$BP$50,2)),0)","v":0},{"$f":"IF(AZ40<>\"\",5,0)","v":0},{"$f":"BA40+BB40","v":0},null,null,{"$f":"IF(ISNUMBER(BE40),(VLOOKUP(BE40,$BO$6:$BP$50,2)),0)","v":0},{"$f":"IF(BE40<>\"\",5,0)","v":0},{"$f":"BF40+BG40","v":0},null,null,{"$f":"IF(ISNUMBER(BJ40),(VLOOKUP(BJ40,$BO$6:$BP$50,2)),0)","v":0},{"$f":"IF(BJ40<>\"\",5,0)","v":0},{"$f":"BK40+BL40","v":0},null,35,0,0,0,0,0,0,0,1,0]
[{"$f":"IF(E41<E40,BO41,A40)","v":36},"Kopp","Vilhelmine","Try",{"$f":"IF(F41<=4,Q41,(Q41-SUM(SMALL(R41:Y41,{1;2;3;4}))))","v":6},{"$f":"(IF(AC41=5,1,0)+IF(AH41=5,1,0)+IF(AM41=5,1,0)+IF(AR41=5,1,0)+IF(AW41=5,1,0)+IF(BB41=5,1,0)+IF(BG41=5,1,0)+IF(BL41=5,1,0))","v":1},null,{"$f":"IF(AA41=\"\",\"\",AA41)","v":""},{"$f":"IF(AF41=\"\",\"\",AF41)","v":""},{"$f":"IF(AK41=\"\",\"\",AK41)","v":""},{"$f":"IF(AP41=\"\",\"\",AP41)","v":""},{"$f":"IF(AU41=\"\",\"\",AU41)","v":30},{"$f":"IF(AZ41=\"\",\"\",AZ41)","v":""},{"$f":"IF(BE41=\"\",\"\",BE41)","v":""},{"$f":"IF(BJ41=\"\",\"\",BJ41)","v":""},null,{"$f":"AD41+AI41+AN41+AS41+AX41+BC41+BH41","v":6},{"$f":"IF($F32>=5,IF(AB41=\"\",\"\",AB41),\"\")","v":""},{"$f":"IF($F32>=5,IF(AG41=\"\",\"\",AG41),\"\")","v":""},{"$f":"IF($F32>=5,IF(AL41=\"\",\"\",AL41),\"\")","v":""},{"$f":"IF($F32>=5,IF(AQ41=\"\",\"\",AQ41),\"\")","v":""},{"$f":"IF($F32>=5,IF(AR41=\"\",\"\",AR41),\"\")","v":""},{"$f":"IF($F32>=5,IF(AV41=\"\",\"\",AV41),\"\")","v":""},{"$f":"IF($F32>=5,IF(BA41=\"\",\"\",BA41),\"\")","v":""},{"$f":"IF($F32>=5,IF(BF41=\"\",\"\",BF41),\"\")","v":""},null,null,{"$f":"IF(ISNUMBER(AA41),(VLOOKUP(AA41,$BO$6:$BP$50,2)),0)","v":0},{"$f":"IF(AA41<>\"\",5,0)","v":0},{"$f":"AB41+AC41","v":0},null,null,{"$f":"IF(ISNUMBER(AF41),(VLOOKUP(AF41,$BO$6:$BP$50,2)),0)","v":0},{"$f":"IF(AF41<>\"\",5,0)","v":0},{"$f":"AG41+AH41","v":0},null,null,{"$f":"IF(ISNUMBER(AK41),(VLOOKUP(AK41,$BO$6:$BP$50,2)),0)","v":0},{"$f":"IF(AK41<>\"\",5,0)","v":0},{"$f":"AL41+AM41","v":0},null,null,{"$f":"IF(ISNUMBER(AP41),(VLOOKUP(AP41,$BO$6:$BP$50,2)),0)","v":0},{"$f":"IF(AP41<>\"\",5,0)","v":0},{"$f":"AQ41+AR41","v":0},null,30,{"$f":"IF(ISNUMBER(AU41),(VLOOKUP(AU41,$BO$6:$BP$50,2)),0)","v":1},{"$f":"IF(AU41<>\"\",5,0)","v":5},{"$f":"AV41+AW41","v":6},null,null,{"$f":"IF(ISNUMBER(AZ41),(VLOOKUP(AZ41,$BO$6:$BP$50,2)),0)","v":0},{"$f":"IF(AZ41<>\"\",5,0)","v":0},{"$f":"BA41+BB41","v":0},null,null,{"$f":"IF(ISNUMBER(BE41),(VLOOKUP(BE41,$BO$6:$BP$50,2)),0)","v":0},{"$f":"IF(BE41<>\"\",5,0)","v":0},{"$f":"BF41+BG41","v":0},null,null,{"$f":"IF(ISNUMBER(BJ41),(VLOOKUP(BJ41,$BO$6:$BP$50,2)),0)","v":0},{"$f":"IF(BJ41<>\"\",5,0)","v":0},{"$f":"BK41+BL41","v":0},null,36,0,0,0,0,0,0,1,0,0]
[{"$f":"IF(E42<E41,BO42,A41)","v":37},"Gras","Anais","Ljan",{"$f":"IF(F42<=4,Q42,(Q42-SUM(SMALL(R42:Y42,{1;2;3;4}))))","v":5},{"$f":"(IF(AC42=5,1,0)+IF(AH42=5,1,0)+IF(AM42=5,1,0)+IF(AR42=5,1,0)+IF(AW42=5,1,0)+IF(BB42=5,1,0)+IF(BG42=5,1,0)+IF(BL42=5,1,0))","v":1},null,{"$f":"IF(AA42=\"\",\"\",AA42)","v":""},{"$f":"IF(AF42=\"\",\"\",AF42)","v":"dsq"},{"$f":"IF(AK42=\"\",\"\",AK42)","v":""},{"$f":"IF(AP42=\"\",\"\",AP42)","v":""},{"$f":"IF(AU42=\"\",\"\",AU42)","v":""},{"$f":"IF(AZ42=\"\",\"\",AZ42)","v":""},{"$f":"IF(BE42=\"\",\"\",BE42)","v":""},{"$f":"IF(BJ42=\"\",\"\",BJ42)","v":""},null,{"$f":"AD42+AI42+AN42+AS42+AX42+BC42+BH42","v":5},{"$f":"IF($F33>=5,IF(AB42=\"\",\"\",AB42),\"\")","v":""},{"$f":"IF($F33>=5,IF(AG42=\"\",\"\",AG42),\"\")","v":""},{"$f":"IF($F33>=5,IF(AL42=\"\",\"\",AL42),\"\")","v":""},{"$f":"IF($F33>=5,IF(AQ42=\"\",\"\",AQ42),\"\")","v":""},{"$f":"IF($F33>=5,IF(AR42=\"\",\"\",AR42),\"\")","v":""},{"$f":"IF($F33>=5,IF(AV42=\"\",\"\",AV42),\"\")","v":""},{"$f":"IF($F33>=5,IF(BA42=\"\",\"\",BA42),\"\")","v":""},{"$f":"IF($F33>=5,IF(BF42=\"\",\"\",BF42),\"\")","v":""},null,null,{"$f":"IF(ISNUMBER(AA42),(VLOOKUP(AA42,$BO$6:$BP$50,2)),0)","v":0},{"$f":"IF(AA42<>\"\",5,0)","v":0},{"$f":"AB42+AC42","v":0},null,"dsq",{"$f":"IF(ISNUMBER(AF42),(VLOOKUP(AF42,$BO$6:$BP$50,2)),0)","v":0},{"$f":"IF(AF42<>\"\",5,0)","v":5},{"$f":"AG42+AH42","v":5},null,null,{"$f":"IF(ISNUMBER(AK42),(VLOOKUP(AK42,$BO$6:$BP$50,2)),0)","v":0},{"$f":"IF(AK42<>\"\",5,0)","v":0},{"$f":"AL42+AM42","v":0},null,null,{"$f":"IF(ISNUMBER(AP42),(VLOOKUP(AP42,$BO$6:$BP$50,2)),0)","v":0},{"$f":"IF(AP42<>\"\",5,0)","v":0},{"$f":"AQ42+AR42","v":0},null,null,{"$f":"IF(ISNUMBER(AU42),(VLOOKUP(AU42,$BO$6:$BP$50,2)),0)","v":0},{"$f":"IF(AU42<>\"\",5,0)","v":0},{"$f":"AV42+AW42","v":0},null,null,{"$f":"IF(ISNUMBER(AZ42),(VLOOKUP(AZ42,$BO$6:$BP$50,2)),0)","v":0},{"$f":"IF(AZ42<>\"\",5,0)","v":0},{"$f":"BA42+BB42","v":0},null,null,{"$f":"IF(ISNUMBER(BE42),(VLOOKUP(BE42,$BO$6:$BP$50,2)),0)","v":0},{"$f":"IF(BE42<>\"\",5,0)","v":0},{"$f":"BF42+BG42","v":0},null,null,{"$f":"IF(ISNUMBER(BJ42),(VLOOKUP(BJ42,$BO$6:$BP$50,2)),0)","v":0},{"$f":"IF(BJ42<>\"\",5,0)","v":0},{"$f":"BK42+BL42","v":0},null,37,0,0,0,0,0,0,0,1,0]
[{"$f":"IF(E43<E42,BO43,A42)","v":37},"Blokkum","Hedda Nesholtet","Try",{"$f":"IF(F43<=4,Q43,(Q43-SUM(SMALL(R43:Y43,{1;2;3;4}))))","v":5},{"$f":"(IF(AC43=5,1,0)+IF(AH43=5,1,0)+IF(AM43=5,1,0)+IF(AR43=5,1,0)+IF(AW43=5,1,0)+IF(BB43=5,1,0)+IF(BG43=5,1,0)+IF(BL43=5,1,0))","v":1},null,{"$f":"IF(AA43=\"\",\"\",AA43)","v":""},{"$f":"IF(AF43=\"\",\"\",AF43)","v":""},{"$f":"IF(AK43=\"\",\"\",AK43)","v":""},{"$f":"IF(AP43=\"\",\"\",AP43)","v":""},{"$f":"IF(AU43=\"\",\"\",AU43)","v":31},{"$f":"IF(AZ43=\"\",\"\",AZ43)","v":""},{"$f":"IF(BE43=\"\",\"\",BE43)","v":""},{"$f":"IF(BJ43=\"\",\"\",BJ43)","v":""},null,{"$f":"AD43+AI43+AN43+AS43+AX43+BC43+BH43","v":5},{"$f":"IF($F34>=5,IF(AB43=\"\",\"\",AB43),\"\")","v":""},{"$f":"IF($F34>=5,IF(AG43=\"\",\"\",AG43),\"\")","v":""},{"$f":"IF($F34>=5,IF(AL43=\"\",\"\",AL43),\"\")","v":""},{"$f":"IF($F34>=5,IF(AQ43=\"\",\"\",AQ43),\"\")","v":""},{"$f":"IF($F34>=5,IF(AR43=\"\",\"\",AR43),\"\")","v":""},{"$f":"IF($F34>=5,IF(AV43=\"\",\"\",AV43),\"\")","v":""},{"$f":"IF($F34>=5,IF(BA43=\"\",\"\",BA43),\"\")","v":""},{"$f":"IF($F34>=5,IF(BF43=\"\",\"\",BF43),\"\")","v":""},null,null,{"$f":"IF(ISNUMBER(AA43),(VLOOKUP(AA43,$BO$6:$BP$50,2)),0)","v":0},{"$f":"IF(AA43<>\"\",5,0)","v":0},{"$f":"AB43+AC43","v":0},null,null,{"$f":"IF(ISNUMBER(AF43),(VLOOKUP(AF43,$BO$6:$BP$50,2)),0)","v":0},{"$f":"IF(AF43<>\"\",5,0)","v":0},{"$f":"AG43+AH43","v":0},null,null,{"$f":"IF(ISNUMBER(AK43),(VLOOKUP(AK43,$BO$6:$BP$50,2)),0)","v":0},{"$f":"IF(AK43<>\"\",5,0)","v":0},{"$f":"AL43+AM43","v":0},null,null,{"$f":"IF(ISNUMBER(AP43),(VLOOKUP(AP43,$BO$6:$BP$50,2)),0)","v":0},{"$f":"IF(AP43<>\"\",5,0)","v":0},{"$f":"AQ43+AR43","v":0},null,31,{"$f":"IF(ISNUMBER(AU43),(VLOOKUP(AU43,$BO$6:$BP$50,2)),0)","v":0},{"$f":"IF(AU43<>\"\",5,0)","v":5},{"$f":"AV43+AW43","v":5},null,null,{"$f":"IF(ISNUMBER(AZ43),(VLOOKUP(AZ43,$BO$6:$BP$50,2)),0)","v":0},{"$f":"IF(AZ43<>\"\",5,0)","v":0},{"$f":"BA43+BB43","v":0},null,null,{"$f":"IF(ISNUMBER(BE43),(VLOOKUP(BE43,$BO$6:$BP$50,2)),0)","v":0},{"$f":"IF(BE43<>\"\",5,0)","v":0},{"$f":"BF43+BG43","v":0},null,null,{"$f":"IF(ISNUMBER(BJ43),(VLOOKUP(BJ43,$BO$6:$BP$50,2)),0)","v":0},{"$f":"IF(BJ43<>\"\",5,0)","v":0},{"$f":"BK43+BL43","v":0},null,38,0,0,0,0,0,0,0,1,0]
[{"$f":"IF(E44<E43,BO44,A43)","v":37},"Sohlberg","Emicke","Stabæk",{"$f":"IF(F44<=4,Q44,(Q44-SUM(SMALL(R44:Y44,{1;2;3;4}))))","v":5},{"$f":"(IF(AC44=5,1,0)+IF(AH44=5,1,0)+IF(AM44=5,1,0)+IF(AR44=5,1,0)+IF(AW44=5,1,0)+IF(BB44=5,1,0)+IF(BG44=5,1,0)+IF(BL44=5,1,0))","v":1},null,{"$f":"IF(AA44=\"\",\"\",AA44)","v":""},{"$f":"IF(AF44=\"\",\"\",AF44)","v":""},{"$f":"IF(AK44=\"\",\"\",AK44)","v":""},{"$f":"IF(AP44=\"\",\"\",AP44)","v":""},{"$f":"IF(AU44=\"\",\"\",AU44)","v":"dnf"},{"$f":"IF(AZ44=\"\",\"\",AZ44)","v":""},{"$f":"IF(BE44=\"\",\"\",BE44)","v":""},{"$f":"IF(BJ44=\"\",\"\",BJ44)","v":""},null,{"$f":"AD44+AI44+AN44+AS44+AX44+BC44+BH44","v":5},{"$f":"IF($F35>=5,IF(AB44=\"\",\"\",AB44),\"\")","v":""},{"$f":"IF($F35>=5,IF(AG44=\"\",\"\",AG44),\"\")","v":""},{"$f":"IF($F35>=5,IF(AL44=\"\",\"\",AL44),\"\")","v":""},{"$f":"IF($F35>=5,IF(AQ44=\"\",\"\",AQ44),\"\")","v":""},{"$f":"IF($F35>=5,IF(AR44=\"\",\"\",AR44),\"\")","v":""},{"$f":"IF($F35>=5,IF(AV44=\"\",\"\",AV44),\"\")","v":""},{"$f":"IF($F35>=5,IF(BA44=\"\",\"\",BA44),\"\")","v":""},{"$f":"IF($F35>=5,IF(BF44=\"\",\"\",BF44),\"\")","v":""},null,null,{"$f":"IF(ISNUMBER(AA44),(VLOOKUP(AA44,$BO$6:$BP$50,2)),0)","v":0},{"$f":"IF(AA44<>\"\",5,0)","v":0},{"$f":"AB44+AC44","v":0},null,null,{"$f":"IF(ISNUMBER(AF44),(VLOOKUP(AF44,$BO$6:$BP$50,2)),0)","v":0},{"$f":"IF(AF44<>\"\",5,0)","v":0},{"$f":"AG44+AH44","v":0},null,null,{"$f":"IF(ISNUMBER(AK44),(VLOOKUP(AK44,$BO$6:$BP$50,2)),0)","v":0},{"$f":"IF(AK44<>\"\",5,0)","v":0},{"$f":"AL44+AM44","v":0},null,null,{"$f":"IF(ISNUMBER(AP44),(VLOOKUP(AP44,$BO$6:$BP$50,2)),0)","v":0},{"$f":"IF(AP44<>\"\",5,0)","v":0},{"$f":"AQ44+AR44","v":0},null,"dnf",{"$f":"IF(ISNUMBER(AU44),(VLOOKUP(AU44,$BO$6:$BP$50,2)),0)","v":0},{"$f":"IF(AU44<>\"\",5,0)","v":5},{"$f":"AV44+AW44","v":5},null,null,{"$f":"IF(ISNUMBER(AZ44),(VLOOKUP(AZ44,$BO$6:$BP$50,2)),0)","v":0},{"$f":"IF(AZ44<>\"\",5,0)","v":0},{"$f":"BA44+BB44","v":0},null,null,{"$f":"IF(ISNUMBER(BE44),(VLOOKUP(BE44,$BO$6:$BP$50,2)),0)","v":0},{"$f":"IF(BE44<>\"\",5,0)","v":0},{"$f":"BF44+BG44","v":0},null,null,{"$f":"IF(ISNUMBER(BJ44),(VLOOKUP(BJ44,$BO$6:$BP$50,2)),0)","v":0},{"$f":"IF(BJ44<>\"\",5,0)","v":0},{"$f":"BK44+BL44","v":0},null,39,0,0,0,0,0,0,0,0,1]
[{"$f":"IF(E45<E44,BO45,A44)","v":37},"Jørgensen","Kaia Celin","Heming",{"$f":"IF(F45<=4,Q45,(Q45-SUM(SMALL(R45:Y45,{1;2;3;4}))))","v":5},{"$f":"(IF(AC45=5,1,0)+IF(AH45=5,1,0)+IF(AM45=5,1,0)+IF(AR45=5,1,0)+IF(AW45=5,1,0)+IF(BB45=5,1,0)+IF(BG45=5,1,0)+IF(BL45=5,1,0))","v":1},null,{"$f":"IF(AA45=\"\",\"\",AA45)","v":""},{"$f":"IF(AF45=\"\",\"\",AF45)","v":""},{"$f":"IF(AK45=\"\",\"\",AK45)","v":""},{"$f":"IF(AP45=\"\",\"\",AP45)","v":""},{"$f":"IF(AU45=\"\",\"\",AU45)","v":"dnf"},{"$f":"IF(AZ45=\"\",\"\",AZ45)","v":""},{"$f":"IF(BE45=\"\",\"\",BE45)","v":""},{"$f":"IF(BJ45=\"\",\"\",BJ45)","v":""},null,{"$f":"AD45+AI45+AN45+AS45+AX45+BC45+BH45","v":5},{"$f":"IF($F36>=5,IF(AB45=\"\",\"\",AB45),\"\")","v":""},{"$f":"IF($F36>=5,IF(AG45=\"\",\"\",AG45),\"\")","v":""},{"$f":"IF($F36>=5,IF(AL45=\"\",\"\",AL45),\"\")","v":""},{"$f":"IF($F36>=5,IF(AQ45=\"\",\"\",AQ45),\"\")","v":""},{"$f":"IF($F36>=5,IF(AR45=\"\",\"\",AR45),\"\")","v":""},{"$f":"IF($F36>=5,IF(AV45=\"\",\"\",AV45),\"\")","v":""},{"$f":"IF($F36>=5,IF(BA45=\"\",\"\",BA45),\"\")","v":""},{"$f":"IF($F36>=5,IF(BF45=\"\",\"\",BF45),\"\")","v":""},null,null,{"$f":"IF(ISNUMBER(AA45),(VLOOKUP(AA45,$BO$6:$BP$50,2)),0)","v":0},{"$f":"IF(AA45<>\"\",5,0)","v":0},{"$f":"AB45+AC45","v":0},null,null,{"$f":"IF(ISNUMBER(AF45),(VLOOKUP(AF45,$BO$6:$BP$50,2)),0)","v":0},{"$f":"IF(AF45<>\"\",5,0)","v":0},{"$f":"AG45+AH45","v":0},null,null,{"$f":"IF(ISNUMBER(AK45),(VLOOKUP(AK45,$BO$6:$BP$50,2)),0)","v":0},{"$f":"IF(AK45<>\"\",5,0)","v":0},{"$f":"AL45+AM45","v":0},null,null,{"$f":"IF(ISNUMBER(AP45),(VLOOKUP(AP45,$BO$6:$BP$50,2)),0)","v":0},{"$f":"IF(AP45<>\"\",5,0)","v":0},{"$f":"AQ45+AR45","v":0},null,"dnf",{"$f":"IF(ISNUMBER(AU45),(VLOOKUP(AU45,$BO$6:$BP$50,2)),0)","v":0},{"$f":"IF(AU45<>\"\",5,0)","v":5},{"$f":"AV45+AW45","v":5},null,null,{"$f":"IF(ISNUMBER(AZ45),(VLOOKUP(AZ45,$BO$6:$BP$50,2)),0)","v":0},{"$f":"IF(AZ45<>\"\",5,0)","v":0},{"$f":"BA45+BB45","v":0},null,null,{"$f":"IF(ISNUMBER(BE45),(VLOOKUP(BE45,$BO$6:$BP$50,2)),0)","v":0},{"$f":"IF(BE45<>\"\",5,0)","v":0},{"$f":"BF45+BG45","v":0},null,null,{"$f":"IF(ISNUMBER(BJ45),(VLOOKUP(BJ45,$BO$6:$BP$50,2)),0)","v":0},{"$f":"IF(BJ45<>\"\",5,0)","v":0},{"$f":"BK45+BL45","v":0},null,40,0,0,0,0,0,0,0,0,1]
[null,null,null,null,null,null,null,{"$f":"IF(AA46=\"\",\"\",AA46)","v":""},{"$f":"IF(AF46=\"\",\"\",AF46)","v":""},{"$f":"IF(AK46=\"\",\"\",AK46)","v":""},{"$f":"IF(AP46=\"\",\"\",AP46)","v":""},{"$f":"IF(AU46=\"\",\"\",AU46)","v":""},{"$f":"IF(AZ46=\"\",\"\",AZ46)","v":""},{"$f":"IF(BE46=\"\",\"\",BE46)","v":""},{"$f":"IF(BJ46=\"\",\"\",BJ46)","v":""},null,{"$f":"AD46+AI46+AN46+AS46+AX46+BC46+BH46","v":0},{"$f":"IF($F37>=5,IF(AB46=\"\",\"\",AB46),\"\")","v":""},{"$f":"IF($F37>=5,IF(AG46=\"\",\"\",AG46),\"\")","v":""},{"$f":"IF($F37>=5,IF(AL46=\"\",\"\",AL46),\"\")","v":""},{"$f":"IF($F37>=5,IF(AQ46=\"\",\"\",AQ46),\"\")","v":""},"",{"$f":"IF($F37>=5,IF(AV46=\"\",\"\",AV46),\"\")","v":""},{"$f":"IF($F37>=5,IF(BA46=\"\",\"\",BA46),\"\")","v":""},{"$f":"IF($F37>=5,IF(BF46=\"\",\"\",BF46),\"\")","v":""},null,null,{"$f":"IF(ISNUMBER(AA46),(VLOOKUP(AA46,$BO$6:$BP$50,2)),0)","v":0},{"$f":"IF(AA46<>\"\",5,0)","v":0},{"$f":"AB46+AC46","v":0},null,null,{"$f":"IF(ISNUMBER(AF46),(VLOOKUP(AF46,$BO$6:$BP$50,2)),0)","v":0},{"$f":"IF(AF46<>\"\",5,0)","v":0},{"$f":"AG46+AH46","v":0},null,null,{"$f":"IF(ISNUMBER(AK46),(VLOOKUP(AK46,$BO$6:$BP$50,2)),0)","v":0},{"$f":"IF(AK46<>\"\",5,0)","v":0},{"$f":"AL46+AM46","v":0},null,null,{"$f":"IF(ISNUMBER(AP46),(VLOOKUP(AP46,$BO$6:$BP$50,2)),0)","v":0},{"$f":"IF(AP46<>\"\",5,0)","v":0},{"$f":"AQ46+AR46","v":0},null,null,{"$f":"IF(ISNUMBER(AU46),(VLOOKUP(AU46,$BO$6:$BP$50,2)),0)","v":0},{"$f":"IF(AU46<>\"\",5,0)","v":0},{"$f":"AV46+AW46","v":0},null,null,{"$f":"IF(ISNUMBER(AZ46),(VLOOKUP(AZ46,$BO$6:$BP$50,2)),0)","v":0},{"$f":"IF(AZ46<>\"\",5,0)","v":0},{"$f":"BA46+BB46","v":0},null,null,{"$f":"IF(ISNUMBER(BE46),(VLOOKUP(BE46,$BO$6:$BP$50,2)),0)","v":0},{"$f":"IF(BE46<>\"\",5,0)","v":0},{"$f":"BF46+BG46","v":0},null,null,{"$f":"IF(ISNUMBER(BJ46),(VLOOKUP(BJ46,$BO$6:$BP$50,2)),0)","v":0},{"$f":"IF(BJ46<>\"\",5,0)","v":0},{"$f":"BK46+BL46","v":0},null,41,0,0,0,0,0,0,0,0,1]
[null,null,null,null,null,null,null,"","","","","","","","",null,0,"","","","","","","","",null,null,0,0,0,null,null,0,0,0,null,null,0,0,0,null,null,0,0,0,null,null,0,0,0,null,null,0,0,0,null,null,0,0,0,null,null,0,0,0,null,42,0,0,0,0,0,0,0,0,1]
[null,null,null,null,null,null,null,{"$f":"IF(AA48=\"\",\"\",AA48)","v":""},{"$f":"IF(AF48=\"\",\"\",AF48)","v":""},{"$f":"IF(AK48=\"\",\"\",AK48)","v":""},{"$f":"IF(AP48=\"\",\"\",AP48)","v":""},{"$f":"IF(AU48=\"\",\"\",AU48)","v":""},{"$f":"IF(AU48=\"\",\"\",AU48)","v":""},{"$f":"IF(AZ48=\"\",\"\",AZ48)","v":""},{"$f":"IF(BE48=\"\",\"\",BE48)","v":""},null,0,"","","","","","","","",null,null,0,0,0,null,null,0,0,0,null,null,0,0,0,null,null,0,0,0,null,null,0,0,0,null,null,0,0,0,null,null,0,0,0,null,null,0,0,0,null,43,0,0,0,0,0,0,0,0,1]
[null,null,null,null,null,null,null,"","","","","","","","",null,0,"","","","","","","","",null,null,0,0,0,null,null,0,0,0,null,null,0,0,0,null,null,0,0,0,null,null,0,0,0,null,null,0,0,0,null,null,0,0,0,null,null,0,0,0,null,44,0,0,0,0,0,0,0,0,1]
[null,null,null,null,null,null,null,"","","","","","","","",null,0,"","","","","","","","",null,null,null,null,null,null,null,null,null,0,null,null,null,null,0,null,null,null,null,0,null,null,null,null,0,null,null,null,null,0,null,null,null,null,0,null,null,null,null,0,null,45,0,0,0,0,0,0,0,0,1]
[null,null,null,null,null,null,null,"","","","","","","","",null,0,"","","","","","","","",null,null,null,null,null,null,null,null,null,0,null,null,null,null,0,null,null,null,null,0,null,null,null,null,0,null,null,null,null,0,null,null,null,null,0,null,null,null,null,0,null,46,0,0,{"$f":"IF($F42=7,1,0)","v":0},0,0,0,0,0,1]
[null,null,null,null,null,null,null,"","","","","","","","",null,0,"","","","","","","","",null,null,null,null,null,null,null,null,null,0,null,null,null,null,0,null,null,null,null,0,null,null,null,null,0,null,null,null,null,0,null,null,null,null,0,null,null,null,null,0,null,47,0,0,0,0,0,0,0,0,1]
[null,null,null,null,null,null,null,null,null,null,null,null,null,null,null,null,null,null,null,null,null,null,null,null,null,null,null,null,null,null,null,null,null,null,null,null,null,null,null,null,null,null,null,null,null,null,null,null,null,null,null,null,null,null,null,null,null,null,null,null,null,null,null,null,null,null,48,0]

{"sheet":"G11 2018","index":2,"n_rows":53,"n_cols":76,"rows_kept":53,"cut":false,"hidden":false,"merged":[[0,42,0,45],[2,26,2,29],[2,31,2,34],[2,36,2,39],[2,41,2,44],[3,62,3,64],[4,7,4,14],[4,17,4,24],[2,51,2,54],[2,56,2,59],[2,61,2,64],[3,27,3,29],[3,32,3,34],[3,37,3,39],[3,42,3,44],[3,47,3,49],[3,52,3,54],[3,57,3,59],[2,46,2,49]]}
["Resultatliste Oslo Cup 2018 - Gutter 11 år"]
[{"$f":"'Forside 2018'!A2","v":"Etter 7 av 8 renn"}]
[null,null,null,null,null,null,null,"IRS Rennet","Ljan Rennet","Njård Rennet","Ready Rennet","Telenor Arena Cup","Euro-tecfarten","Oslo Alpinfestival SL","Oslo Alpinfestival SSL",null,null,"IRS Rennet","Ljan Rennet","Njård Rennet","Ready Rennet","Telenor Arena Cup","Euro-tecfarten","Oslo Alpinfestival SL","Oslo Alpinfestival SSL",null,"--------IRS Rennet----------",null,null,null,null,"----------Ljan Rennet---------",null,null,null,null,"--------Njård Rennet----------",null,null,null,null,"--------Ready Rennet---------",null,null,null,null,"-----Telenor Arena Cup----",null,null,null,null,"------Euro-tecfarten--------",null,null,null,null,"---Oslo Alpinfestival SL---",null,null,null,null,"---Oslo Alpinfestival SSL---"]
[null,null,null,null,null,"Antall",null,"2018-02-03","2018-02-04","2018-02-10","2018-02-11","2018-02-14","2018-02-28","2018-03-03","2018-03-04",null,"Poeng","2018-02-03","2018-02-04","2018-02-10","2018-02-11","2018-02-14","2018-02-28","2018-03-03","2018-03-04",null,null,"--------Poeng--------",null,null,null,null,"--------Poeng--------",null,null,null,null,"-------Poeng---------",null,null,null,null,"-------Poeng---------",null,null,null,null,"-------Poeng---------",null,null,null,null,"-------Poeng---------",null,null,null,null,"-------Poeng---------",null,null,null,null,"-------Poeng---------",null,null,null,null,null,"Løpere med ","Løpere med ","Løpere med ","Løpere med ","Løpere med ","Løpere med ","Løpere med ","Løpere med "]
["Plass","Etternavn","Fornavn","Klubb","Poeng","renn",null,"------------------------------Plassering i rennene---------------------------------",null,null,null,null,null,null,null,null,"brutto","----------------Resultatpoeng hvis mer enn 4 renn----------------",null,null,null,null,null,null,null,null,"Plass","Res.","Del.","Tot.",null,"Plass","Res.","Del.","Tot.",null,"Plass","Res.","Del.","Tot.",null,"Plass","Res.","Del.","Tot.",null,"Plass","Res.","Del.","Tot.",null,"Plass","Res.","Del.","Tot.",null,"Plass","Res.","Del.","Tot.",null,"Plass","Res.","Del.","Tot.",null,"Plass","Poeng","8 renn","7 renn","6 renn","5 renn","4 renn","3 renn","2 renn","kun 1 renn"]
[{"$f":"IF(E6<E5,BO6,A5)","v":1},"Danielsen","Didrik Heggelund","Ullensaker",{"$f":"IF(F6<=4,Q6,(Q6-SUM(SMALL(R6:Y6,{1;2;3;4}))))","v":415},{"$f":"(IF(AC6=5,1,0)+IF(AH6=5,1,0)+IF(AM6=5,1,0)+IF(AR6=5,1,0)+IF(AW6=5,1,0)+IF(BB6=5,1,0)+IF(BG6=5,1,0)+IF(BL6=5,1,0))","v":7},null,{"$f":"IF(AA6=\"\",\"\",AA6)","v":1},{"$f":"IF(AF6=\"\",\"\",AF6)","v":1},{"$f":"IF(AK6=\"\",\"\",AK6)","v":2},{"$f":"IF(AP6=\"\",\"\",AP6)","v":2},{"$f":"IF(AU6=\"\",\"\",AU6)","v":7},{"$f":"IF(AZ6=\"\",\"\",AZ6)","v":2},{"$f":"IF(BE6=\"\",\"\",BE6)","v":1},{"$f":"IF(BJ6=\"\",\"\",BJ6)","v":""},null,{"$f":"AD6+AI6+AN6+AS6+AX6+BC6+BH6","v":611},{"$f":"IF($F6>=5,IF(AB6=\"\",\"\",AB6),\"\")","v":100},{"$f":"IF($F6>=5,IF(AG6=\"\",\"\",AG6),\"\")","v":100},{"$f":"IF($F6>=5,IF(AL6=\"\",\"\",AL6),\"\")","v":80},{"$f":"IF($F6>=5,IF(AQ6=\"\",\"\",AQ6),\"\")","v":80},{"$f":"IF($F6>=5,IF(AV6=\"\",\"\",AV6),\"\")","v":36},{"$f":"IF($F6>=5,IF(BA6=\"\",\"\",BA6),\"\")","v":80},{"$f":"IF($F6>=5,IF(BF6=\"\",\"\",BF6),\"\")","v":100},{"$f":"IF($F6>=5,IF(BK6=\"\",\"\",BK6),\"\")","v":0},null,1,{"$f":"IF(ISNUMBER(AA6),(VLOOKUP(AA6,$BO$6:$BP$50,2)),0)","v":100},{"$f":"IF(AA6<>\"\",5,0)","v":5},{"$f":"AB6+AC6","v":105},null,1,{"$f":"IF(ISNUMBER(AF6),(VLOOKUP(AF6,$BO$6:$BP$50,2)),0)","v":100},{"$f":"IF(AF6<>\"\",5,0)","v":5},{"$f":"AG6+AH6","v":105},null,2,{"$f":"IF(ISNUMBER(AK6),(VLOOKUP(AK6,$BO$6:$BP$50,2)),0)","v":80},{"$f":"IF(AK6<>\"\",5,0)","v":5},{"$f":"AL6+AM6","v":85},null,2,{"$f":"IF(ISNUMBER(AP6),(VLOOKUP(AP6,$BO$6:$BP$50,2)),0)","v":80},{"$f":"IF(AP6<>\"\",5,0)","v":5},{"$f":"AQ6+AR6","v":85},null,7,{"$f":"IF(ISNUMBER(AU6),(VLOOKUP(AU6,$BO$6:$BP$50,2)),0)","v":36},{"$f":"IF(AU6<>\"\",5,0)","v":5},{"$f":"AV6+AW6","v":41},null,2,{"$f":"IF(ISNUMBER(AZ6),(VLOOKUP(AZ6,$BO$6:$BP$50,2)),0)","v":80},{"$f":"IF(AZ6<>\"\",5,0)","v":5},{"$f":"BA6+BB6","v":85},null,1,{"$f":"IF(ISNUMBER(BE6),(VLOOKUP(BE6,$BO$6:$BP$50,2)),0)","v":100},{"$f":"IF(BE6<>\"\",5,0)","v":5},{"$f":"BF6+BG6","v":105},null,null,{"$f":"IF(ISNUMBER(BJ6),(VLOOKUP(BJ6,$BO$6:$BP$50,2)),0)","v":0},{"$f":"IF(BJ6<>\"\",5,0)","v":0},{"$f":"BK6+BL6","v":0},null,1,100,{"$f":"IF($F6=8,1,0)","v":0},{"$f":"IF($F6=7,1,0)","v":1},{"$f":"IF($F6=6,1,0)","v":0},{"$f":"IF($F6=5,1,0)","v":0},{"$f":"IF($F6=4,1,0)","v":0},{"$f":"IF($F6=3,1,0)","v":0},{"$f":"IF($F6=2,1,0)","v":0},{"$f":"IF($F6=1,1,0)","v":0}]
[{"$f":"IF(E7<E6,BO7,A6)","v":2},"Lien","Johan Oscar","Heming",{"$f":"IF(F7<=4,Q7,(Q7-SUM(SMALL(R7:Y7,{1;2;3;4}))))","v":305},{"$f":"(IF(AC7=5,1,0)+IF(AH7=5,1,0)+IF(AM7=5,1,0)+IF(AR7=5,1,0)+IF(AW7=5,1,0)+IF(BB7=5,1,0)+IF(BG7=5,1,0)+IF(BL7=5,1,0))","v":7},null,{"$f":"IF(AA7=\"\",\"\",AA7)","v":5},{"$f":"IF(AF7=\"\",\"\",AF7)","v":5},{"$f":"IF(AK7=\"\",\"\",AK7)","v":1},{"$f":"IF(AP7=\"\",\"\",AP7)","v":"dnf"},{"$f":"IF(AU7=\"\",\"\",AU7)","v":2},{"$f":"IF(AZ7=\"\",\"\",AZ7)","v":8},{"$f":"IF(BE7=\"\",\"\",BE7)","v":14},{"$f":"IF(BJ7=\"\",\"\",BJ7)","v":""},null,{"$f":"AD7+AI7+AN7+AS7+AX7+BC7+BH7","v":355},{"$f":"IF($F7>=5,IF(AB7=\"\",\"\",AB7),\"\")","v":45},{"$f":"IF($F7>=5,IF(AG7=\"\",\"\",AG7),\"\")","v":45},{"$f":"IF($F7>=5,IF(AL7=\"\",\"\",AL7),\"\")","v":100},{"$f":"IF($F7>=5,IF(AQ7=\"\",\"\",AQ7),\"\")","v":0},{"$f":"IF($F7>=5,IF(AV7=\"\",\"\",AV7),\"\")","v":80},{"$f":"IF($F7>=5,IF(BA7=\"\",\"\",BA7),\"\")","v":32},{"$f":"IF($F7>=5,IF(BF7=\"\",\"\",BF7),\"\")","v":18},{"$f":"IF($F7>=5,IF(BK7=\"\",\"\",BK7),\"\")","v":0},null,5,{"$f":"IF(ISNUMBER(AA7),(VLOOKUP(AA7,$BO$6:$BP$50,2)),0)","v":45},{"$f":"IF(AA7<>\"\",5,0)","v":5},{"$f":"AB7+AC7","v":50},null,5,{"$f":"IF(ISNUMBER(AF7),(VLOOKUP(AF7,$BO$6:$BP$50,2)),0)","v":45},{"$f":"IF(AF7<>\"\",5,0)","v":5},{"$f":"AG7+AH7","v":50},null,1,{"$f":"IF(ISNUMBER(AK7),(VLOOKUP(AK7,$BO$6:$BP$50,2)),0)","v":100},{"$f":"IF(AK7<>\"\",5,0)","v":5},{"$f":"AL7+AM7","v":105},null,"dnf",{"$f":"IF(ISNUMBER(AP7),(VLOOKUP(AP7,$BO$6:$BP$50,2)),0)","v":0},{"$f":"IF(AP7<>\"\",5,0)","v":5},{"$f":"AQ7+AR7","v":5},null,2,{"$f":"IF(ISNUMBER(AU7),(VLOOKUP(AU7,$BO$6:$BP$50,2)),0)","v":80},{"$f":"IF(AU7<>\"\",5,0)","v":5},{"$f":"AV7+AW7","v":85},null,8,{"$f":"IF(ISNUMBER(AZ7),(VLOOKUP(AZ7,$BO$6:$BP$50,2)),0)","v":32},{"$f":"IF(AZ7<>\"\",5,0)","v":5},{"$f":"BA7+BB7","v":37},null,14,{"$f":"IF(ISNUMBER(BE7),(VLOOKUP(BE7,$BO$6:$BP$50,2)),0)","v":18},{"$f":"IF(BE7<>\"\",5,0)","v":5},{"$f":"BF7+BG7","v":23},null,null,{"$f":"IF(ISNUMBER(BJ7),(VLOOKUP(BJ7,$BO$6:$BP$50,2)),0)","v":0},{"$f":"IF(BJ7<>\"\",5,0)","v":0},{"$f":"BK7+BL7","v":0},null,2,80,{"$f":"IF($F7=8,1,0)","v":0},1,0,0,0,0,0,0]
[{"$f":"IF(E8<E7,BO8,A7)","v":3},"Hemminghytt","Fredrik","Lommedalen",{"$f":"IF(F8<=4,Q8,(Q8-SUM(SMALL(R8:Y8,{1;2;3;4}))))","v":295},{"$f":"(IF(AC8=5,1,0)+IF(AH8=5,1,0)+IF(AM8=5,1,0)+IF(AR8=5,1,0)+IF(AW8=5,1,0)+IF(BB8=5,1,0)+IF(BG8=5,1,0)+IF(BL8=5,1,0))","v":6},null,{"$f":"IF(AA8=\"\",\"\",AA8)","v":2},{"$f":"IF(AF8=\"\",\"\",AF8)","v":""},{"$f":"IF(AK8=\"\",\"\",AK8)","v":8},{"$f":"IF(AP8=\"\",\"\",AP8)","v":5},{"$f":"IF(AU8=\"\",\"\",AU8)","v":1},{"$f":"IF(AZ8=\"\",\"\",AZ8)","v":6},{"$f":"IF(BE8=\"\",\"\",BE8)","v":"dnf"},{"$f":"IF(BJ8=\"\",\"\",BJ8)","v":""},null,{"$f":"AD8+AI8+AN8+AS8+AX8+BC8+BH8","v":327},{"$f":"IF($F8>=5,IF(AB8=\"\",\"\",AB8),\"\")","v":80},{"$f":"IF($F8>=5,IF(AG8=\"\",\"\",AG8),\"\")","v":0},{"$f":"IF($F8>=5,IF(AL8=\"\",\"\",AL8),\"\")","v":32},{"$f":"IF($F8>=5,IF(AQ8=\"\",\"\",AQ8),\"\")","v":45},{"$f":"IF($F8>=5,IF(AV8=\"\",\"\",AV8),\"\")","v":100},{"$f":"IF($F8>=5,IF(BA8=\"\",\"\",BA8),\"\")","v":40},{"$f":"IF($F8>=5,IF(BF8=\"\",\"\",BF8),\"\")","v":0},{"$f":"IF($F8>=5,IF(BK8=\"\",\"\",BK8),\"\")","v":0},null,2,{"$f":"IF(ISNUMBER(AA8),(VLOOKUP(AA8,$BO$6:$BP$50,2)),0)","v":80},{"$f":"IF(AA8<>\"\",5,0)","v":5},{"$f":"AB8+AC8","v":85},null,null,{"$f":"IF(ISNUMBER(AF8),(VLOOKUP(AF8,$BO$6:$BP$50,2)),0)","v":0},{"$f":"IF(AF8<>\"\",5,0)","v":0},{"$f":"AG8+AH8","v":0},null,8,{"$f":"IF(ISNUMBER(AK8),(VLOOKUP(AK8,$BO$6:$BP$50,2)),0)","v":32},{"$f":"IF(AK8<>\"\",5,0)","v":5},{"$f":"AL8+AM8","v":37},null,5,{"$f":"IF(ISNUMBER(AP8),(VLOOKUP(AP8,$BO$6:$BP$50,2)),0)","v":45},{"$f":"IF(AP8<>\"\",5,0)","v":5},{"$f":"AQ8+AR8","v":50},null,1,{"$f":"IF(ISNUMBER(AU8),(VLOOKUP(AU8,$BO$6:$BP$50,2)),0)","v":100},{"$f":"IF(AU8<>\"\",5,0)","v":5},{"$f":"AV8+AW8","v":105},null,6,{"$f":"IF(ISNUMBER(AZ8),(VLOOKUP(AZ8,$BO$6:$BP$50,2)),0)","v":40},{"$f":"IF(AZ8<>\"\",5,0)","v":5},{"$f":"BA8+BB8","v":45},null,"dnf",{"$f":"IF(ISNUMBER(BE8),(VLOOKUP(BE8,$BO$6:$BP$50,2)),0)","v":0},{"$f":"IF(BE8<>\"\",5,0)","v":5},{"$f":"BF8+BG8","v":5},null,null,{"$f":"IF(ISNUMBER(BJ8),(VLOOKUP(BJ8,$BO$6:$BP$50,2)),0)","v":0},{"$f":"IF(BJ8<>\"\",5,0)","v":0},{"$f":"BK8+BL8","v":0},null,3,60,0,0,1,0,0,0,0,0]
[{"$f":"IF(E9<E8,BO9,A8)","v":4},"Øslebø","Kristoffer","Ready",{"$f":"IF(F9<=4,Q9,(Q9-SUM(SMALL(R9:Y9,{1;2;3;4}))))","v":265},{"$f":"(IF(AC9=5,1,0)+IF(AH9=5,1,0)+IF(AM9=5,1,0)+IF(AR9=5,1,0)+IF(AW9=5,1,0)+IF(BB9=5,1,0)+IF(BG9=5,1,0)+IF(BL9=5,1,0))","v":7},null,{"$f":"IF(AA9=\"\",\"\",AA9)","v":3},{"$f":"IF(AF9=\"\",\"\",AF9)","v":3},{"$f":"IF(AK9=\"\",\"\",AK9)","v":4},{"$f":"IF(AP9=\"\",\"\",AP9)","v":4},{"$f":"IF(AU9=\"\",\"\",AU9)","v":"dsq"},{"$f":"IF(AZ9=\"\",\"\",AZ9)","v":4},{"$f":"IF(BE9=\"\",\"\",BE9)","v":3},{"$f":"IF(BJ9=\"\",\"\",BJ9)","v":""},null,{"$f":"AD9+AI9+AN9+AS9+AX9+BC9+BH9","v":365},{"$f":"IF($F9>=5,IF(AB9=\"\",\"\",AB9),\"\")","v":60},{"$f":"IF($F9>=5,IF(AG9=\"\",\"\",AG9),\"\")","v":60},{"$f":"IF($F9>=5,IF(AL9=\"\",\"\",AL9),\"\")","v":50},{"$f":"IF($F9>=5,IF(AQ9=\"\",\"\",AQ9),\"\")","v":50},{"$f":"IF($F9>=5,IF(AV9=\"\",\"\",AV9),\"\")","v":0},{"$f":"IF($F9>=5,IF(BA9=\"\",\"\",BA9),\"\")","v":50},{"$f":"IF($F9>=5,IF(BF9=\"\",\"\",BF9),\"\")","v":60},{"$f":"IF($F9>=5,IF(BK9=\"\",\"\",BK9),\"\")","v":0},null,3,{"$f":"IF(ISNUMBER(AA9),(VLOOKUP(AA9,$BO$6:$BP$50,2)),0)","v":60},{"$f":"IF(AA9<>\"\",5,0)","v":5},{"$f":"AB9+AC9","v":65},null,3,{"$f":"IF(ISNUMBER(AF9),(VLOOKUP(AF9,$BO$6:$BP$50,2)),0)","v":60},{"$f":"IF(AF9<>\"\",5,0)","v":5},{"$f":"AG9+AH9","v":65},null,4,{"$f":"IF(ISNUMBER(AK9),(VLOOKUP(AK9,$BO$6:$BP$50,2)),0)","v":50},{"$f":"IF(AK9<>\"\",5,0)","v":5},{"$f":"AL9+AM9","v":55},null,4,{"$f":"IF(ISNUMBER(AP9),(VLOOKUP(AP9,$BO$6:$BP$50,2)),0)","v":50},{"$f":"IF(AP9<>\"\",5,0)","v":5},{"$f":"AQ9+AR9","v":55},null,"dsq",{"$f":"IF(ISNUMBER(AU9),(VLOOKUP(AU9,$BO$6:$BP$50,2)),0)","v":0},{"$f":"IF(AU9<>\"\",5,0)","v":5},{"$f":"AV9+AW9","v":5},null,4,{"$f":"IF(ISNUMBER(AZ9),(VLOOKUP(AZ9,$BO$6:$BP$50,2)),0)","v":50},{"$f":"IF(AZ9<>\"\",5,0)","v":5},{"$f":"BA9+BB9","v":55},null,3,{"$f":"IF(ISNUMBER(BE9),(VLOOKUP(BE9,$BO$6:$BP$50,2)),0)","v":60},{"$f":"IF(BE9<>\"\",5,0)","v":5},{"$f":"BF9+BG9","v":65},null,null,{"$f":"IF(ISNUMBER(BJ9),(VLOOKUP(BJ9,$BO$6:$BP$50,2)),0)","v":0},{"$f":"IF(BJ9<>\"\",5,0)","v":0},{"$f":"BK9+BL9","v":0},null,4,50,0,1,0,0,0,0,0,0]
[{"$f":"IF(E10<E9,BO10,A9)","v":5},"Hagen","Storm","Kjelsås",{"$f":"IF(F10<=4,Q10,(Q10-SUM(SMALL(R10:Y10,{1;2;3;4}))))","v":251},{"$f":"(IF(AC10=5,1,0)+IF(AH10=5,1,0)+IF(AM10=5,1,0)+IF(AR10=5,1,0)+IF(AW10=5,1,0)+IF(BB10=5,1,0)+IF(BG10=5,1,0)+IF(BL10=5,1,0))","v":6},null,{"$f":"IF(AA10=\"\",\"\",AA10)","v":""},{"$f":"IF(AF10=\"\",\"\",AF10)","v":2},{"$f":"IF(AK10=\"\",\"\",AK10)","v":7},{"$f":"IF(AP10=\"\",\"\",AP10)","v":3},{"$f":"IF(AU10=\"\",\"\",AU10)","v":8},{"$f":"IF(AZ10=\"\",\"\",AZ10)","v":5},{"$f":"IF(BE10=\"\",\"\",BE10)","v":18},{"$f":"IF(BJ10=\"\",\"\",BJ10)","v":""},null,{"$f":"AD10+AI10+AN10+AS10+AX10+BC10+BH10","v":296},{"$f":"IF($F10>=5,IF(AB10=\"\",\"\",AB10),\"\")","v":0},{"$f":"IF($F10>=5,IF(AG10=\"\",\"\",AG10),\"\")","v":80},{"$f":"IF($F10>=5,IF(AL10=\"\",\"\",AL10),\"\")","v":36},{"$f":"IF($F10>=5,IF(AQ10=\"\",\"\",AQ10),\"\")","v":60},{"$f":"IF($F10>=5,IF(AV10=\"\",\"\",AV10),\"\")","v":32},{"$f":"IF($F10>=5,IF(BA10=\"\",\"\",BA10),\"\")","v":45},{"$f":"IF($F10>=5,IF(BF10=\"\",\"\",BF10),\"\")","v":13},{"$f":"IF($F10>=5,IF(BK10=\"\",\"\",BK10),\"\")","v":0},null,null,{"$f":"IF(ISNUMBER(AA10),(VLOOKUP(AA10,$BO$6:$BP$50,2)),0)","v":0},{"$f":"IF(AA10<>\"\",5,0)","v":0},{"$f":"AB10+AC10","v":0},null,2,{"$f":"IF(ISNUMBER(AF10),(VLOOKUP(AF10,$BO$6:$BP$50,2)),0)","v":80},{"$f":"IF(AF10<>\"\",5,0)","v":5},{"$f":"AG10+AH10","v":85},null,7,{"$f":"IF(ISNUMBER(AK10),(VLOOKUP(AK10,$BO$6:$BP$50,2)),0)","v":36},{"$f":"IF(AK10<>\"\",5,0)","v":5},{"$f":"AL10+AM10","v":41},null,3,{"$f":"IF(ISNUMBER(AP10),(VLOOKUP(AP10,$BO$6:$BP$50,2)),0)","v":60},{"$f":"IF(AP10<>\"\",5,0)","v":5},{"$f":"AQ10+AR10","v":65},null,8,{"$f":"IF(ISNUMBER(AU10),(VLOOKUP(AU10,$BO$6:$BP$50,2)),0)","v":32},{"$f":"IF(AU10<>\"\",5,0)","v":5},{"$f":"AV10+AW10","v":37},null,5,{"$f":"IF(ISNUMBER(AZ10),(VLOOKUP(AZ10,$BO$6:$BP$50,2)),0)","v":45},{"$f":"IF(AZ10<>\"\",5,0)","v":5},{"$f":"BA10+BB10","v":50},null,18,{"$f":"IF(ISNUMBER(BE10),(VLOOKUP(BE10,$BO$6:$BP$50,2)),0)","v":13},{"$f":"IF(BE10<>\"\",5,0)","v":5},{"$f":"BF10+BG10","v":18},null,null,{"$f":"IF(ISNUMBER(BJ10),(VLOOKUP(BJ10,$BO$6:$BP$50,2)),0)","v":0},{"$f":"IF(BJ10<>\"\",5,0)","v":0},{"$f":"BK10+BL10","v":0},null,5,45,0,0,1,0,0,0,0,0]
[{"$f":"IF(E11<E10,BO11,A10)","v":6},"Foss","Philip","Heming",{"$f":"IF(F11<=4,Q11,(Q11-SUM(SMALL(R11:Y11,{1;2;3;4}))))","v":215},{"$f":"(IF(AC11=5,1,0)+IF(AH11=5,1,0)+IF(AM11=5,1,0)+IF(AR11=5,1,0)+IF(AW11=5,1,0)+IF(BB11=5,1,0)+IF(BG11=5,1,0)+IF(BL11=5,1,0))","v":3},null,{"$f":"IF(AA11=\"\",\"\",AA11)","v":""},{"$f":"IF(AF11=\"\",\"\",AF11)","v":""},{"$f":"IF(AK11=\"\",\"\",AK11)","v":6},{"$f":"IF(AP11=\"\",\"\",AP11)","v":1},{"$f":"IF(AU11=\"\",\"\",AU11)","v":3},{"$f":"IF(AZ11=\"\",\"\",AZ11)","v":""},{"$f":"IF(BE11=\"\",\"\",BE11)","v":""},{"$f":"IF(BJ11=\"\",\"\",BJ11)","v":""},null,{"$f":"AD11+AI11+AN11+AS11+AX11+BC11+BH11","v":215},{"$f":"IF($F11>=5,IF(AB11=\"\",\"\",AB11),\"\")","v":""},{"$f":"IF($F11>=5,IF(AG11=\"\",\"\",AG11),\"\")","v":""},{"$f":"IF($F11>=5,IF(AL11=\"\",\"\",AL11),\"\")","v":""},{"$f":"IF($F11>=5,IF(AQ11=\"\",\"\",AQ11),\"\")","v":""},{"$f":"IF($F11>=5,IF(AV11=\"\",\"\",AV11),\"\")","v":""},{"$f":"IF($F11>=5,IF(BA11=\"\",\"\",BA11),\"\")","v":""},{"$f":"IF($F11>=5,IF(BF11=\"\",\"\",BF11),\"\")","v":""},{"$f":"IF($F11>=5,IF(BK11=\"\",\"\",BK11),\"\")","v":""},null,null,{"$f":"IF(ISNUMBER(AA11),(VLOOKUP(AA11,$BO$6:$BP$50,2)),0)","v":0},{"$f":"IF(AA11<>\"\",5,0)","v":0},{"$f":"AB11+AC11","v":0},null,null,{"$f":"IF(ISNUMBER(AF11),(VLOOKUP(AF11,$BO$6:$BP$50,2)),0)","v":0},{"$f":"IF(AF11<>\"\",5,0)","v":0},{"$f":"AG11+AH11","v":0},null,6,{"$f":"IF(ISNUMBER(AK11),(VLOOKUP(AK11,$BO$6:$BP$50,2)),0)","v":40},{"$f":"IF(AK11<>\"\",5,0)","v":5},{"$f":"AL11+AM11","v":45},null,1,{"$f":"IF(ISNUMBER(AP11),(VLOOKUP(AP11,$BO$6:$BP$50,2)),0)","v":100},{"$f":"IF(AP11<>\"\",5,0)","v":5},{"$f":"AQ11+AR11","v":105},null,3,{"$f":"IF(ISNUMBER(AU11),(VLOOKUP(AU11,$BO$6:$BP$50,2)),0)","v":60},{"$f":"IF(AU11<>\"\",5,0)","v":5},{"$f":"AV11+AW11","v":65},null,null,{"$f":"IF(ISNUMBER(AZ11),(VLOOKUP(AZ11,$BO$6:$BP$50,2)),0)","v":0},{"$f":"IF(AZ11<>\"\",5,0)","v":0},{"$f":"BA11+BB11","v":0},null,null,{"$f":"IF(ISNUMBER(BE11),(VLOOKUP(BE11,$BO$6:$BP$50,2)),0)","v":0},{"$f":"IF(BE11<>\"\",5,0)","v":0},{"$f":"BF11+BG11","v":0},null,null,{"$f":"IF(ISNUMBER(BJ11),(VLOOKUP(BJ11,$BO$6:$BP$50,2)),0)","v":0},{"$f":"IF(BJ11<>\"\",5,0)","v":0},{"$f":"BK11+BL11","v":0},null,6,40,0,0,0,0,0,1,0,0]
[{"$f":"IF(E12<E11,BO12,A11)","v":7},"Finne","Peder August","Heming",{"$f":"IF(F12<=4,Q12,(Q12-SUM(SMALL(R12:Y12,{1;2;3;4}))))","v":199},{"$f":"(IF(AC12=5,1,0)+IF(AH12=5,1,0)+IF(AM12=5,1,0)+IF(AR12=5,1,0)+IF(AW12=5,1,0)+IF(BB12=5,1,0)+IF(BG12=5,1,0)+IF(BL12=5,1,0))","v":6},null,{"$f":"IF(AA12=\"\",\"\",AA12)","v":8},{"$f":"IF(AF12=\"\",\"\",AF12)","v":""},{"$f":"IF(AK12=\"\",\"\",AK12)","v":3},{"$f":"IF(AP12=\"\",\"\",AP12)","v":6},{"$f":"IF(AU12=\"\",\"\",AU12)","v":9},{"$f":"IF(AZ12=\"\",\"\",AZ12)","v":7},{"$f":"IF(BE12=\"\",\"\",BE12)","v":6},{"$f":"IF(BJ12=\"\",\"\",BJ12)","v":""},null,{"$f":"AD12+AI12+AN12+AS12+AX12+BC12+BH12","v":267},{"$f":"IF($F12>=5,IF(AB12=\"\",\"\",AB12),\"\")","v":32},{"$f":"IF($F12>=5,IF(AG12=\"\",\"\",AG12),\"\")","v":0},{"$f":"IF($F12>=5,IF(AL12=\"\",\"\",AL12),\"\")","v":60},{"$f":"IF($F12>=5,IF(AQ12=\"\",\"\",AQ12),\"\")","v":40},null,{"$f":"IF($F12>=5,IF(BA12=\"\",\"\",BA12),\"\")","v":36},{"$f":"IF($F12>=5,IF(BF12=\"\",\"\",BF12),\"\")","v":40},{"$f":"IF($F12>=5,IF(BK12=\"\",\"\",BK12),\"\")","v":0},null,8,{"$f":"IF(ISNUMBER(AA12),(VLOOKUP(AA12,$BO$6:$BP$50,2)),0)","v":32},{"$f":"IF(AA12<>\"\",5,0)","v":5},{"$f":"AB12+AC12","v":37},null,null,{"$f":"IF(ISNUMBER(AF12),(VLOOKUP(AF12,$BO$6:$BP$50,2)),0)","v":0},{"$f":"IF(AF12<>\"\",5,0)","v":0},{"$f":"AG12+AH12","v":0},null,3,{"$f":"IF(ISNUMBER(AK12),(VLOOKUP(AK12,$BO$6:$BP$50,2)),0)","v":60},{"$f":"IF(AK12<>\"\",5,0)","v":5},{"$f":"AL12+AM12","v":65},null,6,{"$f":"IF(ISNUMBER(AP12),(VLOOKUP(AP12,$BO$6:$BP$50,2)),0)","v":40},{"$f":"IF(AP12<>\"\",5,0)","v":5},{"$f":"AQ12+AR12","v":45},null,9,{"$f":"IF(ISNUMBER(AU12),(VLOOKUP(AU12,$BO$6:$BP$50,2)),0)","v":29},{"$f":"IF(AU12<>\"\",5,0)","v":5},{"$f":"AV12+AW12","v":34},null,7,{"$f":"IF(ISNUMBER(AZ12),(VLOOKUP(AZ12,$BO$6:$BP$50,2)),0)","v":36},{"$f":"IF(AZ12<>\"\",5,0)","v":5},{"$f":"BA12+BB12","v":41},null,6,{"$f":"IF(ISNUMBER(BE12),(VLOOKUP(BE12,$BO$6:$BP$50,2)),0)","v":40},{"$f":"IF(BE12<>\"\",5,0)","v":5},{"$f":"BF12+BG12","v":45},null,null,{"$f":"IF(ISNUMBER(BJ12),(VLOOKUP(BJ12,$BO$6:$BP$50,2)),0)","v":0},{"$f":"IF(BJ12<>\"\",5,0)","v":0},{"$f":"BK12+BL12","v":0},null,7,36,0,0,1,0,0,0,0,0]
[{"$f":"IF(E13<E12,BO13,A12)","v":8},"Røkke","Lukas Thulin","IRS",{"$f":"IF(F13<=4,Q13,(Q13-SUM(SMALL(R13:Y13,{1;2;3;4}))))","v":175},{"$f":"(IF(AC13=5,1,0)+IF(AH13=5,1,0)+IF(AM13=5,1,0)+IF(AR13=5,1,0)+IF(AW13=5,1,0)+IF(BB13=5,1,0)+IF(BG13=5,1,0)+IF(BL13=5,1,0))","v":7},null,{"$f":"IF(AA13=\"\",\"\",AA13)","v":4},{"$f":"IF(AF13=\"\",\"\",AF13)","v":8},{"$f":"IF(AK13=\"\",\"\",AK13)","v":17},{"$f":"IF(AP13=\"\",\"\",AP13)","v":8},{"$f":"IF(AU13=\"\",\"\",AU13)","v":10},{"$f":"IF(AZ13=\"\",\"\",AZ13)","v":15},{"$f":"IF(BE13=\"\",\"\",BE13)","v":"dsq"},{"$f":"IF(BJ13=\"\",\"\",BJ13)","v":""},null,{"$f":"AD13+AI13+AN13+AS13+AX13+BC13+BH13","v":205},{"$f":"IF($F13>=5,IF(AB13=\"\",\"\",AB13),\"\")","v":50},{"$f":"IF($F13>=5,IF(AG13=\"\",\"\",AG13),\"\")","v":32},{"$f":"IF($F13>=5,IF(AL13=\"\",\"\",AL13),\"\")","v":14},{"$f":"IF($F13>=5,IF(AQ13=\"\",\"\",AQ13),\"\")","v":32},{"$f":"IF($F13>=5,IF(AV13=\"\",\"\",AV13),\"\")","v":26},{"$f":"IF($F13>=5,IF(BA13=\"\",\"\",BA13),\"\")","v":16},{"$f":"IF($F13>=5,IF(BF13=\"\",\"\",BF13),\"\")","v":0},{"$f":"IF($F13>=5,IF(BK13=\"\",\"\",BK13),\"\")","v":0},null,4,{"$f":"IF(ISNUMBER(AA13),(VLOOKUP(AA13,$BO$6:$BP$50,2)),0)","v":50},{"$f":"IF(AA13<>\"\",5,0)","v":5},{"$f":"AB13+AC13","v":55},null,8,{"$f":"IF(ISNUMBER(AF13),(VLOOKUP(AF13,$BO$6:$BP$50,2)),0)","v":32},{"$f":"IF(AF13<>\"\",5,0)","v":5},{"$f":"AG13+AH13","v":37},null,17,{"$f":"IF(ISNUMBER(AK13),(VLOOKUP(AK13,$BO$6:$BP$50,2)),0)","v":14},{"$f":"IF(AK13<>\"\",5,0)","v":5},{"$f":"AL13+AM13","v":19},null,8,{"$f":"IF(ISNUMBER(AP13),(VLOOKUP(AP13,$BO$6:$BP$50,2)),0)","v":32},{"$f":"IF(AP13<>\"\",5,0)","v":5},{"$f":"AQ13+AR13","v":37},null,10,{"$f":"IF(ISNUMBER(AU13),(VLOOKUP(AU13,$BO$6:$BP$50,2)),0)","v":26},{"$f":"IF(AU13<>\"\",5,0)","v":5},{"$f":"AV13+AW13","v":31},null,15,{"$f":"IF(ISNUMBER(AZ13),(VLOOKUP(AZ13,$BO$6:$BP$50,2)),0)","v":16},{"$f":"IF(AZ13<>\"\",5,0)","v":5},{"$f":"BA13+BB13","v":21},null,"dsq",{"$f":"IF(ISNUMBER(BE13),(VLOOKUP(BE13,$BO$6:$BP$50,2)),0)","v":0},{"$f":"IF(BE13<>\"\",5,0)","v":5},{"$f":"BF13+BG13","v":5},null,null,{"$f":"IF(ISNUMBER(BJ13),(VLOOKUP(BJ13,$BO$6:$BP$50,2)),0)","v":0},{"$f":"IF(BJ13<>\"\",5,0)","v":0},{"$f":"BK13+BL13","v":0},null,8,32,0,1,0,0,0,0,0,0]
[{"$f":"IF(E14<E13,BO14,A13)","v":9},"Aasdal","BIRK","Ljan",{"$f":"IF(F14<=4,Q14,(Q14-SUM(SMALL(R14:Y14,{1;2;3;4}))))","v":162},{"$f":"(IF(AC14=5,1,0)+IF(AH14=5,1,0)+IF(AM14=5,1,0)+IF(AR14=5,1,0)+IF(AW14=5,1,0)+IF(BB14=5,1,0)+IF(BG14=5,1,0)+IF(BL14=5,1,0))","v":6},null,{"$f":"IF(AA14=\"\",\"\",AA14)","v":7},{"$f":"IF(AF14=\"\",\"\",AF14)","v":4},{"$f":"IF(AK14=\"\",\"\",AK14)","v":12},{"$f":"IF(AP14=\"\",\"\",AP14)","v":""},{"$f":"IF(AU14=\"\",\"\",AU14)","v":12},{"$f":"IF(AZ14=\"\",\"\",AZ14)","v":11},{"$f":"IF(BE14=\"\",\"\",BE14)","v":"dsq"},{"$f":"IF(BJ14=\"\",\"\",BJ14)","v":""},null,{"$f":"AD14+AI14+AN14+AS14+AX14+BC14+BH14","v":184},{"$f":"IF($F14>=5,IF(AB14=\"\",\"\",AB14),\"\")","v":36},{"$f":"IF($F14>=5,IF(AG14=\"\",\"\",AG14),\"\")","v":50},{"$f":"IF($F14>=5,IF(AL14=\"\",\"\",AL14),\"\")","v":22},{"$f":"IF($F14>=5,IF(AQ14=\"\",\"\",AQ14),\"\")","v":0},{"$f":"IF($F14>=5,IF(AV14=\"\",\"\",AV14),\"\")","v":22},{"$f":"IF($F14>=5,IF(BA14=\"\",\"\",BA14),\"\")","v":24},{"$f":"IF($F14>=5,IF(BF14=\"\",\"\",BF14),\"\")","v":0},{"$f":"IF($F14>=5,IF(BK14=\"\",\"\",BK14),\"\")","v":0},null,7,{"$f":"IF(ISNUMBER(AA14),(VLOOKUP(AA14,$BO$6:$BP$50,2)),0)","v":36},{"$f":"IF(AA14<>\"\",5,0)","v":5},{"$f":"AB14+AC14","v":41},null,4,{"$f":"IF(ISNUMBER(AF14),(VLOOKUP(AF14,$BO$6:$BP$50,2)),0)","v":50},{"$f":"IF(AF14<>\"\",5,0)","v":5},{"$f":"AG14+AH14","v":55},null,12,{"$f":"IF(ISNUMBER(AK14),(VLOOKUP(AK14,$BO$6:$BP$50,2)),0)","v":22},{"$f":"IF(AK14<>\"\",5,0)","v":5},{"$f":"AL14+AM14","v":27},null,null,{"$f":"IF(ISNUMBER(AP14),(VLOOKUP(AP14,$BO$6:$BP$50,2)),0)","v":0},{"$f":"IF(AP14<>\"\",5,0)","v":0},{"$f":"AQ14+AR14","v":0},null,12,{"$f":"IF(ISNUMBER(AU14),(VLOOKUP(AU14,$BO$6:$BP$50,2)),0)","v":22},{"$f":"IF(AU14<>\"\",5,0)","v":5},{"$f":"AV14+AW14","v":27},null,11,{"$f":"IF(ISNUMBER(AZ14),(VLOOKUP(AZ14,$BO$6:$BP$50,2)),0)","v":24},{"$f":"IF(AZ14<>\"\",5,0)","v":5},{"$f":"BA14+BB14","v":29},null,"dsq",{"$f":"IF(ISNUMBER(BE14),(VLOOKUP(BE14,$BO$6:$BP$50,2)),0)","v":0},{"$f":"IF(BE14<>\"\",5,0)","v":5},{"$f":"BF14+BG14","v":5},null,null,{"$f":"IF(ISNUMBER(BJ14),(VLOOKUP(BJ14,$BO$6:$BP$50,2)),0)","v":0},{"$f":"IF(BJ14<>\"\",5,0)","v":0},{"$f":"BK14+BL14","v":0},null,9,29,0,0,1,0,0,0,0,0]
[{"$f":"IF(E15<E14,BO15,A14)","v":10},"Bagstevold","Sindre","Heming",{"$f":"IF(F15<=4,Q15,(Q15-SUM(SMALL(R15:Y15,{1;2;3;4}))))","v":150},{"$f":"(IF(AC15=5,1,0)+IF(AH15=5,1,0)+IF(AM15=5,1,0)+IF(AR15=5,1,0)+IF(AW15=5,1,0)+IF(BB15=5,1,0)+IF(BG15=5,1,0)+IF(BL15=5,1,0))","v":3},null,{"$f":"IF(AA15=\"\",\"\",AA15)","v":""},{"$f":"IF(AF15=\"\",\"\",AF15)","v":""},{"$f":"IF(AK15=\"\",\"\",AK15)","v":5},{"$f":"IF(AP15=\"\",\"\",AP15)","v":""},{"$f":"IF(AU15=\"\",\"\",AU15)","v":6},{"$f":"IF(AZ15=\"\",\"\",AZ15)","v":""},{"$f":"IF(BE15=\"\",\"\",BE15)","v":4},{"$f":"IF(BJ15=\"\",\"\",BJ15)","v":""},null,{"$f":"AD15+AI15+AN15+AS15+AX15+BC15+BH15","v":150},{"$f":"IF($F15>=5,IF(AB15=\"\",\"\",AB15),\"\")","v":""},{"$f":"IF($F15>=5,IF(AG15=\"\",\"\",AG15),\"\")","v":""},{"$f":"IF($F15>=5,IF(AL15=\"\",\"\",AL15),\"\")","v":""},{"$f":"IF($F15>=5,IF(AQ15=\"\",\"\",AQ15),\"\")","v":""},{"$f":"IF($F15>=5,IF(AV15=\"\",\"\",AV15),\"\")","v":""},{"$f":"IF($F15>=5,IF(BA15=\"\",\"\",BA15),\"\")","v":""},{"$f":"IF($F15>=5,IF(BF15=\"\",\"\",BF15),\"\")","v":""},{"$f":"IF($F15>=5,IF(BK15=\"\",\"\",BK15),\"\")","v":""},null,null,{"$f":"IF(ISNUMBER(AA15),(VLOOKUP(AA15,$BO$6:$BP$50,2)),0)","v":0},{"$f":"IF(AA15<>\"\",5,0)","v":0},{"$f":"AB15+AC15","v":0},null,null,{"$f":"IF(ISNUMBER(AF15),(VLOOKUP(AF15,$BO$6:$BP$50,2)),0)","v":0},{"$f":"IF(AF15<>\"\",5,0)","v":0},{"$f":"AG15+AH15","v":0},null,5,{"$f":"IF(ISNUMBER(AK15),(VLOOKUP(AK15,$BO$6:$BP$50,2)),0)","v":45},{"$f":"IF(AK15<>\"\",5,0)","v":5},{"$f":"AL15+AM15","v":50},null,null,{"$f":"IF(ISNUMBER(AP15),(VLOOKUP(AP15,$BO$6:$BP$50,2)),0)","v":0},{"$f":"IF(AP15<>\"\",5,0)","v":0},{"$f":"AQ15+AR15","v":0},null,6,{"$f":"IF(ISNUMBER(AU15),(VLOOKUP(AU15,$BO$6:$BP$50,2)),0)","v":40},{"$f":"IF(AU15<>\"\",5,0)","v":5},{"$f":"AV15+AW15","v":45},null,null,{"$f":"IF(ISNUMBER(AZ15),(VLOOKUP(AZ15,$BO$6:$BP$50,2)),0)","v":0},{"$f":"IF(AZ15<>\"\",5,0)","v":0},{"$f":"BA15+BB15","v":0},null,4,{"$f":"IF(ISNUMBER(BE15),(VLOOKUP(BE15,$BO$6:$BP$50,2)),0)","v":50},{"$f":"IF(BE15<>\"\",5,0)","v":5},{"$f":"BF15+BG15","v":55},null,null,{"$f":"IF(ISNUMBER(BJ15),(VLOOKUP(BJ15,$BO$6:$BP$50,2)),0)","v":0},{"$f":"IF(BJ15<>\"\",5,0)","v":0},{"$f":"BK15+BL15","v":0},null,10,26,0,0,0,0,0,1,0,0]
[{"$f":"IF(E16<E15,BO16,A15)","v":11},"Toft","Ola Mostraum","Kjelsås",{"$f":"IF(F16<=4,Q16,(Q16-SUM(SMALL(R16:Y16,{1;2;3;4}))))","v":145},{"$f":"(IF(AC16=5,1,0)+IF(AH16=5,1,0)+IF(AM16=5,1,0)+IF(AR16=5,1,0)+IF(AW16=5,1,0)+IF(BB16=5,1,0)+IF(BG16=5,1,0)+IF(BL16=5,1,0))","v":6},null,{"$f":"IF(AA16=\"\",\"\",AA16)","v":10},{"$f":"IF(AF16=\"\",\"\",AF16)","v":"dsq"},{"$f":"IF(AK16=\"\",\"\",AK16)","v":19},{"$f":"IF(AP16=\"\",\"\",AP16)","v":14},{"$f":"IF(AU16=\"\",\"\",AU16)","v":""},{"$f":"IF(AZ16=\"\",\"\",AZ16)","v":10},{"$f":"IF(BE16=\"\",\"\",BE16)","v":5},{"$f":"IF(BJ16=\"\",\"\",BJ16)","v":""},null,{"$f":"AD16+AI16+AN16+AS16+AX16+BC16+BH16","v":157},{"$f":"IF($F16>=5,IF(AB16=\"\",\"\",AB16),\"\")","v":26},{"$f":"IF($F16>=5,IF(AG16=\"\",\"\",AG16),\"\")","v":0},{"$f":"IF($F16>=5,IF(AL16=\"\",\"\",AL16),\"\")","v":12},{"$f":"IF($F16>=5,IF(AQ16=\"\",\"\",AQ16),\"\")","v":18},{"$f":"IF($F16>=5,IF(AV16=\"\",\"\",AV16),\"\")","v":0},{"$f":"IF($F16>=5,IF(BA16=\"\",\"\",BA16),\"\")","v":26},{"$f":"IF($F16>=5,IF(BF16=\"\",\"\",BF16),\"\")","v":45},{"$f":"IF($F16>=5,IF(BK16=\"\",\"\",BK16),\"\")","v":0},null,10,{"$f":"IF(ISNUMBER(AA16),(VLOOKUP(AA16,$BO$6:$BP$50,2)),0)","v":26},{"$f":"IF(AA16<>\"\",5,0)","v":5},{"$f":"AB16+AC16","v":31},null,"dsq",{"$f":"IF(ISNUMBER(AF16),(VLOOKUP(AF16,$BO$6:$BP$50,2)),0)","v":0},{"$f":"IF(AF16<>\"\",5,0)","v":5},{"$f":"AG16+AH16","v":5},null,19,{"$f":"IF(ISNUMBER(AK16),(VLOOKUP(AK16,$BO$6:$BP$50,2)),0)","v":12},{"$f":"IF(AK16<>\"\",5,0)","v":5},{"$f":"AL16+AM16","v":17},null,14,{"$f":"IF(ISNUMBER(AP16),(VLOOKUP(AP16,$BO$6:$BP$50,2)),0)","v":18},{"$f":"IF(AP16<>\"\",5,0)","v":5},{"$f":"AQ16+AR16","v":23},null,null,{"$f":"IF(ISNUMBER(AU16),(VLOOKUP(AU16,$BO$6:$BP$50,2)),0)","v":0},{"$f":"IF(AU16<>\"\",5,0)","v":0},{"$f":"AV16+AW16","v":0},null,10,{"$f":"IF(ISNUMBER(AZ16),(VLOOKUP(AZ16,$BO$6:$BP$50,2)),0)","v":26},{"$f":"IF(AZ16<>\"\",5,0)","v":5},{"$f":"BA16+BB16","v":31},null,5,{"$f":"IF(ISNUMBER(BE16),(VLOOKUP(BE16,$BO$6:$BP$50,2)),0)","v":45},{"$f":"IF(BE16<>\"\",5,0)","v":5},{"$f":"BF16+BG16","v":50},null,null,{"$f":"IF(ISNUMBER(BJ16),(VLOOKUP(BJ16,$BO$6:$BP$50,2)),0)","v":0},{"$f":"IF(BJ16<>\"\",5,0)","v":0},{"$f":"BK16+BL16","v":0},null,11,24,0,0,1,0,0,0,0,0]
[{"$f":"IF(E17<E16,BO17,A16)","v":12},"Hartmann","Marius Holm","Ready",{"$f":"IF(F17<=4,Q17,(Q17-SUM(SMALL(R17:Y17,{1;2;3;4}))))","v":133},{"$f":"(IF(AC17=5,1,0)+IF(AH17=5,1,0)+IF(AM17=5,1,0)+IF(AR17=5,1,0)+IF(AW17=5,1,0)+IF(BB17=5,1,0)+IF(BG17=5,1,0)+IF(BL17=5,1,0))","v":7},null,{"$f":"IF(AA17=\"\",\"\",AA17)","v":12},{"$f":"IF(AF17=\"\",\"\",AF17)","v":6},{"$f":"IF(AK17=\"\",\"\",AK17)","v":20},{"$f":"IF(AP17=\"\",\"\",AP17)","v":15},{"$f":"IF(AU17=\"\",\"\",AU17)","v":19},{"$f":"IF(AZ17=\"\",\"\",AZ17)","v":21},{"$f":"IF(BE17=\"\",\"\",BE17)","v":13},{"$f":"IF(BJ17=\"\",\"\",BJ17)","v":""},null,{"$f":"AD17+AI17+AN17+AS17+AX17+BC17+BH17","v":166},{"$f":"IF($F17>=5,IF(AB17=\"\",\"\",AB17),\"\")","v":22},{"$f":"IF($F17>=5,IF(AG17=\"\",\"\",AG17),\"\")","v":40},{"$f":"IF($F17>=5,IF(AL17=\"\",\"\",AL17),\"\")","v":11},{"$f":"IF($F17>=5,IF(AQ17=\"\",\"\",AQ17),\"\")","v":16},{"$f":"IF($F17>=5,IF(AV17=\"\",\"\",AV17),\"\")","v":12},{"$f":"IF($F17>=5,IF(BA17=\"\",\"\",BA17),\"\")","v":10},{"$f":"IF($F17>=5,IF(BF17=\"\",\"\",BF17),\"\")","v":20},{"$f":"IF($F17>=5,IF(BK17=\"\",\"\",BK17),\"\")","v":0},null,12,{"$f":"IF(ISNUMBER(AA17),(VLOOKUP(AA17,$BO$6:$BP$50,2)),0)","v":22},{"$f":"IF(AA17<>\"\",5,0)","v":5},{"$f":"AB17+AC17","v":27},null,6,{"$f":"IF(ISNUMBER(AF17),(VLOOKUP(AF17,$BO$6:$BP$50,2)),0)","v":40},{"$f":"IF(AF17<>\"\",5,0)","v":5},{"$f":"AG17+AH17","v":45},null,20,{"$f":"IF(ISNUMBER(AK17),(VLOOKUP(AK17,$BO$6:$BP$50,2)),0)","v":11},{"$f":"IF(AK17<>\"\",5,0)","v":5},{"$f":"AL17+AM17","v":16},null,15,{"$f":"IF(ISNUMBER(AP17),(VLOOKUP(AP17,$BO$6:$BP$50,2)),0)","v":16},{"$f":"IF(AP17<>\"\",5,0)","v":5},{"$f":"AQ17+AR17","v":21},null,19,{"$f":"IF(ISNUMBER(AU17),(VLOOKUP(AU17,$BO$6:$BP$50,2)),0)","v":12},{"$f":"IF(AU17<>\"\",5,0)","v":5},{"$f":"AV17+AW17","v":17},null,21,{"$f":"IF(ISNUMBER(AZ17),(VLOOKUP(AZ17,$BO$6:$BP$50,2)),0)","v":10},{"$f":"IF(AZ17<>\"\",5,0)","v":5},{"$f":"BA17+BB17","v":15},null,13,{"$f":"IF(ISNUMBER(BE17),(VLOOKUP(BE17,$BO$6:$BP$50,2)),0)","v":20},{"$f":"IF(BE17<>\"\",5,0)","v":5},{"$f":"BF17+BG17","v":25},null,null,{"$f":"IF(ISNUMBER(BJ17),(VLOOKUP(BJ17,$BO$6:$BP$50,2)),0)","v":0},{"$f":"IF(BJ17<>\"\",5,0)","v":0},{"$f":"BK17+BL17","v":0},null,12,22,0,1,0,0,0,0,0,0]
[{"$f":"IF(E18<E17,BO18,A17)","v":13},"Kvæl","Elias","Rælingen",{"$f":"IF(F18<=4,Q18,(Q18-SUM(SMALL(R18:Y18,{1;2;3;4}))))","v":120},{"$f":"(IF(AC18=5,1,0)+IF(AH18=5,1,0)+IF(AM18=5,1,0)+IF(AR18=5,1,0)+IF(AW18=5,1,0)+IF(BB18=5,1,0)+IF(BG18=5,1,0)+IF(BL18=5,1,0))","v":2},null,{"$f":"IF(AA18=\"\",\"\",AA18)","v":""},{"$f":"IF(AF18=\"\",\"\",AF18)","v":""},{"$f":"IF(AK18=\"\",\"\",AK18)","v":""},{"$f":"IF(AP18=\"\",\"\",AP18)","v":""},{"$f":"IF(AU18=\"\",\"\",AU18)","v":4},{"$f":"IF(AZ18=\"\",\"\",AZ18)","v":3},{"$f":"IF(BE18=\"\",\"\",BE18)","v":""},{"$f":"IF(BJ18=\"\",\"\",BJ18)","v":""},null,{"$f":"AD18+AI18+AN18+AS18+AX18+BC18+BH18","v":120},{"$f":"IF($F18>=5,IF(AB18=\"\",\"\",AB18),\"\")","v":""},{"$f":"IF($F18>=5,IF(AG18=\"\",\"\",AG18),\"\")","v":""},{"$f":"IF($F18>=5,IF(AL18=\"\",\"\",AL18),\"\")","v":""},{"$f":"IF($F18>=5,IF(AQ18=\"\",\"\",AQ18),\"\")","v":""},{"$f":"IF($F18>=5,IF(AV18=\"\",\"\",AV18),\"\")","v":""},{"$f":"IF($F18>=5,IF(BA18=\"\",\"\",BA18),\"\")","v":""},{"$f":"IF($F18>=5,IF(BF18=\"\",\"\",BF18),\"\")","v":""},{"$f":"IF($F18>=5,IF(BK18=\"\",\"\",BK18),\"\")","v":""},null,null,{"$f":"IF(ISNUMBER(AA18),(VLOOKUP(AA18,$BO$6:$BP$50,2)),0)","v":0},{"$f":"IF(AA18<>\"\",5,0)","v":0},{"$f":"AB18+AC18","v":0},null,null,{"$f":"IF(ISNUMBER(AF18),(VLOOKUP(AF18,$BO$6:$BP$50,2)),0)","v":0},{"$f":"IF(AF18<>\"\",5,0)","v":0},{"$f":"AG18+AH18","v":0},null,null,{"$f":"IF(ISNUMBER(AK18),(VLOOKUP(AK18,$BO$6:$BP$50,2)),0)","v":0},{"$f":"IF(AK18<>\"\",5,0)","v":0},{"$f":"AL18+AM18","v":0},null,null,{"$f":"IF(ISNUMBER(AP18),(VLOOKUP(AP18,$BO$6:$BP$50,2)),0)","v":0},{"$f":"IF(AP18<>\"\",5,0)","v":0},{"$f":"AQ18+AR18","v":0},null,4,{"$f":"IF(ISNUMBER(AU18),(VLOOKUP(AU18,$BO$6:$BP$50,2)),0)","v":50},{"$f":"IF(AU18<>\"\",5,0)","v":5},{"$f":"AV18+AW18","v":55},null,3,{"$f":"IF(ISNUMBER(AZ18),(VLOOKUP(AZ18,$BO$6:$BP$50,2)),0)","v":60},{"$f":"IF(AZ18<>\"\",5,0)","v":5},{"$f":"BA18+BB18","v":65},null,null,{"$f":"IF(ISNUMBER(BE18),(VLOOKUP(BE18,$BO$6:$BP$50,2)),0)","v":0},{"$f":"IF(BE18<>\"\",5,0)","v":0},{"$f":"BF18+BG18","v":0},null,null,{"$f":"IF(ISNUMBER(BJ18),(VLOOKUP(BJ18,$BO$6:$BP$50,2)),0)","v":0},{"$f":"IF(BJ18<>\"\",5,0)","v":0},{"$f":"BK18+BL18","v":0},null,13,20,0,{"$f":"IF($F17=7,1,0)","v":1},{"$f":"IF($F17=6,1,0)","v":0},{"$f":"IF($F17=5,1,0)","v":0},{"$f":"IF($F17=4,1,0)","v":0},{"$f":"IF($F17=3,1,0)","v":0},{"$f":"IF($F17=2,1,0)","v":0},{"$f":"IF($F17=1,1,0)","v":0}]
[{"$f":"IF(E19<E18,BO19,A18)","v":13},"Rehman","Tor Fabian Evert","Ready",{"$f":"IF(F19<=4,Q19,(Q19-SUM(SMALL(R19:Y19,{1;2;3;4}))))","v":120},{"$f":"(IF(AC19=5,1,0)+IF(AH19=5,1,0)+IF(AM19=5,1,0)+IF(AR19=5,1,0)+IF(AW19=5,1,0)+IF(BB19=5,1,0)+IF(BG19=5,1,0)+IF(BL19=5,1,0))","v":4},null,{"$f":"IF(AA19=\"\",\"\",AA19)","v":9},{"$f":"IF(AF19=\"\",\"\",AF19)","v":""},{"$f":"IF(AK19=\"\",\"\",AK19)","v":18},{"$f":"IF(AP19=\"\",\"\",AP19)","v":12},{"$f":"IF(AU19=\"\",\"\",AU19)","v":""},{"$f":"IF(AZ19=\"\",\"\",AZ19)","v":""},{"$f":"IF(BE19=\"\",\"\",BE19)","v":7},{"$f":"IF(BJ19=\"\",\"\",BJ19)","v":""},null,{"$f":"AD19+AI19+AN19+AS19+AX19+BC19+BH19","v":120},{"$f":"IF($F19>=5,IF(AB19=\"\",\"\",AB19),\"\")","v":""},{"$f":"IF($F19>=5,IF(AG19=\"\",\"\",AG19),\"\")","v":""},{"$f":"IF($F19>=5,IF(AL19=\"\",\"\",AL19),\"\")","v":""},{"$f":"IF($F19>=5,IF(AQ19=\"\",\"\",AQ19),\"\")","v":""},{"$f":"IF($F19>=5,IF(AV19=\"\",\"\",AV19),\"\")","v":""},{"$f":"IF($F19>=5,IF(BA19=\"\",\"\",BA19),\"\")","v":""},{"$f":"IF($F19>=5,IF(BF19=\"\",\"\",BF19),\"\")","v":""},{"$f":"IF($F19>=5,IF(BK19=\"\",\"\",BK19),\"\")","v":""},null,9,{"$f":"IF(ISNUMBER(AA19),(VLOOKUP(AA19,$BO$6:$BP$50,2)),0)","v":29},{"$f":"IF(AA19<>\"\",5,0)","v":5},{"$f":"AB19+AC19","v":34},null,null,{"$f":"IF(ISNUMBER(AF19),(VLOOKUP(AF19,$BO$6:$BP$50,2)),0)","v":0},{"$f":"IF(AF19<>\"\",5,0)","v":0},{"$f":"AG19+AH19","v":0},null,18,{"$f":"IF(ISNUMBER(AK19),(VLOOKUP(AK19,$BO$6:$BP$50,2)),0)","v":13},{"$f":"IF(AK19<>\"\",5,0)","v":5},{"$f":"AL19+AM19","v":18},null,12,{"$f":"IF(ISNUMBER(AP19),(VLOOKUP(AP19,$BO$6:$BP$50,2)),0)","v":22},{"$f":"IF(AP19<>\"\",5,0)","v":5},{"$f":"AQ19+AR19","v":27},null,null,{"$f":"IF(ISNUMBER(AU19),(VLOOKUP(AU19,$BO$6:$BP$50,2)),0)","v":0},{"$f":"IF(AU19<>\"\",5,0)","v":0},{"$f":"AV19+AW19","v":0},null,null,{"$f":"IF(ISNUMBER(AZ19),(VLOOKUP(AZ19,$BO$6:$BP$50,2)),0)","v":0},{"$f":"IF(AZ19<>\"\",5,0)","v":0},{"$f":"BA19+BB19","v":0},null,7,{"$f":"IF(ISNUMBER(BE19),(VLOOKUP(BE19,$BO$6:$BP$50,2)),0)","v":36},{"$f":"IF(BE19<>\"\",5,0)","v":5},{"$f":"BF19+BG19","v":41},null,null,{"$f":"IF(ISNUMBER(BJ19),(VLOOKUP(BJ19,$BO$6:$BP$50,2)),0)","v":0},{"$f":"IF(BJ19<>\"\",5,0)","v":0},{"$f":"BK19+BL19","v":0},null,14,18,0,{"$f":"IF($F18=7,1,0)","v":0},{"$f":"IF($F18=6,1,0)","v":0},{"$f":"IF($F18=5,1,0)","v":0},{"$f":"IF($F18=4,1,0)","v":0},{"$f":"IF($F18=3,1,0)","v":0},{"$f":"IF($F18=2,1,0)","v":1},{"$f":"IF($F18=1,1,0)","v":0}]
[{"$f":"IF(E20<E19,BO20,A19)","v":15},"Lysgård","Sebastian","Try",{"$f":"IF(F20<=4,Q20,(Q20-SUM(SMALL(R20:Y20,{1;2;3;4}))))","v":116},{"$f":"(IF(AC20=5,1,0)+IF(AH20=5,1,0)+IF(AM20=5,1,0)+IF(AR20=5,1,0)+IF(AW20=5,1,0)+IF(BB20=5,1,0)+IF(BG20=5,1,0)+IF(BL20=5,1,0))","v":7},null,{"$f":"IF(AA20=\"\",\"\",AA20)","v":16},{"$f":"IF(AF20=\"\",\"\",AF20)","v":"dsq"},{"$f":"IF(AK20=\"\",\"\",AK20)","v":22},{"$f":"IF(AP20=\"\",\"\",AP20)","v":11},{"$f":"IF(AU20=\"\",\"\",AU20)","v":15},{"$f":"IF(AZ20=\"\",\"\",AZ20)","v":20},{"$f":"IF(BE20=\"\",\"\",BE20)","v":10},{"$f":"IF(BJ20=\"\",\"\",BJ20)","v":""},null,{"$f":"AD20+AI20+AN20+AS20+AX20+BC20+BH20","v":136},{"$f":"IF($F20>=5,IF(AB20=\"\",\"\",AB20),\"\")","v":15},{"$f":"IF($F20>=5,IF(AG20=\"\",\"\",AG20),\"\")","v":0},{"$f":"IF($F20>=5,IF(AL20=\"\",\"\",AL20),\"\")","v":9},{"$f":"IF($F20>=5,IF(AQ20=\"\",\"\",AQ20),\"\")","v":24},{"$f":"IF($F20>=5,IF(AV20=\"\",\"\",AV20),\"\")","v":16},{"$f":"IF($F20>=5,IF(BA20=\"\",\"\",BA20),\"\")","v":11},{"$f":"IF($F20>=5,IF(BF20=\"\",\"\",BF20),\"\")","v":26},{"$f":"IF($F20>=5,IF(BK20=\"\",\"\",BK20),\"\")","v":0},null,16,{"$f":"IF(ISNUMBER(AA20),(VLOOKUP(AA20,$BO$6:$BP$50,2)),0)","v":15},{"$f":"IF(AA20<>\"\",5,0)","v":5},{"$f":"AB20+AC20","v":20},null,"dsq",{"$f":"IF(ISNUMBER(AF20),(VLOOKUP(AF20,$BO$6:$BP$50,2)),0)","v":0},{"$f":"IF(AF20<>\"\",5,0)","v":5},{"$f":"AG20+AH20","v":5},null,22,{"$f":"IF(ISNUMBER(AK20),(VLOOKUP(AK20,$BO$6:$BP$50,2)),0)","v":9},{"$f":"IF(AK20<>\"\",5,0)","v":5},{"$f":"AL20+AM20","v":14},null,11,{"$f":"IF(ISNUMBER(AP20),(VLOOKUP(AP20,$BO$6:$BP$50,2)),0)","v":24},{"$f":"IF(AP20<>\"\",5,0)","v":5},{"$f":"AQ20+AR20","v":29},null,15,{"$f":"IF(ISNUMBER(AU20),(VLOOKUP(AU20,$BO$6:$BP$50,2)),0)","v":16},{"$f":"IF(AU20<>\"\",5,0)","v":5},{"$f":"AV20+AW20","v":21},null,20,{"$f":"IF(ISNUMBER(AZ20),(VLOOKUP(AZ20,$BO$6:$BP$50,2)),0)","v":11},{"$f":"IF(AZ20<>\"\",5,0)","v":5},{"$f":"BA20+BB20","v":16},null,10,{"$f":"IF(ISNUMBER(BE20),(VLOOKUP(BE20,$BO$6:$BP$50,2)),0)","v":26},{"$f":"IF(BE20<>\"\",5,0)","v":5},{"$f":"BF20+BG20","v":31},null,null,{"$f":"IF(ISNUMBER(BJ20),(VLOOKUP(BJ20,$BO$6:$BP$50,2)),0)","v":0},{"$f":"IF(BJ20<>\"\",5,0)","v":0},{"$f":"BK20+BL20","v":0},null,15,16,0,{"$f":"IF($F19=7,1,0)","v":0},{"$f":"IF($F19=6,1,0)","v":0},{"$f":"IF($F19=5,1,0)","v":0},{"$f":"IF($F19=4,1,0)","v":1},{"$f":"IF($F19=3,1,0)","v":0},{"$f":"IF($F19=2,1,0)","v":0},{"$f":"IF($F19=1,1,0)","v":0}]
[{"$f":"IF(E21<E20,BO21,A20)","v":16},"Knudsen","Leon Loco","IRS",{"$f":"IF(F21<=4,Q21,(Q21-SUM(SMALL(R21:Y21,{1;2;3;4}))))","v":110},{"$f":"(IF(AC21=5,1,0)+IF(AH21=5,1,0)+IF(AM21=5,1,0)+IF(AR21=5,1,0)+IF(AW21=5,1,0)+IF(BB21=5,1,0)+IF(BG21=5,1,0)+IF(BL21=5,1,0))","v":2},null,{"$f":"IF(AA21=\"\",\"\",AA21)","v":""},{"$f":"IF(AF21=\"\",\"\",AF21)","v":""},{"$f":"IF(AK21=\"\",\"\",AK21)","v":""},{"$f":"IF(AP21=\"\",\"\",AP21)","v":""},{"$f":"IF(AU21=\"\",\"\",AU21)","v":""},{"$f":"IF(AZ21=\"\",\"\",AZ21)","v":1},{"$f":"IF(BE21=\"\",\"\",BE21)","v":"dsq"},{"$f":"IF(BJ21=\"\",\"\",BJ21)","v":""},null,{"$f":"AD21+AI21+AN21+AS21+AX21+BC21+BH21","v":110},{"$f":"IF($F21>=5,IF(AB21=\"\",\"\",AB21),\"\")","v":""},{"$f":"IF($F21>=5,IF(AG21=\"\",\"\",AG21),\"\")","v":""},{"$f":"IF($F21>=5,IF(AL21=\"\",\"\",AL21),\"\")","v":""},{"$f":"IF($F21>=5,IF(AQ21=\"\",\"\",AQ21),\"\")","v":""},{"$f":"IF($F21>=5,IF(AV21=\"\",\"\",AV21),\"\")","v":""},{"$f":"IF($F21>=5,IF(BA21=\"\",\"\",BA21),\"\")","v":""},{"$f":"IF($F21>=5,IF(BF21=\"\",\"\",BF21),\"\")","v":""},{"$f":"IF($F21>=5,IF(BK21=\"\",\"\",BK21),\"\")","v":""},null,null,{"$f":"IF(ISNUMBER(AA21),(VLOOKUP(AA21,$BO$6:$BP$50,2)),0)","v":0},{"$f":"IF(AA21<>\"\",5,0)","v":0},{"$f":"AB21+AC21","v":0},null,null,{"$f":"IF(ISNUMBER(AF21),(VLOOKUP(AF21,$BO$6:$BP$50,2)),0)","v":0},{"$f":"IF(AF21<>\"\",5,0)","v":0},{"$f":"AG21+AH21","v":0},null,null,{"$f":"IF(ISNUMBER(AK21),(VLOOKUP(AK21,$BO$6:$BP$50,2)),0)","v":0},{"$f":"IF(AK21<>\"\",5,0)","v":0},{"$f":"AL21+AM21","v":0},null,null,{"$f":"IF(ISNUMBER(AP21),(VLOOKUP(AP21,$BO$6:$BP$50,2)),0)","v":0},{"$f":"IF(AP21<>\"\",5,0)","v":0},{"$f":"AQ21+AR21","v":0},null,null,{"$f":"IF(ISNUMBER(AU21),(VLOOKUP(AU21,$BO$6:$BP$50,2)),0)","v":0},{"$f":"IF(AU21<>\"\",5,0)","v":0},{"$f":"AV21+AW21","v":0},null,1,{"$f":"IF(ISNUMBER(AZ21),(VLOOKUP(AZ21,$BO$6:$BP$50,2)),0)","v":100},{"$f":"IF(AZ21<>\"\",5,0)","v":5},{"$f":"BA21+BB21","v":105},null,"dsq",{"$f":"IF(ISNUMBER(BE21),(VLOOKUP(BE21,$BO$6:$BP$50,2)),0)","v":0},{"$f":"IF(BE21<>\"\",5,0)","v":5},{"$f":"BF21+BG21","v":5},null,null,{"$f":"IF(ISNUMBER(BJ21),(VLOOKUP(BJ21,$BO$6:$BP$50,2)),0)","v":0},{"$f":"IF(BJ21<>\"\",5,0)","v":0},{"$f":"BK21+BL21","v":0},null,16,15,0,{"$f":"IF($F19=7,1,0)","v":0},{"$f":"IF($F19=6,1,0)","v":0},{"$f":"IF($F19=5,1,0)","v":0},{"$f":"IF($F19=4,1,0)","v":1},{"$f":"IF($F19=3,1,0)","v":0},{"$f":"IF($F19=2,1,0)","v":0},{"$f":"IF($F19=1,1,0)","v":0}]
[{"$f":"IF(E22<E21,BO22,A21)","v":17},"Tschudi-Nytvedt","Sebastian","Heming",{"$f":"IF(F22<=4,Q22,(Q22-SUM(SMALL(R22:Y22,{1;2;3;4}))))","v":100},{"$f":"(IF(AC22=5,1,0)+IF(AH22=5,1,0)+IF(AM22=5,1,0)+IF(AR22=5,1,0)+IF(AW22=5,1,0)+IF(BB22=5,1,0)+IF(BG22=5,1,0)+IF(BL22=5,1,0))","v":3},null,{"$f":"IF(AA22=\"\",\"\",AA22)","v":""},{"$f":"IF(AF22=\"\",\"\",AF22)","v":""},{"$f":"IF(AK22=\"\",\"\",AK22)","v":9},{"$f":"IF(AP22=\"\",\"\",AP22)","v":7},{"$f":"IF(AU22=\"\",\"\",AU22)","v":13},{"$f":"IF(AZ22=\"\",\"\",AZ22)","v":""},{"$f":"IF(BE22=\"\",\"\",BE22)","v":""},{"$f":"IF(BJ22=\"\",\"\",BJ22)","v":""},null,{"$f":"AD22+AI22+AN22+AS22+AX22+BC22+BH22","v":100},{"$f":"IF($F22>=5,IF(AB22=\"\",\"\",AB22),\"\")","v":""},{"$f":"IF($F22>=5,IF(AG22=\"\",\"\",AG22),\"\")","v":""},{"$f":"IF($F22>=5,IF(AL22=\"\",\"\",AL22),\"\")","v":""},{"$f":"IF($F22>=5,IF(AQ22=\"\",\"\",AQ22),\"\")","v":""},{"$f":"IF($F22>=5,IF(AV22=\"\",\"\",AV22),\"\")","v":""},{"$f":"IF($F22>=5,IF(BA22=\"\",\"\",BA22),\"\")","v":""},{"$f":"IF($F22>=5,IF(BF22=\"\",\"\",BF22),\"\")","v":""},{"$f":"IF($F22>=5,IF(BK22=\"\",\"\",BK22),\"\")","v":""},null,null,{"$f":"IF(ISNUMBER(AA22),(VLOOKUP(AA22,$BO$6:$BP$50,2)),0)","v":0},{"$f":"IF(AA22<>\"\",5,0)","v":0},{"$f":"AB22+AC22","v":0},null,null,{"$f":"IF(ISNUMBER(AF22),(VLOOKUP(AF22,$BO$6:$BP$50,2)),0)","v":0},{"$f":"IF(AF22<>\"\",5,0)","v":0},{"$f":"AG22+AH22","v":0},null,9,{"$f":"IF(ISNUMBER(AK22),(VLOOKUP(AK22,$BO$6:$BP$50,2)),0)","v":29},{"$f":"IF(AK22<>\"\",5,0)","v":5},{"$f":"AL22+AM22","v":34},null,7,{"$f":"IF(ISNUMBER(AP22),(VLOOKUP(AP22,$BO$6:$BP$50,2)),0)","v":36},{"$f":"IF(AP22<>\"\",5,0)","v":5},{"$f":"AQ22+AR22","v":41},null,13,{"$f":"IF(ISNUMBER(AU22),(VLOOKUP(AU22,$BO$6:$BP$50,2)),0)","v":20},{"$f":"IF(AU22<>\"\",5,0)","v":5},{"$f":"AV22+AW22","v":25},null,null,{"$f":"IF(ISNUMBER(AZ22),(VLOOKUP(AZ22,$BO$6:$BP$50,2)),0)","v":0},{"$f":"IF(AZ22<>\"\",5,0)","v":0},{"$f":"BA22+BB22","v":0},null,null,{"$f":"IF(ISNUMBER(BE22),(VLOOKUP(BE22,$BO$6:$BP$50,2)),0)","v":0},{"$f":"IF(BE22<>\"\",5,0)","v":0},{"$f":"BF22+BG22","v":0},null,null,{"$f":"IF(ISNUMBER(BJ22),(VLOOKUP(BJ22,$BO$6:$BP$50,2)),0)","v":0},{"$f":"IF(BJ22<>\"\",5,0)","v":0},{"$f":"BK22+BL22","v":0},null,17,14,0,1,0,0,0,0,0,0]
[{"$f":"IF(E23<E22,BO23,A22)","v":18},"Johnsen","Christian Hjallum","Heming",{"$f":"IF(F23<=4,Q23,(Q23-SUM(SMALL(R23:Y23,{1;2;3;4}))))","v":98},{"$f":"(IF(AC23=5,1,0)+IF(AH23=5,1,0)+IF(AM23=5,1,0)+IF(AR23=5,1,0)+IF(AW23=5,1,0)+IF(BB23=5,1,0)+IF(BG23=5,1,0)+IF(BL23=5,1,0))","v":4},null,{"$f":"IF(AA23=\"\",\"\",AA23)","v":"dsq"},{"$f":"IF(AF23=\"\",\"\",AF23)","v":""},{"$f":"IF(AK23=\"\",\"\",AK23)","v":13},{"$f":"IF(AP23=\"\",\"\",AP23)","v":9},{"$f":"IF(AU23=\"\",\"\",AU23)","v":""},{"$f":"IF(AZ23=\"\",\"\",AZ23)","v":""},{"$f":"IF(BE23=\"\",\"\",BE23)","v":9},{"$f":"IF(BJ23=\"\",\"\",BJ23)","v":""},null,{"$f":"AD23+AI23+AN23+AS23+AX23+BC23+BH23","v":98},{"$f":"IF($F23>=5,IF(AB23=\"\",\"\",AB23),\"\")","v":""},{"$f":"IF($F23>=5,IF(AG23=\"\",\"\",AG23),\"\")","v":""},{"$f":"IF($F23>=5,IF(AL23=\"\",\"\",AL23),\"\")","v":""},{"$f":"IF($F23>=5,IF(AQ23=\"\",\"\",AQ23),\"\")","v":""},{"$f":"IF($F23>=5,IF(AV23=\"\",\"\",AV23),\"\")","v":""},{"$f":"IF($F23>=5,IF(BA23=\"\",\"\",BA23),\"\")","v":""},{"$f":"IF($F23>=5,IF(BF23=\"\",\"\",BF23),\"\")","v":""},{"$f":"IF($F23>=5,IF(BK23=\"\",\"\",BK23),\"\")","v":""},null,"dsq",{"$f":"IF(ISNUMBER(AA23),(VLOOKUP(AA23,$BO$6:$BP$50,2)),0)","v":0},{"$f":"IF(AA23<>\"\",5,0)","v":5},{"$f":"AB23+AC23","v":5},null,null,{"$f":"IF(ISNUMBER(AF23),(VLOOKUP(AF23,$BO$6:$BP$50,2)),0)","v":0},{"$f":"IF(AF23<>\"\",5,0)","v":0},{"$f":"AG23+AH23","v":0},null,13,{"$f":"IF(ISNUMBER(AK23),(VLOOKUP(AK23,$BO$6:$BP$50,2)),0)","v":20},{"$f":"IF(AK23<>\"\",5,0)","v":5},{"$f":"AL23+AM23","v":25},null,9,{"$f":"IF(ISNUMBER(AP23),(VLOOKUP(AP23,$BO$6:$BP$50,2)),0)","v":29},{"$f":"IF(AP23<>\"\",5,0)","v":5},{"$f":"AQ23+AR23","v":34},null,null,{"$f":"IF(ISNUMBER(AU23),(VLOOKUP(AU23,$BO$6:$BP$50,2)),0)","v":0},{"$f":"IF(AU23<>\"\",5,0)","v":0},{"$f":"AV23+AW23","v":0},null,null,{"$f":"IF(ISNUMBER(AZ23),(VLOOKUP(AZ23,$BO$6:$BP$50,2)),0)","v":0},{"$f":"IF(AZ23<>\"\",5,0)","v":0},{"$f":"BA23+BB23","v":0},null,9,{"$f":"IF(ISNUMBER(BE23),(VLOOKUP(BE23,$BO$6:$BP$50,2)),0)","v":29},{"$f":"IF(BE23<>\"\",5,0)","v":5},{"$f":"BF23+BG23","v":34},null,null,{"$f":"IF(ISNUMBER(BJ23),(VLOOKUP(BJ23,$BO$6:$BP$50,2)),0)","v":0},{"$f":"IF(BJ23<>\"\",5,0)","v":0},{"$f":"BK23+BL23","v":0},null,18,13,0,0,0,0,0,0,1,0]
[{"$f":"IF(E24<E23,BO24,A23)","v":19},"Bakkevig","Johannes","Heming",{"$f":"IF(F24<=4,Q24,(Q24-SUM(SMALL(R24:Y24,{1;2;3;4}))))","v":97},{"$f":"(IF(AC24=5,1,0)+IF(AH24=5,1,0)+IF(AM24=5,1,0)+IF(AR24=5,1,0)+IF(AW24=5,1,0)+IF(BB24=5,1,0)+IF(BG24=5,1,0)+IF(BL24=5,1,0))","v":2},null,{"$f":"IF(AA24=\"\",\"\",AA24)","v":""},{"$f":"IF(AF24=\"\",\"\",AF24)","v":""},{"$f":"IF(AK24=\"\",\"\",AK24)","v":""},{"$f":"IF(AP24=\"\",\"\",AP24)","v":""},{"$f":"IF(AU24=\"\",\"\",AU24)","v":24},{"$f":"IF(AZ24=\"\",\"\",AZ24)","v":""},{"$f":"IF(BE24=\"\",\"\",BE24)","v":2},{"$f":"IF(BJ24=\"\",\"\",BJ24)","v":""},null,{"$f":"AD24+AI24+AN24+AS24+AX24+BC24+BH24","v":97},{"$f":"IF($F24>=5,IF(AB24=\"\",\"\",AB24),\"\")","v":""},{"$f":"IF($F24>=5,IF(AG24=\"\",\"\",AG24),\"\")","v":""},{"$f":"IF($F24>=5,IF(AL24=\"\",\"\",AL24),\"\")","v":""},{"$f":"IF($F24>=5,IF(AQ24=\"\",\"\",AQ24),\"\")","v":""},{"$f":"IF($F24>=5,IF(AV24=\"\",\"\",AV24),\"\")","v":""},{"$f":"IF($F24>=5,IF(BA24=\"\",\"\",BA24),\"\")","v":""},{"$f":"IF($F24>=5,IF(BF24=\"\",\"\",BF24),\"\")","v":""},{"$f":"IF($F24>=5,IF(BK24=\"\",\"\",BK24),\"\")","v":""},null,null,{"$f":"IF(ISNUMBER(AA24),(VLOOKUP(AA24,$BO$6:$BP$50,2)),0)","v":0},{"$f":"IF(AA24<>\"\",5,0)","v":0},{"$f":"AB24+AC24","v":0},null,null,{"$f":"IF(ISNUMBER(AF24),(VLOOKUP(AF24,$BO$6:$BP$50,2)),0)","v":0},{"$f":"IF(AF24<>\"\",5,0)","v":0},{"$f":"AG24+AH24","v":0},null,null,{"$f":"IF(ISNUMBER(AK24),(VLOOKUP(AK24,$BO$6:$BP$50,2)),0)","v":0},{"$f":"IF(AK24<>\"\",5,0)","v":0},{"$f":"AL24+AM24","v":0},null,null,{"$f":"IF(ISNUMBER(AP24),(VLOOKUP(AP24,$BO$6:$BP$50,2)),0)","v":0},{"$f":"IF(AP24<>\"\",5,0)","v":0},{"$f":"AQ24+AR24","v":0},null,24,{"$f":"IF(ISNUMBER(AU24),(VLOOKUP(AU24,$BO$6:$BP$50,2)),0)","v":7},{"$f":"IF(AU24<>\"\",5,0)","v":5},{"$f":"AV24+AW24","v":12},null,null,{"$f":"IF(ISNUMBER(AZ24),(VLOOKUP(AZ24,$BO$6:$BP$50,2)),0)","v":0},{"$f":"IF(AZ24<>\"\",5,0)","v":0},{"$f":"BA24+BB24","v":0},null,2,{"$f":"IF(ISNUMBER(BE24),(VLOOKUP(BE24,$BO$6:$BP$50,2)),0)","v":80},{"$f":"IF(BE24<>\"\",5,0)","v":5},{"$f":"BF24+BG24","v":85},null,null,{"$f":"IF(ISNUMBER(BJ24),(VLOOKUP(BJ24,$BO$6:$BP$50,2)),0)","v":0},{"$f":"IF(BJ24<>\"\",5,0)","v":0},{"$f":"BK24+BL24","v":0},null,19,12,0,0,0,0,0,1,0,0]
[{"$f":"IF(E25<E24,BO25,A24)","v":20},"Hole","Henrik Grøthe","IRS",{"$f":"IF(F25<=4,Q25,(Q25-SUM(SMALL(R25:Y25,{1;2;3;4}))))","v":96},{"$f":"(IF(AC25=5,1,0)+IF(AH25=5,1,0)+IF(AM25=5,1,0)+IF(AR25=5,1,0)+IF(AW25=5,1,0)+IF(BB25=5,1,0)+IF(BG25=5,1,0)+IF(BL25=5,1,0))","v":4},null,{"$f":"IF(AA25=\"\",\"\",AA25)","v":14},{"$f":"IF(AF25=\"\",\"\",AF25)","v":7},{"$f":"IF(AK25=\"\",\"\",AK25)","v":""},{"$f":"IF(AP25=\"\",\"\",AP25)","v":""},{"$f":"IF(AU25=\"\",\"\",AU25)","v":21},{"$f":"IF(AZ25=\"\",\"\",AZ25)","v":""},{"$f":"IF(BE25=\"\",\"\",BE25)","v":19},{"$f":"IF(BJ25=\"\",\"\",BJ25)","v":""},null,{"$f":"AD25+AI25+AN25+AS25+AX25+BC25+BH25","v":96},{"$f":"IF($F25>=5,IF(AB25=\"\",\"\",AB25),\"\")","v":""},{"$f":"IF($F25>=5,IF(AG25=\"\",\"\",AG25),\"\")","v":""},{"$f":"IF($F25>=5,IF(AL25=\"\",\"\",AL25),\"\")","v":""},{"$f":"IF($F25>=5,IF(AQ25=\"\",\"\",AQ25),\"\")","v":""},{"$f":"IF($F25>=5,IF(AV25=\"\",\"\",AV25),\"\")","v":""},{"$f":"IF($F25>=5,IF(BA25=\"\",\"\",BA25),\"\")","v":""},{"$f":"IF($F25>=5,IF(BF25=\"\",\"\",BF25),\"\")","v":""},{"$f":"IF($F25>=5,IF(BK25=\"\",\"\",BK25),\"\")","v":""},null,14,{"$f":"IF(ISNUMBER(AA25),(VLOOKUP(AA25,$BO$6:$BP$50,2)),0)","v":18},{"$f":"IF(AA25<>\"\",5,0)","v":5},{"$f":"AB25+AC25","v":23},null,7,{"$f":"IF(ISNUMBER(AF25),(VLOOKUP(AF25,$BO$6:$BP$50,2)),0)","v":36},{"$f":"IF(AF25<>\"\",5,0)","v":5},{"$f":"AG25+AH25","v":41},null,null,{"$f":"IF(ISNUMBER(AK25),(VLOOKUP(AK25,$BO$6:$BP$50,2)),0)","v":0},{"$f":"IF(AK25<>\"\",5,0)","v":0},{"$f":"AL25+AM25","v":0},null,null,{"$f":"IF(ISNUMBER(AP25),(VLOOKUP(AP25,$BO$6:$BP$50,2)),0)","v":0},{"$f":"IF(AP25<>\"\",5,0)","v":0},{"$f":"AQ25+AR25","v":0},null,21,{"$f":"IF(ISNUMBER(AU25),(VLOOKUP(AU25,$BO$6:$BP$50,2)),0)","v":10},{"$f":"IF(AU25<>\"\",5,0)","v":5},{"$f":"AV25+AW25","v":15},null,null,{"$f":"IF(ISNUMBER(AZ25),(VLOOKUP(AZ25,$BO$6:$BP$50,2)),0)","v":0},{"$f":"IF(AZ25<>\"\",5,0)","v":0},{"$f":"BA25+BB25","v":0},null,19,{"$f":"IF(ISNUMBER(BE25),(VLOOKUP(BE25,$BO$6:$BP$50,2)),0)","v":12},{"$f":"IF(BE25<>\"\",5,0)","v":5},{"$f":"BF25+BG25","v":17},null,null,{"$f":"IF(ISNUMBER(BJ25),(VLOOKUP(BJ25,$BO$6:$BP$50,2)),0)","v":0},{"$f":"IF(BJ25<>\"\",5,0)","v":0},{"$f":"BK25+BL25","v":0},null,20,11,0,0,0,0,1,0,0,0]
[{"$f":"IF(E26<E25,BO26,A25)","v":20},"Burum-Auensen","Jan Nicolas","Njård",{"$f":"IF(F26<=4,Q26,(Q26-SUM(SMALL(R26:Y26,{1;2;3;4}))))","v":96},{"$f":"(IF(AC26=5,1,0)+IF(AH26=5,1,0)+IF(AM26=5,1,0)+IF(AR26=5,1,0)+IF(AW26=5,1,0)+IF(BB26=5,1,0)+IF(BG26=5,1,0)+IF(BL26=5,1,0))","v":4},null,{"$f":"IF(AA26=\"\",\"\",AA26)","v":15},{"$f":"IF(AF26=\"\",\"\",AF26)","v":""},{"$f":"IF(AK26=\"\",\"\",AK26)","v":14},{"$f":"IF(AP26=\"\",\"\",AP26)","v":13},{"$f":"IF(AU26=\"\",\"\",AU26)","v":""},{"$f":"IF(AZ26=\"\",\"\",AZ26)","v":""},{"$f":"IF(BE26=\"\",\"\",BE26)","v":12},{"$f":"IF(BJ26=\"\",\"\",BJ26)","v":""},null,{"$f":"AD26+AI26+AN26+AS26+AX26+BC26+BH26","v":96},{"$f":"IF($F26>=5,IF(AB26=\"\",\"\",AB26),\"\")","v":""},{"$f":"IF($F26>=5,IF(AG26=\"\",\"\",AG26),\"\")","v":""},{"$f":"IF($F26>=5,IF(AL26=\"\",\"\",AL26),\"\")","v":""},{"$f":"IF($F26>=5,IF(AQ26=\"\",\"\",AQ26),\"\")","v":""},{"$f":"IF($F26>=5,IF(AV26=\"\",\"\",AV26),\"\")","v":""},{"$f":"IF($F26>=5,IF(BA26=\"\",\"\",BA26),\"\")","v":""},{"$f":"IF($F26>=5,IF(BF26=\"\",\"\",BF26),\"\")","v":""},{"$f":"IF($F26>=5,IF(BK26=\"\",\"\",BK26),\"\")","v":""},null,15,{"$f":"IF(ISNUMBER(AA26),(VLOOKUP(AA26,$BO$6:$BP$50,2)),0)","v":16},{"$f":"IF(AA26<>\"\",5,0)","v":5},{"$f":"AB26+AC26","v":21},null,null,{"$f":"IF(ISNUMBER(AF26),(VLOOKUP(AF26,$BO$6:$BP$50,2)),0)","v":0},{"$f":"IF(AF26<>\"\",5,0)","v":0},{"$f":"AG26+AH26","v":0},null,14,{"$f":"IF(ISNUMBER(AK26),(VLOOKUP(AK26,$BO$6:$BP$50,2)),0)","v":18},{"$f":"IF(AK26<>\"\",5,0)","v":5},{"$f":"AL26+AM26","v":23},null,13,{"$f":"IF(ISNUMBER(AP26),(VLOOKUP(AP26,$BO$6:$BP$50,2)),0)","v":20},{"$f":"IF(AP26<>\"\",5,0)","v":5},{"$f":"AQ26+AR26","v":25},null,null,{"$f":"IF(ISNUMBER(AU26),(VLOOKUP(AU26,$BO$6:$BP$50,2)),0)","v":0},{"$f":"IF(AU26<>\"\",5,0)","v":0},{"$f":"AV26+AW26","v":0},null,null,{"$f":"IF(ISNUMBER(AZ26),(VLOOKUP(AZ26,$BO$6:$BP$50,2)),0)","v":0},{"$f":"IF(AZ26<>\"\",5,0)","v":0},{"$f":"BA26+BB26","v":0},null,12,{"$f":"IF(ISNUMBER(BE26),(VLOOKUP(BE26,$BO$6:$BP$50,2)),0)","v":22},{"$f":"IF(BE26<>\"\",5,0)","v":5},{"$f":"BF26+BG26","v":27},null,null,{"$f":"IF(ISNUMBER(BJ26),(VLOOKUP(BJ26,$BO$6:$BP$50,2)),0)","v":0},{"$f":"IF(BJ26<>\"\",5,0)","v":0},{"$f":"BK26+BL26","v":0},null,21,10,0,0,0,0,0,0,1,0]
[{"$f":"IF(E27<E26,BO27,A26)","v":22},"Kildal","Peder Risøe","Heming",{"$f":"IF(F27<=4,Q27,(Q27-SUM(SMALL(R27:Y27,{1;2;3;4}))))","v":91},{"$f":"(IF(AC27=5,1,0)+IF(AH27=5,1,0)+IF(AM27=5,1,0)+IF(AR27=5,1,0)+IF(AW27=5,1,0)+IF(BB27=5,1,0)+IF(BG27=5,1,0)+IF(BL27=5,1,0))","v":3},null,{"$f":"IF(AA27=\"\",\"\",AA27)","v":""},{"$f":"IF(AF27=\"\",\"\",AF27)","v":""},{"$f":"IF(AK27=\"\",\"\",AK27)","v":10},{"$f":"IF(AP27=\"\",\"\",AP27)","v":10},{"$f":"IF(AU27=\"\",\"\",AU27)","v":11},{"$f":"IF(AZ27=\"\",\"\",AZ27)","v":""},{"$f":"IF(BE27=\"\",\"\",BE27)","v":""},{"$f":"IF(BJ27=\"\",\"\",BJ27)","v":""},null,{"$f":"AD27+AI27+AN27+AS27+AX27+BC27+BH27","v":91},{"$f":"IF($F27>=5,IF(AB27=\"\",\"\",AB27),\"\")","v":""},{"$f":"IF($F27>=5,IF(AG27=\"\",\"\",AG27),\"\")","v":""},{"$f":"IF($F27>=5,IF(AL27=\"\",\"\",AL27),\"\")","v":""},{"$f":"IF($F27>=5,IF(AQ27=\"\",\"\",AQ27),\"\")","v":""},{"$f":"IF($F27>=5,IF(AV27=\"\",\"\",AV27),\"\")","v":""},{"$f":"IF($F27>=5,IF(BA27=\"\",\"\",BA27),\"\")","v":""},{"$f":"IF($F27>=5,IF(BF27=\"\",\"\",BF27),\"\")","v":""},{"$f":"IF($F27>=5,IF(BK27=\"\",\"\",BK27),\"\")","v":""},null,null,{"$f":"IF(ISNUMBER(AA27),(VLOOKUP(AA27,$BO$6:$BP$50,2)),0)","v":0},{"$f":"IF(AA27<>\"\",5,0)","v":0},{"$f":"AB27+AC27","v":0},null,null,{"$f":"IF(ISNUMBER(AF27),(VLOOKUP(AF27,$BO$6:$BP$50,2)),0)","v":0},{"$f":"IF(AF27<>\"\",5,0)","v":0},{"$f":"AG27+AH27","v":0},null,10,{"$f":"IF(ISNUMBER(AK27),(VLOOKUP(AK27,$BO$6:$BP$50,2)),0)","v":26},{"$f":"IF(AK27<>\"\",5,0)","v":5},{"$f":"AL27+AM27","v":31},null,10,{"$f":"IF(ISNUMBER(AP27),(VLOOKUP(AP27,$BO$6:$BP$50,2)),0)","v":26},{"$f":"IF(AP27<>\"\",5,0)","v":5},{"$f":"AQ27+AR27","v":31},null,11,{"$f":"IF(ISNUMBER(AU27),(VLOOKUP(AU27,$BO$6:$BP$50,2)),0)","v":24},{"$f":"IF(AU27<>\"\",5,0)","v":5},{"$f":"AV27+AW27","v":29},null,null,{"$f":"IF(ISNUMBER(AZ27),(VLOOKUP(AZ27,$BO$6:$BP$50,2)),0)","v":0},{"$f":"IF(AZ27<>\"\",5,0)","v":0},{"$f":"BA27+BB27","v":0},null,null,{"$f":"IF(ISNUMBER(BE27),(VLOOKUP(BE27,$BO$6:$BP$50,2)),0)","v":0},{"$f":"IF(BE27<>\"\",5,0)","v":0},{"$f":"BF27+BG27","v":0},null,null,{"$f":"IF(ISNUMBER(BJ27),(VLOOKUP(BJ27,$BO$6:$BP$50,2)),0)","v":0},{"$f":"IF(BJ27<>\"\",5,0)","v":0},{"$f":"BK27+BL27","v":0},null,22,9,0,0,0,0,1,0,0,0]
[{"$f":"IF(E28<E27,BO28,A27)","v":23},"Helgerud","Christoffer Teistum","Ljan",{"$f":"IF(F28<=4,Q28,(Q28-SUM(SMALL(R28:Y28,{1;2;3;4}))))","v":73},{"$f":"(IF(AC28=5,1,0)+IF(AH28=5,1,0)+IF(AM28=5,1,0)+IF(AR28=5,1,0)+IF(AW28=5,1,0)+IF(BB28=5,1,0)+IF(BG28=5,1,0)+IF(BL28=5,1,0))","v":4},null,{"$f":"IF(AA28=\"\",\"\",AA28)","v":""},{"$f":"IF(AF28=\"\",\"\",AF28)","v":""},{"$f":"IF(AK28=\"\",\"\",AK28)","v":16},{"$f":"IF(AP28=\"\",\"\",AP28)","v":18},{"$f":"IF(AU28=\"\",\"\",AU28)","v":26},{"$f":"IF(AZ28=\"\",\"\",AZ28)","v":13},{"$f":"IF(BE28=\"\",\"\",BE28)","v":""},{"$f":"IF(BJ28=\"\",\"\",BJ28)","v":""},null,{"$f":"AD28+AI28+AN28+AS28+AX28+BC28+BH28","v":73},{"$f":"IF($F28>=5,IF(AB28=\"\",\"\",AB28),\"\")","v":""},{"$f":"IF($F28>=5,IF(AG28=\"\",\"\",AG28),\"\")","v":""},{"$f":"IF($F28>=5,IF(AL28=\"\",\"\",AL28),\"\")","v":""},{"$f":"IF($F28>=5,IF(AQ28=\"\",\"\",AQ28),\"\")","v":""},{"$f":"IF($F28>=5,IF(AV28=\"\",\"\",AV28),\"\")","v":""},{"$f":"IF($F28>=5,IF(BA28=\"\",\"\",BA28),\"\")","v":""},{"$f":"IF($F28>=5,IF(BF28=\"\",\"\",BF28),\"\")","v":""},{"$f":"IF($F28>=5,IF(BK28=\"\",\"\",BK28),\"\")","v":""},null,null,{"$f":"IF(ISNUMBER(AA28),(VLOOKUP(AA28,$BO$6:$BP$50,2)),0)","v":0},{"$f":"IF(AA28<>\"\",5,0)","v":0},{"$f":"AB28+AC28","v":0},null,null,{"$f":"IF(ISNUMBER(AF28),(VLOOKUP(AF28,$BO$6:$BP$50,2)),0)","v":0},{"$f":"IF(AF28<>\"\",5,0)","v":0},{"$f":"AG28+AH28","v":0},null,16,{"$f":"IF(ISNUMBER(AK28),(VLOOKUP(AK28,$BO$6:$BP$50,2)),0)","v":15},{"$f":"IF(AK28<>\"\",5,0)","v":5},{"$f":"AL28+AM28","v":20},null,18,{"$f":"IF(ISNUMBER(AP28),(VLOOKUP(AP28,$BO$6:$BP$50,2)),0)","v":13},{"$f":"IF(AP28<>\"\",5,0)","v":5},{"$f":"AQ28+AR28","v":18},null,26,{"$f":"IF(ISNUMBER(AU28),(VLOOKUP(AU28,$BO$6:$BP$50,2)),0)","v":5},{"$f":"IF(AU28<>\"\",5,0)","v":5},{"$f":"AV28+AW28","v":10},null,13,{"$f":"IF(ISNUMBER(AZ28),(VLOOKUP(AZ28,$BO$6:$BP$50,2)),0)","v":20},{"$f":"IF(AZ28<>\"\",5,0)","v":5},{"$f":"BA28+BB28","v":25},null,null,{"$f":"IF(ISNUMBER(BE28),(VLOOKUP(BE28,$BO$6:$BP$50,2)),0)","v":0},{"$f":"IF(BE28<>\"\",5,0)","v":0},{"$f":"BF28+BG28","v":0},null,null,{"$f":"IF(ISNUMBER(BJ28),(VLOOKUP(BJ28,$BO$6:$BP$50,2)),0)","v":0},{"$f":"IF(BJ28<>\"\",5,0)","v":0},{"$f":"BK28+BL28","v":0},null,23,8,0,{"$f":"IF($F23=7,1,0)","v":0},{"$f":"IF($F23=6,1,0)","v":0},{"$f":"IF($F23=5,1,0)","v":0},{"$f":"IF($F23=4,1,0)","v":1},{"$f":"IF($F23=3,1,0)","v":0},{"$f":"IF($F23=2,1,0)","v":0},{"$f":"IF($F23=1,1,0)","v":0}]
[{"$f":"IF(E29<E28,BO29,A28)","v":24},"Hunstad","Nicolai Christian","Heming",{"$f":"IF(F29<=4,Q29,(Q29-SUM(SMALL(R29:Y29,{1;2;3;4}))))","v":68},{"$f":"(IF(AC29=5,1,0)+IF(AH29=5,1,0)+IF(AM29=5,1,0)+IF(AR29=5,1,0)+IF(AW29=5,1,0)+IF(BB29=5,1,0)+IF(BG29=5,1,0)+IF(BL29=5,1,0))","v":3},null,{"$f":"IF(AA29=\"\",\"\",AA29)","v":""},{"$f":"IF(AF29=\"\",\"\",AF29)","v":""},{"$f":"IF(AK29=\"\",\"\",AK29)","v":15},{"$f":"IF(AP29=\"\",\"\",AP29)","v":""},{"$f":"IF(AU29=\"\",\"\",AU29)","v":18},{"$f":"IF(AZ29=\"\",\"\",AZ29)","v":""},{"$f":"IF(BE29=\"\",\"\",BE29)","v":11},{"$f":"IF(BJ29=\"\",\"\",BJ29)","v":""},null,{"$f":"AD29+AI29+AN29+AS29+AX29+BC29+BH29","v":68},{"$f":"IF($F29>=5,IF(AB29=\"\",\"\",AB29),\"\")","v":""},{"$f":"IF($F29>=5,IF(AG29=\"\",\"\",AG29),\"\")","v":""},{"$f":"IF($F29>=5,IF(AL29=\"\",\"\",AL29),\"\")","v":""},{"$f":"IF($F29>=5,IF(AQ29=\"\",\"\",AQ29),\"\")","v":""},{"$f":"IF($F29>=5,IF(AV29=\"\",\"\",AV29),\"\")","v":""},{"$f":"IF($F29>=5,IF(BA29=\"\",\"\",BA29),\"\")","v":""},{"$f":"IF($F29>=5,IF(BF29=\"\",\"\",BF29),\"\")","v":""},{"$f":"IF($F29>=5,IF(BK29=\"\",\"\",BK29),\"\")","v":""},null,null,{"$f":"IF(ISNUMBER(AA29),(VLOOKUP(AA29,$BO$6:$BP$50,2)),0)","v":0},{"$f":"IF(AA29<>\"\",5,0)","v":0},{"$f":"AB29+AC29","v":0},null,null,{"$f":"IF(ISNUMBER(AF29),(VLOOKUP(AF29,$BO$6:$BP$50,2)),0)","v":0},{"$f":"IF(AF29<>\"\",5,0)","v":0},{"$f":"AG29+AH29","v":0},null,15,{"$f":"IF(ISNUMBER(AK29),(VLOOKUP(AK29,$BO$6:$BP$50,2)),0)","v":16},{"$f":"IF(AK29<>\"\",5,0)","v":5},{"$f":"AL29+AM29","v":21},null,null,{"$f":"IF(ISNUMBER(AP29),(VLOOKUP(AP29,$BO$6:$BP$50,2)),0)","v":0},{"$f":"IF(AP29<>\"\",5,0)","v":0},{"$f":"AQ29+AR29","v":0},null,18,{"$f":"IF(ISNUMBER(AU29),(VLOOKUP(AU29,$BO$6:$BP$50,2)),0)","v":13},{"$f":"IF(AU29<>\"\",5,0)","v":5},{"$f":"AV29+AW29","v":18},null,null,{"$f":"IF(ISNUMBER(AZ29),(VLOOKUP(AZ29,$BO$6:$BP$50,2)),0)","v":0},{"$f":"IF(AZ29<>\"\",5,0)","v":0},{"$f":"BA29+BB29","v":0},null,11,{"$f":"IF(ISNUMBER(BE29),(VLOOKUP(BE29,$BO$6:$BP$50,2)),0)","v":24},{"$f":"IF(BE29<>\"\",5,0)","v":5},{"$f":"BF29+BG29","v":29},null,null,{"$f":"IF(ISNUMBER(BJ29),(VLOOKUP(BJ29,$BO$6:$BP$50,2)),0)","v":0},{"$f":"IF(BJ29<>\"\",5,0)","v":0},{"$f":"BK29+BL29","v":0},null,24,7,0,{"$f":"IF($F24=7,1,0)","v":0},{"$f":"IF($F24=6,1,0)","v":0},{"$f":"IF($F24=5,1,0)","v":0},{"$f":"IF($F24=4,1,0)","v":0},{"$f":"IF($F24=3,1,0)","v":0},{"$f":"IF($F24=2,1,0)","v":1},{"$f":"IF($F24=1,1,0)","v":0}]
[{"$f":"IF(E30<E29,BO30,A29)","v":25},"Daniels","Alfred Axelsen","Kjelsås",{"$f":"IF(F30<=4,Q30,(Q30-SUM(SMALL(R30:Y30,{1;2;3;4}))))","v":64},{"$f":"(IF(AC30=5,1,0)+IF(AH30=5,1,0)+IF(AM30=5,1,0)+IF(AR30=5,1,0)+IF(AW30=5,1,0)+IF(BB30=5,1,0)+IF(BG30=5,1,0)+IF(BL30=5,1,0))","v":4},null,{"$f":"IF(AA30=\"\",\"\",AA30)","v":""},{"$f":"IF(AF30=\"\",\"\",AF30)","v":""},{"$f":"IF(AK30=\"\",\"\",AK30)","v":21},{"$f":"IF(AP30=\"\",\"\",AP30)","v":""},{"$f":"IF(AU30=\"\",\"\",AU30)","v":25},{"$f":"IF(AZ30=\"\",\"\",AZ30)","v":18},{"$f":"IF(BE30=\"\",\"\",BE30)","v":16},{"$f":"IF(BJ30=\"\",\"\",BJ30)","v":""},null,{"$f":"AD30+AI30+AN30+AS30+AX30+BC30+BH30","v":64},{"$f":"IF($F30>=5,IF(AB30=\"\",\"\",AB30),\"\")","v":""},{"$f":"IF($F30>=5,IF(AG30=\"\",\"\",AG30),\"\")","v":""},{"$f":"IF($F30>=5,IF(AL30=\"\",\"\",AL30),\"\")","v":""},{"$f":"IF($F30>=5,IF(AQ30=\"\",\"\",AQ30),\"\")","v":""},{"$f":"IF($F30>=5,IF(AV30=\"\",\"\",AV30),\"\")","v":""},{"$f":"IF($F30>=5,IF(BA30=\"\",\"\",BA30),\"\")","v":""},{"$f":"IF($F30>=5,IF(BF30=\"\",\"\",BF30),\"\")","v":""},{"$f":"IF($F30>=5,IF(BK30=\"\",\"\",BK30),\"\")","v":""},null,null,{"$f":"IF(ISNUMBER(AA30),(VLOOKUP(AA30,$BO$6:$BP$50,2)),0)","v":0},{"$f":"IF(AA30<>\"\",5,0)","v":0},{"$f":"AB30+AC30","v":0},null,null,{"$f":"IF(ISNUMBER(AF30),(VLOOKUP(AF30,$BO$6:$BP$50,2)),0)","v":0},{"$f":"IF(AF30<>\"\",5,0)","v":0},{"$f":"AG30+AH30","v":0},null,21,{"$f":"IF(ISNUMBER(AK30),(VLOOKUP(AK30,$BO$6:$BP$50,2)),0)","v":10},{"$f":"IF(AK30<>\"\",5,0)","v":5},{"$f":"AL30+AM30","v":15},null,null,{"$f":"IF(ISNUMBER(AP30),(VLOOKUP(AP30,$BO$6:$BP$50,2)),0)","v":0},{"$f":"IF(AP30<>\"\",5,0)","v":0},{"$f":"AQ30+AR30","v":0},null,25,{"$f":"IF(ISNUMBER(AU30),(VLOOKUP(AU30,$BO$6:$BP$50,2)),0)","v":6},{"$f":"IF(AU30<>\"\",5,0)","v":5},{"$f":"AV30+AW30","v":11},null,18,{"$f":"IF(ISNUMBER(AZ30),(VLOOKUP(AZ30,$BO$6:$BP$50,2)),0)","v":13},{"$f":"IF(AZ30<>\"\",5,0)","v":5},{"$f":"BA30+BB30","v":18},null,16,{"$f":"IF(ISNUMBER(BE30),(VLOOKUP(BE30,$BO$6:$BP$50,2)),0)","v":15},{"$f":"IF(BE30<>\"\",5,0)","v":5},{"$f":"BF30+BG30","v":20},null,null,{"$f":"IF(ISNUMBER(BJ30),(VLOOKUP(BJ30,$BO$6:$BP$50,2)),0)","v":0},{"$f":"IF(BJ30<>\"\",5,0)","v":0},{"$f":"BK30+BL30","v":0},null,25,6,0,{"$f":"IF($F25=7,1,0)","v":0},{"$f":"IF($F25=6,1,0)","v":0},{"$f":"IF($F25=5,1,0)","v":0},{"$f":"IF($F25=4,1,0)","v":1},{"$f":"IF($F25=3,1,0)","v":0},{"$f":"IF($F25=2,1,0)","v":0},{"$f":"IF($F25=1,1,0)","v":0}]
[{"$f":"IF(E31<E30,BO31,A30)","v":26},"Malling","Michael de Vibe","Heming",{"$f":"IF(F31<=4,Q31,(Q31-SUM(SMALL(R31:Y31,{1;2;3;4}))))","v":57},{"$f":"(IF(AC31=5,1,0)+IF(AH31=5,1,0)+IF(AM31=5,1,0)+IF(AR31=5,1,0)+IF(AW31=5,1,0)+IF(BB31=5,1,0)+IF(BG31=5,1,0)+IF(BL31=5,1,0))","v":3},null,{"$f":"IF(AA31=\"\",\"\",AA31)","v":""},{"$f":"IF(AF31=\"\",\"\",AF31)","v":""},{"$f":"IF(AK31=\"\",\"\",AK31)","v":11},{"$f":"IF(AP31=\"\",\"\",AP31)","v":""},{"$f":"IF(AU31=\"\",\"\",AU31)","v":14},{"$f":"IF(AZ31=\"\",\"\",AZ31)","v":""},{"$f":"IF(BE31=\"\",\"\",BE31)","v":"dsq"},{"$f":"IF(BJ31=\"\",\"\",BJ31)","v":""},null,{"$f":"AD31+AI31+AN31+AS31+AX31+BC31+BH31","v":57},{"$f":"IF($F31>=5,IF(AB31=\"\",\"\",AB31),\"\")","v":""},{"$f":"IF($F31>=5,IF(AG31=\"\",\"\",AG31),\"\")","v":""},{"$f":"IF($F31>=5,IF(AL31=\"\",\"\",AL31),\"\")","v":""},{"$f":"IF($F31>=5,IF(AQ31=\"\",\"\",AQ31),\"\")","v":""},{"$f":"IF($F31>=5,IF(AV31=\"\",\"\",AV31),\"\")","v":""},{"$f":"IF($F31>=5,IF(BA31=\"\",\"\",BA31),\"\")","v":""},{"$f":"IF($F31>=5,IF(BF31=\"\",\"\",BF31),\"\")","v":""},{"$f":"IF($F31>=5,IF(BK31=\"\",\"\",BK31),\"\")","v":""},null,null,{"$f":"IF(ISNUMBER(AA31),(VLOOKUP(AA31,$BO$6:$BP$50,2)),0)","v":0},{"$f":"IF(AA31<>\"\",5,0)","v":0},{"$f":"AB31+AC31","v":0},null,null,{"$f":"IF(ISNUMBER(AF31),(VLOOKUP(AF31,$BO$6:$BP$50,2)),0)","v":0},{"$f":"IF(AF31<>\"\",5,0)","v":0},{"$f":"AG31+AH31","v":0},null,11,{"$f":"IF(ISNUMBER(AK31),(VLOOKUP(AK31,$BO$6:$BP$50,2)),0)","v":24},{"$f":"IF(AK31<>\"\",5,0)","v":5},{"$f":"AL31+AM31","v":29},null,null,{"$f":"IF(ISNUMBER(AP31),(VLOOKUP(AP31,$BO$6:$BP$50,2)),0)","v":0},{"$f":"IF(AP31<>\"\",5,0)","v":0},{"$f":"AQ31+AR31","v":0},null,14,{"$f":"IF(ISNUMBER(AU31),(VLOOKUP(AU31,$BO$6:$BP$50,2)),0)","v":18},{"$f":"IF(AU31<>\"\",5,0)","v":5},{"$f":"AV31+AW31","v":23},null,null,{"$f":"IF(ISNUMBER(AZ31),(VLOOKUP(AZ31,$BO$6:$BP$50,2)),0)","v":0},{"$f":"IF(AZ31<>\"\",5,0)","v":0},{"$f":"BA31+BB31","v":0},null,"dsq",{"$f":"IF(ISNUMBER(BE31),(VLOOKUP(BE31,$BO$6:$BP$50,2)),0)","v":0},{"$f":"IF(BE31<>\"\",5,0)","v":5},{"$f":"BF31+BG31","v":5},null,null,{"$f":"IF(ISNUMBER(BJ31),(VLOOKUP(BJ31,$BO$6:$BP$50,2)),0)","v":0},{"$f":"IF(BJ31<>\"\",5,0)","v":0},{"$f":"BK31+BL31","v":0},null,26,5,0,{"$f":"IF($F25=7,1,0)","v":0},{"$f":"IF($F25=6,1,0)","v":0},{"$f":"IF($F25=5,1,0)","v":0},{"$f":"IF($F25=4,1,0)","v":1},{"$f":"IF($F25=3,1,0)","v":0},{"$f":"IF($F25=2,1,0)","v":0},{"$f":"IF($F25=1,1,0)","v":0}]
[{"$f":"IF(E32<E31,BO32,A31)","v":27},"Trøan","Caspian","Heming",{"$f":"IF(F32<=4,Q32,(Q32-SUM(SMALL(R32:Y32,{1;2;3;4}))))","v":50},{"$f":"(IF(AC32=5,1,0)+IF(AH32=5,1,0)+IF(AM32=5,1,0)+IF(AR32=5,1,0)+IF(AW32=5,1,0)+IF(BB32=5,1,0)+IF(BG32=5,1,0)+IF(BL32=5,1,0))","v":1},null,{"$f":"IF(AA32=\"\",\"\",AA32)","v":""},{"$f":"IF(AF32=\"\",\"\",AF32)","v":""},{"$f":"IF(AK32=\"\",\"\",AK32)","v":""},{"$f":"IF(AP32=\"\",\"\",AP32)","v":""},{"$f":"IF(AU32=\"\",\"\",AU32)","v":5},{"$f":"IF(AZ32=\"\",\"\",AZ32)","v":""},{"$f":"IF(BE32=\"\",\"\",BE32)","v":""},{"$f":"IF(BJ32=\"\",\"\",BJ32)","v":""},null,{"$f":"AD32+AI32+AN32+AS32+AX32+BC32+BH32","v":50},{"$f":"IF($F32>=5,IF(AB32=\"\",\"\",AB32),\"\")","v":""},{"$f":"IF($F32>=5,IF(AG32=\"\",\"\",AG32),\"\")","v":""},{"$f":"IF($F32>=5,IF(AL32=\"\",\"\",AL32),\"\")","v":""},{"$f":"IF($F32>=5,IF(AQ32=\"\",\"\",AQ32),\"\")","v":""},{"$f":"IF($F32>=5,IF(AV32=\"\",\"\",AV32),\"\")","v":""},{"$f":"IF($F32>=5,IF(BA32=\"\",\"\",BA32),\"\")","v":""},{"$f":"IF($F32>=5,IF(BF32=\"\",\"\",BF32),\"\")","v":""},{"$f":"IF($F32>=5,IF(BK32=\"\",\"\",BK32),\"\")","v":""},null,null,{"$f":"IF(ISNUMBER(AA32),(VLOOKUP(AA32,$BO$6:$BP$50,2)),0)","v":0},{"$f":"IF(AA32<>\"\",5,0)","v":0},{"$f":"AB32+AC32","v":0},null,null,{"$f":"IF(ISNUMBER(AF32),(VLOOKUP(AF32,$BO$6:$BP$50,2)),0)","v":0},{"$f":"IF(AF32<>\"\",5,0)","v":0},{"$f":"AG32+AH32","v":0},null,null,{"$f":"IF(ISNUMBER(AK32),(VLOOKUP(AK32,$BO$6:$BP$50,2)),0)","v":0},{"$f":"IF(AK32<>\"\",5,0)","v":0},{"$f":"AL32+AM32","v":0},null,null,{"$f":"IF(ISNUMBER(AP32),(VLOOKUP(AP32,$BO$6:$BP$50,2)),0)","v":0},{"$f":"IF(AP32<>\"\",5,0)","v":0},{"$f":"AQ32+AR32","v":0},null,5,{"$f":"IF(ISNUMBER(AU32),(VLOOKUP(AU32,$BO$6:$BP$50,2)),0)","v":45},{"$f":"IF(AU32<>\"\",5,0)","v":5},{"$f":"AV32+AW32","v":50},null,null,{"$f":"IF(ISNUMBER(AZ32),(VLOOKUP(AZ32,$BO$6:$BP$50,2)),0)","v":0},{"$f":"IF(AZ32<>\"\",5,0)","v":0},{"$f":"BA32+BB32","v":0},null,null,{"$f":"IF(ISNUMBER(BE32),(VLOOKUP(BE32,$BO$6:$BP$50,2)),0)","v":0},{"$f":"IF(BE32<>\"\",5,0)","v":0},{"$f":"BF32+BG32","v":0},null,null,{"$f":"IF(ISNUMBER(BJ32),(VLOOKUP(BJ32,$BO$6:$BP$50,2)),0)","v":0},{"$f":"IF(BJ32<>\"\",5,0)","v":0},{"$f":"BK32+BL32","v":0},null,27,4,0,{"$f":"IF($F26=7,1,0)","v":0},{"$f":"IF($F26=6,1,0)","v":0},{"$f":"IF($F26=5,1,0)","v":0},{"$f":"IF($F26=4,1,0)","v":1},{"$f":"IF($F26=3,1,0)","v":0},{"$f":"IF($F26=2,1,0)","v":0},{"$f":"IF($F26=1,1,0)","v":0}]
[{"$f":"IF(E33<E32,BO33,A32)","v":28},"Flaaten","Carl Sebastian","Heming",{"$f":"IF(F33<=4,Q33,(Q33-SUM(SMALL(R33:Y33,{1;2;3;4}))))","v":46},{"$f":"(IF(AC33=5,1,0)+IF(AH33=5,1,0)+IF(AM33=5,1,0)+IF(AR33=5,1,0)+IF(AW33=5,1,0)+IF(BB33=5,1,0)+IF(BG33=5,1,0)+IF(BL33=5,1,0))","v":2},null,{"$f":"IF(AA33=\"\",\"\",AA33)","v":""},{"$f":"IF(AF33=\"\",\"\",AF33)","v":""},{"$f":"IF(AK33=\"\",\"\",AK33)","v":""},{"$f":"IF(AP33=\"\",\"\",AP33)","v":""},{"$f":"IF(AU33=\"\",\"\",AU33)","v":17},{"$f":"IF(AZ33=\"\",\"\",AZ33)","v":12},{"$f":"IF(BE33=\"\",\"\",BE33)","v":""},{"$f":"IF(BJ33=\"\",\"\",BJ33)","v":""},null,{"$f":"AD33+AI33+AN33+AS33+AX33+BC33+BH33","v":46},{"$f":"IF($F33>=5,IF(AB33=\"\",\"\",AB33),\"\")","v":""},{"$f":"IF($F33>=5,IF(AG33=\"\",\"\",AG33),\"\")","v":""},{"$f":"IF($F33>=5,IF(AL33=\"\",\"\",AL33),\"\")","v":""},{"$f":"IF($F33>=5,IF(AQ33=\"\",\"\",AQ33),\"\")","v":""},{"$f":"IF($F33>=5,IF(AV33=\"\",\"\",AV33),\"\")","v":""},{"$f":"IF($F33>=5,IF(BA33=\"\",\"\",BA33),\"\")","v":""},{"$f":"IF($F33>=5,IF(BF33=\"\",\"\",BF33),\"\")","v":""},{"$f":"IF($F33>=5,IF(BK33=\"\",\"\",BK33),\"\")","v":""},null,null,{"$f":"IF(ISNUMBER(AA33),(VLOOKUP(AA33,$BO$6:$BP$50,2)),0)","v":0},{"$f":"IF(AA33<>\"\",5,0)","v":0},{"$f":"AB33+AC33","v":0},null,null,{"$f":"IF(ISNUMBER(AF33),(VLOOKUP(AF33,$BO$6:$BP$50,2)),0)","v":0},{"$f":"IF(AF33<>\"\",5,0)","v":0},{"$f":"AG33+AH33","v":0},null,null,{"$f":"IF(ISNUMBER(AK33),(VLOOKUP(AK33,$BO$6:$BP$50,2)),0)","v":0},{"$f":"IF(AK33<>\"\",5,0)","v":0},{"$f":"AL33+AM33","v":0},null,null,{"$f":"IF(ISNUMBER(AP33),(VLOOKUP(AP33,$BO$6:$BP$50,2)),0)","v":0},{"$f":"IF(AP33<>\"\",5,0)","v":0},{"$f":"AQ33+AR33","v":0},null,17,{"$f":"IF(ISNUMBER(AU33),(VLOOKUP(AU33,$BO$6:$BP$50,2)),0)","v":14},{"$f":"IF(AU33<>\"\",5,0)","v":5},{"$f":"AV33+AW33","v":19},null,12,{"$f":"IF(ISNUMBER(AZ33),(VLOOKUP(AZ33,$BO$6:$BP$50,2)),0)","v":22},{"$f":"IF(AZ33<>\"\",5,0)","v":5},{"$f":"BA33+BB33","v":27},null,null,{"$f":"IF(ISNUMBER(BE33),(VLOOKUP(BE33,$BO$6:$BP$50,2)),0)","v":0},{"$f":"IF(BE33<>\"\",5,0)","v":0},{"$f":"BF33+BG33","v":0},null,null,{"$f":"IF(ISNUMBER(BJ33),(VLOOKUP(BJ33,$BO$6:$BP$50,2)),0)","v":0},{"$f":"IF(BJ33<>\"\",5,0)","v":0},{"$f":"BK33+BL33","v":0},null,28,3,0,0,0,0,0,1,0,0]
[{"$f":"IF(E34<E33,BO34,A33)","v":29},"Gudem","Matheo","IRS",{"$f":"IF(F34<=4,Q34,(Q34-SUM(SMALL(R34:Y34,{1;2;3;4}))))","v":45},{"$f":"(IF(AC34=5,1,0)+IF(AH34=5,1,0)+IF(AM34=5,1,0)+IF(AR34=5,1,0)+IF(AW34=5,1,0)+IF(BB34=5,1,0)+IF(BG34=5,1,0)+IF(BL34=5,1,0))","v":1},null,{"$f":"IF(AA34=\"\",\"\",AA34)","v":6},{"$f":"IF(AF34=\"\",\"\",AF34)","v":""},{"$f":"IF(AK34=\"\",\"\",AK34)","v":""},{"$f":"IF(AP34=\"\",\"\",AP34)","v":""},{"$f":"IF(AU34=\"\",\"\",AU34)","v":""},{"$f":"IF(AZ34=\"\",\"\",AZ34)","v":""},{"$f":"IF(BE34=\"\",\"\",BE34)","v":""},{"$f":"IF(BJ34=\"\",\"\",BJ34)","v":""},null,{"$f":"AD34+AI34+AN34+AS34+AX34+BC34+BH34","v":45},{"$f":"IF($F34>=5,IF(AB34=\"\",\"\",AB34),\"\")","v":""},{"$f":"IF($F34>=5,IF(AG34=\"\",\"\",AG34),\"\")","v":""},{"$f":"IF($F34>=5,IF(AL34=\"\",\"\",AL34),\"\")","v":""},{"$f":"IF($F34>=5,IF(AQ34=\"\",\"\",AQ34),\"\")","v":""},{"$f":"IF($F34>=5,IF(AV34=\"\",\"\",AV34),\"\")","v":""},{"$f":"IF($F34>=5,IF(BA34=\"\",\"\",BA34),\"\")","v":""},{"$f":"IF($F34>=5,IF(BF34=\"\",\"\",BF34),\"\")","v":""},{"$f":"IF($F34>=5,IF(BK34=\"\",\"\",BK34),\"\")","v":""},null,6,{"$f":"IF(ISNUMBER(AA34),(VLOOKUP(AA34,$BO$6:$BP$50,2)),0)","v":40},{"$f":"IF(AA34<>\"\",5,0)","v":5},{"$f":"AB34+AC34","v":45},null,null,{"$f":"IF(ISNUMBER(AF34),(VLOOKUP(AF34,$BO$6:$BP$50,2)),0)","v":0},{"$f":"IF(AF34<>\"\",5,0)","v":0},{"$f":"AG34+AH34","v":0},null,null,{"$f":"IF(ISNUMBER(AK34),(VLOOKUP(AK34,$BO$6:$BP$50,2)),0)","v":0},{"$f":"IF(AK34<>\"\",5,0)","v":0},{"$f":"AL34+AM34","v":0},null,null,{"$f":"IF(ISNUMBER(AP34),(VLOOKUP(AP34,$BO$6:$BP$50,2)),0)","v":0},{"$f":"IF(AP34<>\"\",5,0)","v":0},{"$f":"AQ34+AR34","v":0},null,null,{"$f":"IF(ISNUMBER(AU34),(VLOOKUP(AU34,$BO$6:$BP$50,2)),0)","v":0},{"$f":"IF(AU34<>\"\",5,0)","v":0},{"$f":"AV34+AW34","v":0},null,null,{"$f":"IF(ISNUMBER(AZ34),(VLOOKUP(AZ34,$BO$6:$BP$50,2)),0)","v":0},{"$f":"IF(AZ34<>\"\",5,0)","v":0},{"$f":"BA34+BB34","v":0},null,null,{"$f":"IF(ISNUMBER(BE34),(VLOOKUP(BE34,$BO$6:$BP$50,2)),0)","v":0},{"$f":"IF(BE34<>\"\",5,0)","v":0},{"$f":"BF34+BG34","v":0},null,null,{"$f":"IF(ISNUMBER(BJ34),(VLOOKUP(BJ34,$BO$6:$BP$50,2)),0)","v":0},{"$f":"IF(BJ34<>\"\",5,0)","v":0},{"$f":"BK34+BL34","v":0},null,29,2,0,0,0,0,1,0,0,0]
[{"$f":"IF(E35<E34,BO35,A34)","v":30},"Bøhmer","Knut Fredrik","Heming",{"$f":"IF(F35<=4,Q35,(Q35-SUM(SMALL(R35:Y35,{1;2;3;4}))))","v":42},{"$f":"(IF(AC35=5,1,0)+IF(AH35=5,1,0)+IF(AM35=5,1,0)+IF(AR35=5,1,0)+IF(AW35=5,1,0)+IF(BB35=5,1,0)+IF(BG35=5,1,0)+IF(BL35=5,1,0))","v":2},null,{"$f":"IF(AA35=\"\",\"\",AA35)","v":""},{"$f":"IF(AF35=\"\",\"\",AF35)","v":""},{"$f":"IF(AK35=\"\",\"\",AK35)","v":""},{"$f":"IF(AP35=\"\",\"\",AP35)","v":"dnf"},{"$f":"IF(AU35=\"\",\"\",AU35)","v":""},{"$f":"IF(AZ35=\"\",\"\",AZ35)","v":""},{"$f":"IF(BE35=\"\",\"\",BE35)","v":8},{"$f":"IF(BJ35=\"\",\"\",BJ35)","v":""},null,{"$f":"AD35+AI35+AN35+AS35+AX35+BC35+BH35","v":42},{"$f":"IF($F35>=5,IF(AB35=\"\",\"\",AB35),\"\")","v":""},{"$f":"IF($F35>=5,IF(AG35=\"\",\"\",AG35),\"\")","v":""},{"$f":"IF($F35>=5,IF(AL35=\"\",\"\",AL35),\"\")","v":""},{"$f":"IF($F35>=5,IF(AQ35=\"\",\"\",AQ35),\"\")","v":""},{"$f":"IF($F35>=5,IF(AV35=\"\",\"\",AV35),\"\")","v":""},{"$f":"IF($F35>=5,IF(BA35=\"\",\"\",BA35),\"\")","v":""},{"$f":"IF($F35>=5,IF(BF35=\"\",\"\",BF35),\"\")","v":""},{"$f":"IF($F35>=5,IF(BK35=\"\",\"\",BK35),\"\")","v":""},null,null,{"$f":"IF(ISNUMBER(AA35),(VLOOKUP(AA35,$BO$6:$BP$50,2)),0)","v":0},{"$f":"IF(AA35<>\"\",5,0)","v":0},{"$f":"AB35+AC35","v":0},null,null,{"$f":"IF(ISNUMBER(AF35),(VLOOKUP(AF35,$BO$6:$BP$50,2)),0)","v":0},{"$f":"IF(AF35<>\"\",5,0)","v":0},{"$f":"AG35+AH35","v":0},null,null,{"$f":"IF(ISNUMBER(AK35),(VLOOKUP(AK35,$BO$6:$BP$50,2)),0)","v":0},{"$f":"IF(AK35<>\"\",5,0)","v":0},{"$f":"AL35+AM35","v":0},null,"dnf",{"$f":"IF(ISNUMBER(AP35),(VLOOKUP(AP35,$BO$6:$BP$50,2)),0)","v":0},{"$f":"IF(AP35<>\"\",5,0)","v":5},{"$f":"AQ35+AR35","v":5},null,null,{"$f":"IF(ISNUMBER(AU35),(VLOOKUP(AU35,$BO$6:$BP$50,2)),0)","v":0},{"$f":"IF(AU35<>\"\",5,0)","v":0},{"$f":"AV35+AW35","v":0},null,null,{"$f":"IF(ISNUMBER(AZ35),(VLOOKUP(AZ35,$BO$6:$BP$50,2)),0)","v":0},{"$f":"IF(AZ35<>\"\",5,0)","v":0},{"$f":"BA35+BB35","v":0},null,8,{"$f":"IF(ISNUMBER(BE35),(VLOOKUP(BE35,$BO$6:$BP$50,2)),0)","v":32},{"$f":"IF(BE35<>\"\",5,0)","v":5},{"$f":"BF35+BG35","v":37},null,null,{"$f":"IF(ISNUMBER(BJ35),(VLOOKUP(BJ35,$BO$6:$BP$50,2)),0)","v":0},{"$f":"IF(BJ35<>\"\",5,0)","v":0},{"$f":"BK35+BL35","v":0},null,30,1,0,{"$f":"IF($F26=7,1,0)","v":0},{"$f":"IF($F26=6,1,0)","v":0},{"$f":"IF($F26=5,1,0)","v":0},{"$f":"IF($F26=4,1,0)","v":1},{"$f":"IF($F26=3,1,0)","v":0},{"$f":"IF($F26=2,1,0)","v":0},{"$f":"IF($F26=1,1,0)","v":0}]
[{"$f":"IF(E36<E35,BO36,A35)","v":31},"Krohn-Oppi","Kristian","Kjelsås",{"$f":"IF(F36<=4,Q36,(Q36-SUM(SMALL(R36:Y36,{1;2;3;4}))))","v":41},{"$f":"(IF(AC36=5,1,0)+IF(AH36=5,1,0)+IF(AM36=5,1,0)+IF(AR36=5,1,0)+IF(AW36=5,1,0)+IF(BB36=5,1,0)+IF(BG36=5,1,0)+IF(BL36=5,1,0))","v":3},null,{"$f":"IF(AA36=\"\",\"\",AA36)","v":""},{"$f":"IF(AF36=\"\",\"\",AF36)","v":""},{"$f":"IF(AK36=\"\",\"\",AK36)","v":""},{"$f":"IF(AP36=\"\",\"\",AP36)","v":16},{"$f":"IF(AU36=\"\",\"\",AU36)","v":20},{"$f":"IF(AZ36=\"\",\"\",AZ36)","v":""},{"$f":"IF(BE36=\"\",\"\",BE36)","v":"dsq"},{"$f":"IF(BJ36=\"\",\"\",BJ36)","v":""},null,{"$f":"AD36+AI36+AN36+AS36+AX36+BC36+BH36","v":41},{"$f":"IF($F36>=5,IF(AB36=\"\",\"\",AB36),\"\")","v":""},{"$f":"IF($F36>=5,IF(AG36=\"\",\"\",AG36),\"\")","v":""},{"$f":"IF($F36>=5,IF(AL36=\"\",\"\",AL36),\"\")","v":""},{"$f":"IF($F36>=5,IF(AQ36=\"\",\"\",AQ36),\"\")","v":""},{"$f":"IF($F36>=5,IF(AV36=\"\",\"\",AV36),\"\")","v":""},{"$f":"IF($F36>=5,IF(BA36=\"\",\"\",BA36),\"\")","v":""},{"$f":"IF($F36>=5,IF(BF36=\"\",\"\",BF36),\"\")","v":""},{"$f":"IF($F36>=5,IF(BK36=\"\",\"\",BK36),\"\")","v":""},null,null,{"$f":"IF(ISNUMBER(AA36),(VLOOKUP(AA36,$BO$6:$BP$50,2)),0)","v":0},{"$f":"IF(AA36<>\"\",5,0)","v":0},{"$f":"AB36+AC36","v":0},null,null,{"$f":"IF(ISNUMBER(AF36),(VLOOKUP(AF36,$BO$6:$BP$50,2)),0)","v":0},{"$f":"IF(AF36<>\"\",5,0)","v":0},{"$f":"AG36+AH36","v":0},null,null,{"$f":"IF(ISNUMBER(AK36),(VLOOKUP(AK36,$BO$6:$BP$50,2)),0)","v":0},{"$f":"IF(AK36<>\"\",5,0)","v":0},{"$f":"AL36+AM36","v":0},null,16,{"$f":"IF(ISNUMBER(AP36),(VLOOKUP(AP36,$BO$6:$BP$50,2)),0)","v":15},{"$f":"IF(AP36<>\"\",5,0)","v":5},{"$f":"AQ36+AR36","v":20},null,20,{"$f":"IF(ISNUMBER(AU36),(VLOOKUP(AU36,$BO$6:$BP$50,2)),0)","v":11},{"$f":"IF(AU36<>\"\",5,0)","v":5},{"$f":"AV36+AW36","v":16},null,null,{"$f":"IF(ISNUMBER(AZ36),(VLOOKUP(AZ36,$BO$6:$BP$50,2)),0)","v":0},{"$f":"IF(AZ36<>\"\",5,0)","v":0},{"$f":"BA36+BB36","v":0},null,"dsq",{"$f":"IF(ISNUMBER(BE36),(VLOOKUP(BE36,$BO$6:$BP$50,2)),0)","v":0},{"$f":"IF(BE36<>\"\",5,0)","v":5},{"$f":"BF36+BG36","v":5},null,null,{"$f":"IF(ISNUMBER(BJ36),(VLOOKUP(BJ36,$BO$6:$BP$50,2)),0)","v":0},{"$f":"IF(BJ36<>\"\",5,0)","v":0},{"$f":"BK36+BL36","v":0},null,31,0,0,0,0,0,0,1,0,0]
[{"$f":"IF(E37<E36,BO37,A36)","v":32},"Vigstad-Pedersen","Eirik","HSIL",{"$f":"IF(F37<=4,Q37,(Q37-SUM(SMALL(R37:Y37,{1;2;3;4}))))","v":40},{"$f":"(IF(AC37=5,1,0)+IF(AH37=5,1,0)+IF(AM37=5,1,0)+IF(AR37=5,1,0)+IF(AW37=5,1,0)+IF(BB37=5,1,0)+IF(BG37=5,1,0)+IF(BL37=5,1,0))","v":2},null,{"$f":"IF(AA37=\"\",\"\",AA37)","v":""},{"$f":"IF(AF37=\"\",\"\",AF37)","v":""},{"$f":"IF(AK37=\"\",\"\",AK37)","v":""},{"$f":"IF(AP37=\"\",\"\",AP37)","v":""},{"$f":"IF(AU37=\"\",\"\",AU37)","v":""},{"$f":"IF(AZ37=\"\",\"\",AZ37)","v":17},{"$f":"IF(BE37=\"\",\"\",BE37)","v":15},{"$f":"IF(BJ37=\"\",\"\",BJ37)","v":""},null,{"$f":"AD37+AI37+AN37+AS37+AX37+BC37+BH37","v":40},{"$f":"IF($F37>=5,IF(AB37=\"\",\"\",AB37),\"\")","v":""},{"$f":"IF($F37>=5,IF(AG37=\"\",\"\",AG37),\"\")","v":""},{"$f":"IF($F37>=5,IF(AL37=\"\",\"\",AL37),\"\")","v":""},{"$f":"IF($F37>=5,IF(AQ37=\"\",\"\",AQ37),\"\")","v":""},{"$f":"IF($F37>=5,IF(AV37=\"\",\"\",AV37),\"\")","v":""},{"$f":"IF($F37>=5,IF(BA37=\"\",\"\",BA37),\"\")","v":""},{"$f":"IF($F37>=5,IF(BF37=\"\",\"\",BF37),\"\")","v":""},{"$f":"IF($F37>=5,IF(BK37=\"\",\"\",BK37),\"\")","v":""},null,null,{"$f":"IF(ISNUMBER(AA37),(VLOOKUP(AA37,$BO$6:$BP$50,2)),0)","v":0},{"$f":"IF(AA37<>\"\",5,0)","v":0},{"$f":"AB37+AC37","v":0},null,null,{"$f":"IF(ISNUMBER(AF37),(VLOOKUP(AF37,$BO$6:$BP$50,2)),0)","v":0},{"$f":"IF(AF37<>\"\",5,0)","v":0},{"$f":"AG37+AH37","v":0},null,null,{"$f":"IF(ISNUMBER(AK37),(VLOOKUP(AK37,$BO$6:$BP$50,2)),0)","v":0},{"$f":"IF(AK37<>\"\",5,0)","v":0},{"$f":"AL37+AM37","v":0},null,null,{"$f":"IF(ISNUMBER(AP37),(VLOOKUP(AP37,$BO$6:$BP$50,2)),0)","v":0},{"$f":"IF(AP37<>\"\",5,0)","v":0},{"$f":"AQ37+AR37","v":0},null,null,{"$f":"IF(ISNUMBER(AU37),(VLOOKUP(AU37,$BO$6:$BP$50,2)),0)","v":0},{"$f":"IF(AU37<>\"\",5,0)","v":0},{"$f":"AV37+AW37","v":0},null,17,{"$f":"IF(ISNUMBER(AZ37),(VLOOKUP(AZ37,$BO$6:$BP$50,2)),0)","v":14},{"$f":"IF(AZ37<>\"\",5,0)","v":5},{"$f":"BA37+BB37","v":19},null,15,{"$f":"IF(ISNUMBER(BE37),(VLOOKUP(BE37,$BO$6:$BP$50,2)),0)","v":16},{"$f":"IF(BE37<>\"\",5,0)","v":5},{"$f":"BF37+BG37","v":21},null,null,{"$f":"IF(ISNUMBER(BJ37),(VLOOKUP(BJ37,$BO$6:$BP$50,2)),0)","v":0},{"$f":"IF(BJ37<>\"\",5,0)","v":0},{"$f":"BK37+BL37","v":0},null,32,0,0,0,0,0,1,0,0,0]
[{"$f":"IF(E38<E37,BO38,A37)","v":33},"Furuholmen","Henrik Sæthre","Heming",{"$f":"IF(F38<=4,Q38,(Q38-SUM(SMALL(R38:Y38,{1;2;3;4}))))","v":39},{"$f":"(IF(AC38=5,1,0)+IF(AH38=5,1,0)+IF(AM38=5,1,0)+IF(AR38=5,1,0)+IF(AW38=5,1,0)+IF(BB38=5,1,0)+IF(BG38=5,1,0)+IF(BL38=5,1,0))","v":2},null,{"$f":"IF(AA38=\"\",\"\",AA38)","v":""},{"$f":"IF(AF38=\"\",\"\",AF38)","v":""},{"$f":"IF(AK38=\"\",\"\",AK38)","v":""},{"$f":"IF(AP38=\"\",\"\",AP38)","v":17},{"$f":"IF(AU38=\"\",\"\",AU38)","v":""},{"$f":"IF(AZ38=\"\",\"\",AZ38)","v":16},{"$f":"IF(BE38=\"\",\"\",BE38)","v":""},{"$f":"IF(BJ38=\"\",\"\",BJ38)","v":""},null,{"$f":"AD38+AI38+AN38+AS38+AX38+BC38+BH38","v":39},{"$f":"IF($F38>=5,IF(AB38=\"\",\"\",AB38),\"\")","v":""},{"$f":"IF($F38>=5,IF(AG38=\"\",\"\",AG38),\"\")","v":""},{"$f":"IF($F38>=5,IF(AL38=\"\",\"\",AL38),\"\")","v":""},{"$f":"IF($F38>=5,IF(AQ38=\"\",\"\",AQ38),\"\")","v":""},{"$f":"IF($F38>=5,IF(AV38=\"\",\"\",AV38),\"\")","v":""},{"$f":"IF($F38>=5,IF(BA38=\"\",\"\",BA38),\"\")","v":""},{"$f":"IF($F38>=5,IF(BF38=\"\",\"\",BF38),\"\")","v":""},{"$f":"IF($F38>=5,IF(BK38=\"\",\"\",BK38),\"\")","v":""},null,null,{"$f":"IF(ISNUMBER(AA38),(VLOOKUP(AA38,$BO$6:$BP$50,2)),0)","v":0},{"$f":"IF(AA38<>\"\",5,0)","v":0},{"$f":"AB38+AC38","v":0},null,null,{"$f":"IF(ISNUMBER(AF38),(VLOOKUP(AF38,$BO$6:$BP$50,2)),0)","v":0},{"$f":"IF(AF38<>\"\",5,0)","v":0},{"$f":"AG38+AH38","v":0},null,null,{"$f":"IF(ISNUMBER(AK38),(VLOOKUP(AK38,$BO$6:$BP$50,2)),0)","v":0},{"$f":"IF(AK38<>\"\",5,0)","v":0},{"$f":"AL38+AM38","v":0},null,17,{"$f":"IF(ISNUMBER(AP38),(VLOOKUP(AP38,$BO$6:$BP$50,2)),0)","v":14},{"$f":"IF(AP38<>\"\",5,0)","v":5},{"$f":"AQ38+AR38","v":19},null,null,{"$f":"IF(ISNUMBER(AU38),(VLOOKUP(AU38,$BO$6:$BP$50,2)),0)","v":0},{"$f":"IF(AU38<>\"\",5,0)","v":0},{"$f":"AV38+AW38","v":0},null,16,{"$f":"IF(ISNUMBER(AZ38),(VLOOKUP(AZ38,$BO$6:$BP$50,2)),0)","v":15},{"$f":"IF(AZ38<>\"\",5,0)","v":5},{"$f":"BA38+BB38","v":20},null,null,{"$f":"IF(ISNUMBER(BE38),(VLOOKUP(BE38,$BO$6:$BP$50,2)),0)","v":0},{"$f":"IF(BE38<>\"\",5,0)","v":0},{"$f":"BF38+BG38","v":0},null,null,{"$f":"IF(ISNUMBER(BJ38),(VLOOKUP(BJ38,$BO$6:$BP$50,2)),0)","v":0},{"$f":"IF(BJ38<>\"\",5,0)","v":0},{"$f":"BK38+BL38","v":0},null,33,0,0,0,0,0,0,1,0,0]
[{"$f":"IF(E39<E38,BO39,A38)","v":34},"Meinich-Bakke","Sindre","Rælingen",{"$f":"IF(F39<=4,Q39,(Q39-SUM(SMALL(R39:Y39,{1;2;3;4}))))","v":34},{"$f":"(IF(AC39=5,1,0)+IF(AH39=5,1,0)+IF(AM39=5,1,0)+IF(AR39=5,1,0)+IF(AW39=5,1,0)+IF(BB39=5,1,0)+IF(BG39=5,1,0)+IF(BL39=5,1,0))","v":1},null,{"$f":"IF(AA39=\"\",\"\",AA39)","v":""},{"$f":"IF(AF39=\"\",\"\",AF39)","v":""},{"$f":"IF(AK39=\"\",\"\",AK39)","v":""},{"$f":"IF(AP39=\"\",\"\",AP39)","v":""},{"$f":"IF(AU39=\"\",\"\",AU39)","v":""},{"$f":"IF(AZ39=\"\",\"\",AZ39)","v":9},{"$f":"IF(BE39=\"\",\"\",BE39)","v":""},{"$f":"IF(BJ39=\"\",\"\",BJ39)","v":""},null,{"$f":"AD39+AI39+AN39+AS39+AX39+BC39+BH39","v":34},{"$f":"IF($F39>=5,IF(AB39=\"\",\"\",AB39),\"\")","v":""},{"$f":"IF($F39>=5,IF(AG39=\"\",\"\",AG39),\"\")","v":""},{"$f":"IF($F39>=5,IF(AL39=\"\",\"\",AL39),\"\")","v":""},{"$f":"IF($F39>=5,IF(AQ39=\"\",\"\",AQ39),\"\")","v":""},{"$f":"IF($F39>=5,IF(AV39=\"\",\"\",AV39),\"\")","v":""},{"$f":"IF($F39>=5,IF(BA39=\"\",\"\",BA39),\"\")","v":""},{"$f":"IF($F39>=5,IF(BF39=\"\",\"\",BF39),\"\")","v":""},{"$f":"IF($F39>=5,IF(BK39=\"\",\"\",BK39),\"\")","v":""},null,null,{"$f":"IF(ISNUMBER(AA39),(VLOOKUP(AA39,$BO$6:$BP$50,2)),0)","v":0},{"$f":"IF(AA39<>\"\",5,0)","v":0},{"$f":"AB39+AC39","v":0},null,null,{"$f":"IF(ISNUMBER(AF39),(VLOOKUP(AF39,$BO$6:$BP$50,2)),0)","v":0},{"$f":"IF(AF39<>\"\",5,0)","v":0},{"$f":"AG39+AH39","v":0},null,null,{"$f":"IF(ISNUMBER(AK39),(VLOOKUP(AK39,$BO$6:$BP$50,2)),0)","v":0},{"$f":"IF(AK39<>\"\",5,0)","v":0},{"$f":"AL39+AM39","v":0},null,null,{"$f":"IF(ISNUMBER(AP39),(VLOOKUP(AP39,$BO$6:$BP$50,2)),0)","v":0},{"$f":"IF(AP39<>\"\",5,0)","v":0},{"$f":"AQ39+AR39","v":0},null,null,{"$f":"IF(ISNUMBER(AU39),(VLOOKUP(AU39,$BO$6:$BP$50,2)),0)","v":0},{"$f":"IF(AU39<>\"\",5,0)","v":0},{"$f":"AV39+AW39","v":0},null,9,{"$f":"IF(ISNUMBER(AZ39),(VLOOKUP(AZ39,$BO$6:$BP$50,2)),0)","v":29},{"$f":"IF(AZ39<>\"\",5,0)","v":5},{"$f":"BA39+BB39","v":34},null,null,{"$f":"IF(ISNUMBER(BE39),(VLOOKUP(BE39,$BO$6:$BP$50,2)),0)","v":0},{"$f":"IF(BE39<>\"\",5,0)","v":0},{"$f":"BF39+BG39","v":0},null,null,{"$f":"IF(ISNUMBER(BJ39),(VLOOKUP(BJ39,$BO$6:$BP$50,2)),0)","v":0},{"$f":"IF(BJ39<>\"\",5,0)","v":0},{"$f":"BK39+BL39","v":0},null,34,0,0,0,0,0,1,0,0,0]
[{"$f":"IF(E40<E39,BO40,A39)","v":34},"Christiansen","Victor","IRS",{"$f":"IF(F40<=4,Q40,(Q40-SUM(SMALL(R40:Y40,{1;2;3;4}))))","v":34},{"$f":"(IF(AC40=5,1,0)+IF(AH40=5,1,0)+IF(AM40=5,1,0)+IF(AR40=5,1,0)+IF(AW40=5,1,0)+IF(BB40=5,1,0)+IF(BG40=5,1,0)+IF(BL40=5,1,0))","v":2},null,{"$f":"IF(AA40=\"\",\"\",AA40)","v":11},{"$f":"IF(AF40=\"\",\"\",AF40)","v":""},{"$f":"IF(AK40=\"\",\"\",AK40)","v":""},{"$f":"IF(AP40=\"\",\"\",AP40)","v":""},{"$f":"IF(AU40=\"\",\"\",AU40)","v":""},{"$f":"IF(AZ40=\"\",\"\",AZ40)","v":""},{"$f":"IF(BE40=\"\",\"\",BE40)","v":"dsq"},{"$f":"IF(BJ40=\"\",\"\",BJ40)","v":""},null,{"$f":"AD40+AI40+AN40+AS40+AX40+BC40+BH40","v":34},{"$f":"IF($F40>=5,IF(AB40=\"\",\"\",AB40),\"\")","v":""},{"$f":"IF($F40>=5,IF(AG40=\"\",\"\",AG40),\"\")","v":""},{"$f":"IF($F40>=5,IF(AL40=\"\",\"\",AL40),\"\")","v":""},{"$f":"IF($F40>=5,IF(AQ40=\"\",\"\",AQ40),\"\")","v":""},{"$f":"IF($F40>=5,IF(AV40=\"\",\"\",AV40),\"\")","v":""},{"$f":"IF($F40>=5,IF(BA40=\"\",\"\",BA40),\"\")","v":""},{"$f":"IF($F40>=5,IF(BF40=\"\",\"\",BF40),\"\")","v":""},{"$f":"IF($F40>=5,IF(BK40=\"\",\"\",BK40),\"\")","v":""},null,11,{"$f":"IF(ISNUMBER(AA40),(VLOOKUP(AA40,$BO$6:$BP$50,2)),0)","v":24},{"$f":"IF(AA40<>\"\",5,0)","v":5},{"$f":"AB40+AC40","v":29},null,null,{"$f":"IF(ISNUMBER(AF40),(VLOOKUP(AF40,$BO$6:$BP$50,2)),0)","v":0},{"$f":"IF(AF40<>\"\",5,0)","v":0},{"$f":"AG40+AH40","v":0},null,null,{"$f":"IF(ISNUMBER(AK40),(VLOOKUP(AK40,$BO$6:$BP$50,2)),0)","v":0},{"$f":"IF(AK40<>\"\",5,0)","v":0},{"$f":"AL40+AM40","v":0},null,null,{"$f":"IF(ISNUMBER(AP40),(VLOOKUP(AP40,$BO$6:$BP$50,2)),0)","v":0},{"$f":"IF(AP40<>\"\",5,0)","v":0},{"$f":"AQ40+AR40","v":0},null,null,{"$f":"IF(ISNUMBER(AU40),(VLOOKUP(AU40,$BO$6:$BP$50,2)),0)","v":0},{"$f":"IF(AU40<>\"\",5,0)","v":0},{"$f":"AV40+AW40","v":0},null,null,{"$f":"IF(ISNUMBER(AZ40),(VLOOKUP(AZ40,$BO$6:$BP$50,2)),0)","v":0},{"$f":"IF(AZ40<>\"\",5,0)","v":0},{"$f":"BA40+BB40","v":0},null,"dsq",{"$f":"IF(ISNUMBER(BE40),(VLOOKUP(BE40,$BO$6:$BP$50,2)),0)","v":0},{"$f":"IF(BE40<>\"\",5,0)","v":5},{"$f":"BF40+BG40","v":5},null,null,{"$f":"IF(ISNUMBER(BJ40),(VLOOKUP(BJ40,$BO$6:$BP$50,2)),0)","v":0},{"$f":"IF(BJ40<>\"\",5,0)","v":0},{"$f":"BK40+BL40","v":0},null,35,0,0,0,0,0,0,1,0,0]
[{"$f":"IF(E41<E40,BO41,A40)","v":36},"Hagen-Småstu","Sindre","Kjelsås",{"$f":"IF(F41<=4,Q41,(Q41-SUM(SMALL(R41:Y41,{1;2;3;4}))))","v":33},{"$f":"(IF(AC41=5,1,0)+IF(AH41=5,1,0)+IF(AM41=5,1,0)+IF(AR41=5,1,0)+IF(AW41=5,1,0)+IF(BB41=5,1,0)+IF(BG41=5,1,0)+IF(BL41=5,1,0))","v":2},null,{"$f":"IF(AA41=\"\",\"\",AA41)","v":""},{"$f":"IF(AF41=\"\",\"\",AF41)","v":""},{"$f":"IF(AK41=\"\",\"\",AK41)","v":""},{"$f":"IF(AP41=\"\",\"\",AP41)","v":""},{"$f":"IF(AU41=\"\",\"\",AU41)","v":""},{"$f":"IF(AZ41=\"\",\"\",AZ41)","v":22},{"$f":"IF(BE41=\"\",\"\",BE41)","v":17},{"$f":"IF(BJ41=\"\",\"\",BJ41)","v":""},null,{"$f":"AD41+AI41+AN41+AS41+AX41+BC41+BH41","v":33},{"$f":"IF($F41>=5,IF(AB41=\"\",\"\",AB41),\"\")","v":""},{"$f":"IF($F41>=5,IF(AG41=\"\",\"\",AG41),\"\")","v":""},{"$f":"IF($F41>=5,IF(AL41=\"\",\"\",AL41),\"\")","v":""},{"$f":"IF($F41>=5,IF(AQ41=\"\",\"\",AQ41),\"\")","v":""},{"$f":"IF($F41>=5,IF(AV41=\"\",\"\",AV41),\"\")","v":""},{"$f":"IF($F41>=5,IF(BA41=\"\",\"\",BA41),\"\")","v":""},{"$f":"IF($F41>=5,IF(BF41=\"\",\"\",BF41),\"\")","v":""},{"$f":"IF($F41>=5,IF(BK41=\"\",\"\",BK41),\"\")","v":""},null,null,{"$f":"IF(ISNUMBER(AA41),(VLOOKUP(AA41,$BO$6:$BP$50,2)),0)","v":0},{"$f":"IF(AA41<>\"\",5,0)","v":0},{"$f":"AB41+AC41","v":0},null,null,{"$f":"IF(ISNUMBER(AF41),(VLOOKUP(AF41,$BO$6:$BP$50,2)),0)","v":0},{"$f":"IF(AF41<>\"\",5,0)","v":0},{"$f":"AG41+AH41","v":0},null,null,{"$f":"IF(ISNUMBER(AK41),(VLOOKUP(AK41,$BO$6:$BP$50,2)),0)","v":0},{"$f":"IF(AK41<>\"\",5,0)","v":0},{"$f":"AL41+AM41","v":0},null,null,{"$f":"IF(ISNUMBER(AP41),(VLOOKUP(AP41,$BO$6:$BP$50,2)),0)","v":0},{"$f":"IF(AP41<>\"\",5,0)","v":0},{"$f":"AQ41+AR41","v":0},null,null,{"$f":"IF(ISNUMBER(AU41),(VLOOKUP(AU41,$BO$6:$BP$50,2)),0)","v":0},{"$f":"IF(AU41<>\"\",5,0)","v":0},{"$f":"AV41+AW41","v":0},null,22,{"$f":"IF(ISNUMBER(AZ41),(VLOOKUP(AZ41,$BO$6:$BP$50,2)),0)","v":9},{"$f":"IF(AZ41<>\"\",5,0)","v":5},{"$f":"BA41+BB41","v":14},null,17,{"$f":"IF(ISNUMBER(BE41),(VLOOKUP(BE41,$BO$6:$BP$50,2)),0)","v":14},{"$f":"IF(BE41<>\"\",5,0)","v":5},{"$f":"BF41+BG41","v":19},null,null,{"$f":"IF(ISNUMBER(BJ41),(VLOOKUP(BJ41,$BO$6:$BP$50,2)),0)","v":0},{"$f":"IF(BJ41<>\"\",5,0)","v":0},{"$f":"BK41+BL41","v":0},null,36,0,0,0,0,0,0,0,0,1]
[{"$f":"IF(E42<E41,BO42,A41)","v":37},"Lyseklætt","Sebastian","Heming",{"$f":"IF(F42<=4,Q42,(Q42-SUM(SMALL(R42:Y42,{1;2;3;4}))))","v":28},{"$f":"(IF(AC42=5,1,0)+IF(AH42=5,1,0)+IF(AM42=5,1,0)+IF(AR42=5,1,0)+IF(AW42=5,1,0)+IF(BB42=5,1,0)+IF(BG42=5,1,0)+IF(BL42=5,1,0))","v":2},null,{"$f":"IF(AA42=\"\",\"\",AA42)","v":""},{"$f":"IF(AF42=\"\",\"\",AF42)","v":""},{"$f":"IF(AK42=\"\",\"\",AK42)","v":""},{"$f":"IF(AP42=\"\",\"\",AP42)","v":""},{"$f":"IF(AU42=\"\",\"\",AU42)","v":"dnf"},{"$f":"IF(AZ42=\"\",\"\",AZ42)","v":14},{"$f":"IF(BE42=\"\",\"\",BE42)","v":""},{"$f":"IF(BJ42=\"\",\"\",BJ42)","v":""},null,{"$f":"AD42+AI42+AN42+AS42+AX42+BC42+BH42","v":28},{"$f":"IF($F42>=5,IF(AB42=\"\",\"\",AB42),\"\")","v":""},{"$f":"IF($F42>=5,IF(AG42=\"\",\"\",AG42),\"\")","v":""},{"$f":"IF($F42>=5,IF(AL42=\"\",\"\",AL42),\"\")","v":""},{"$f":"IF($F42>=5,IF(AQ42=\"\",\"\",AQ42),\"\")","v":""},{"$f":"IF($F42>=5,IF(AV42=\"\",\"\",AV42),\"\")","v":""},{"$f":"IF($F42>=5,IF(BA42=\"\",\"\",BA42),\"\")","v":""},{"$f":"IF($F42>=5,IF(BF42=\"\",\"\",BF42),\"\")","v":""},{"$f":"IF($F42>=5,IF(BK42=\"\",\"\",BK42),\"\")","v":""},null,null,{"$f":"IF(ISNUMBER(AA42),(VLOOKUP(AA42,$BO$6:$BP$50,2)),0)","v":0},{"$f":"IF(AA42<>\"\",5,0)","v":0},{"$f":"AB42+AC42","v":0},null,null,{"$f":"IF(ISNUMBER(AF42),(VLOOKUP(AF42,$BO$6:$BP$50,2)),0)","v":0},{"$f":"IF(AF42<>\"\",5,0)","v":0},{"$f":"AG42+AH42","v":0},null,null,{"$f":"IF(ISNUMBER(AK42),(VLOOKUP(AK42,$BO$6:$BP$50,2)),0)","v":0},{"$f":"IF(AK42<>\"\",5,0)","v":0},{"$f":"AL42+AM42","v":0},null,null,{"$f":"IF(ISNUMBER(AP42),(VLOOKUP(AP42,$BO$6:$BP$50,2)),0)","v":0},{"$f":"IF(AP42<>\"\",5,0)","v":0},{"$f":"AQ42+AR42","v":0},null,"dnf",{"$f":"IF(ISNUMBER(AU42),(VLOOKUP(AU42,$BO$6:$BP$50,2)),0)","v":0},{"$f":"IF(AU42<>\"\",5,0)","v":5},{"$f":"AV42+AW42","v":5},null,14,{"$f":"IF(ISNUMBER(AZ42),(VLOOKUP(AZ42,$BO$6:$BP$50,2)),0)","v":18},{"$f":"IF(AZ42<>\"\",5,0)","v":5},{"$f":"BA42+BB42","v":23},null,null,{"$f":"IF(ISNUMBER(BE42),(VLOOKUP(BE42,$BO$6:$BP$50,2)),0)","v":0},{"$f":"IF(BE42<>\"\",5,0)","v":0},{"$f":"BF42+BG42","v":0},null,null,{"$f":"IF(ISNUMBER(BJ42),(VLOOKUP(BJ42,$BO$6:$BP$50,2)),0)","v":0},{"$f":"IF(BJ42<>\"\",5,0)","v":0},{"$f":"BK42+BL42","v":0},null,37,0,0,0,0,0,0,0,1,0]
[{"$f":"IF(E43<E42,BO43,A42)","v":37},"Stigen","Mikkel","Kjelsås",{"$f":"IF(F43<=4,Q43,(Q43-SUM(SMALL(R43:Y43,{1;2;3;4}))))","v":28},{"$f":"(IF(AC43=5,1,0)+IF(AH43=5,1,0)+IF(AM43=5,1,0)+IF(AR43=5,1,0)+IF(AW43=5,1,0)+IF(BB43=5,1,0)+IF(BG43=5,1,0)+IF(BL43=5,1,0))","v":2},null,{"$f":"IF(AA43=\"\",\"\",AA43)","v":""},{"$f":"IF(AF43=\"\",\"\",AF43)","v":""},{"$f":"IF(AK43=\"\",\"\",AK43)","v":""},{"$f":"IF(AP43=\"\",\"\",AP43)","v":""},{"$f":"IF(AU43=\"\",\"\",AU43)","v":""},{"$f":"IF(AZ43=\"\",\"\",AZ43)","v":23},{"$f":"IF(BE43=\"\",\"\",BE43)","v":21},{"$f":"IF(BJ43=\"\",\"\",BJ43)","v":""},null,{"$f":"AD43+AI43+AN43+AS43+AX43+BC43+BH43","v":28},{"$f":"IF($F43>=5,IF(AB43=\"\",\"\",AB43),\"\")","v":""},{"$f":"IF($F43>=5,IF(AG43=\"\",\"\",AG43),\"\")","v":""},{"$f":"IF($F43>=5,IF(AL43=\"\",\"\",AL43),\"\")","v":""},{"$f":"IF($F43>=5,IF(AQ43=\"\",\"\",AQ43),\"\")","v":""},{"$f":"IF($F43>=5,IF(AV43=\"\",\"\",AV43),\"\")","v":""},{"$f":"IF($F43>=5,IF(BA43=\"\",\"\",BA43),\"\")","v":""},{"$f":"IF($F43>=5,IF(BF43=\"\",\"\",BF43),\"\")","v":""},{"$f":"IF($F43>=5,IF(BK43=\"\",\"\",BK43),\"\")","v":""},null,null,{"$f":"IF(ISNUMBER(AA43),(VLOOKUP(AA43,$BO$6:$BP$50,2)),0)","v":0},{"$f":"IF(AA43<>\"\",5,0)","v":0},{"$f":"AB43+AC43","v":0},null,null,{"$f":"IF(ISNUMBER(AF43),(VLOOKUP(AF43,$BO$6:$BP$50,2)),0)","v":0},{"$f":"IF(AF43<>\"\",5,0)","v":0},{"$f":"AG43+AH43","v":0},null,null,{"$f":"IF(ISNUMBER(AK43),(VLOOKUP(AK43,$BO$6:$BP$50,2)),0)","v":0},{"$f":"IF(AK43<>\"\",5,0)","v":0},{"$f":"AL43+AM43","v":0},null,null,{"$f":"IF(ISNUMBER(AP43),(VLOOKUP(AP43,$BO$6:$BP$50,2)),0)","v":0},{"$f":"IF(AP43<>\"\",5,0)","v":0},{"$f":"AQ43+AR43","v":0},null,null,{"$f":"IF(ISNUMBER(AU43),(VLOOKUP(AU43,$BO$6:$BP$50,2)),0)","v":0},{"$f":"IF(AU43<>\"\",5,0)","v":0},{"$f":"AV43+AW43","v":0},null,23,{"$f":"IF(ISNUMBER(AZ43),(VLOOKUP(AZ43,$BO$6:$BP$50,2)),0)","v":8},{"$f":"IF(AZ43<>\"\",5,0)","v":5},{"$f":"BA43+BB43","v":13},null,21,{"$f":"IF(ISNUMBER(BE43),(VLOOKUP(BE43,$BO$6:$BP$50,2)),0)","v":10},{"$f":"IF(BE43<>\"\",5,0)","v":5},{"$f":"BF43+BG43","v":15},null,null,{"$f":"IF(ISNUMBER(BJ43),(VLOOKUP(BJ43,$BO$6:$BP$50,2)),0)","v":0},{"$f":"IF(BJ43<>\"\",5,0)","v":0},{"$f":"BK43+BL43","v":0},null,38,0,0,0,0,0,0,0,0,1]
[{"$f":"IF(E44<E43,BO44,A43)","v":39},"Øksnes","Håkon Eiksund","Kjelsås",{"$f":"IF(F44<=4,Q44,(Q44-SUM(SMALL(R44:Y44,{1;2;3;4}))))","v":25},{"$f":"(IF(AC44=5,1,0)+IF(AH44=5,1,0)+IF(AM44=5,1,0)+IF(AR44=5,1,0)+IF(AW44=5,1,0)+IF(BB44=5,1,0)+IF(BG44=5,1,0)+IF(BL44=5,1,0))","v":1},null,{"$f":"IF(AA44=\"\",\"\",AA44)","v":13},{"$f":"IF(AF44=\"\",\"\",AF44)","v":""},{"$f":"IF(AK44=\"\",\"\",AK44)","v":""},{"$f":"IF(AP44=\"\",\"\",AP44)","v":""},{"$f":"IF(AU44=\"\",\"\",AU44)","v":""},{"$f":"IF(AZ44=\"\",\"\",AZ44)","v":""},{"$f":"IF(BE44=\"\",\"\",BE44)","v":""},{"$f":"IF(BJ44=\"\",\"\",BJ44)","v":""},null,{"$f":"AD44+AI44+AN44+AS44+AX44+BC44+BH44","v":25},{"$f":"IF($F44>=5,IF(AB44=\"\",\"\",AB44),\"\")","v":""},{"$f":"IF($F44>=5,IF(AG44=\"\",\"\",AG44),\"\")","v":""},{"$f":"IF($F44>=5,IF(AL44=\"\",\"\",AL44),\"\")","v":""},{"$f":"IF($F44>=5,IF(AQ44=\"\",\"\",AQ44),\"\")","v":""},{"$f":"IF($F44>=5,IF(AV44=\"\",\"\",AV44),\"\")","v":""},{"$f":"IF($F44>=5,IF(BA44=\"\",\"\",BA44),\"\")","v":""},{"$f":"IF($F44>=5,IF(BF44=\"\",\"\",BF44),\"\")","v":""},{"$f":"IF($F44>=5,IF(BK44=\"\",\"\",BK44),\"\")","v":""},null,13,{"$f":"IF(ISNUMBER(AA44),(VLOOKUP(AA44,$BO$6:$BP$50,2)),0)","v":20},{"$f":"IF(AA44<>\"\",5,0)","v":5},{"$f":"AB44+AC44","v":25},null,null,{"$f":"IF(ISNUMBER(AF44),(VLOOKUP(AF44,$BO$6:$BP$50,2)),0)","v":0},{"$f":"IF(AF44<>\"\",5,0)","v":0},{"$f":"AG44+AH44","v":0},null,null,{"$f":"IF(ISNUMBER(AK44),(VLOOKUP(AK44,$BO$6:$BP$50,2)),0)","v":0},{"$f":"IF(AK44<>\"\",5,0)","v":0},{"$f":"AL44+AM44","v":0},null,null,{"$f":"IF(ISNUMBER(AP44),(VLOOKUP(AP44,$BO$6:$BP$50,2)),0)","v":0},{"$f":"IF(AP44<>\"\",5,0)","v":0},{"$f":"AQ44+AR44","v":0},null,null,{"$f":"IF(ISNUMBER(AU44),(VLOOKUP(AU44,$BO$6:$BP$50,2)),0)","v":0},{"$f":"IF(AU44<>\"\",5,0)","v":0},{"$f":"AV44+AW44","v":0},null,null,{"$f":"IF(ISNUMBER(AZ44),(VLOOKUP(AZ44,$BO$6:$BP$50,2)),0)","v":0},{"$f":"IF(AZ44<>\"\",5,0)","v":0},{"$f":"BA44+BB44","v":0},null,null,{"$f":"IF(ISNUMBER(BE44),(VLOOKUP(BE44,$BO$6:$BP$50,2)),0)","v":0},{"$f":"IF(BE44<>\"\",5,0)","v":0},{"$f":"BF44+BG44","v":0},null,null,{"$f":"IF(ISNUMBER(BJ44),(VLOOKUP(BJ44,$BO$6:$BP$50,2)),0)","v":0},{"$f":"IF(BJ44<>\"\",5,0)","v":0},{"$f":"BK44+BL44","v":0},null,39,0,0,0,0,0,0,0,1,0]
[{"$f":"IF(E45<E44,BO45,A44)","v":40},"Ruud-Hansen","Max","Kjelsås",{"$f":"IF(F45<=4,Q45,(Q45-SUM(SMALL(R45:Y45,{1;2;3;4}))))","v":22},{"$f":"(IF(AC45=5,1,0)+IF(AH45=5,1,0)+IF(AM45=5,1,0)+IF(AR45=5,1,0)+IF(AW45=5,1,0)+IF(BB45=5,1,0)+IF(BG45=5,1,0)+IF(BL45=5,1,0))","v":2},null,{"$f":"IF(AA45=\"\",\"\",AA45)","v":""},{"$f":"IF(AF45=\"\",\"\",AF45)","v":""},{"$f":"IF(AK45=\"\",\"\",AK45)","v":""},{"$f":"IF(AP45=\"\",\"\",AP45)","v":""},{"$f":"IF(AU45=\"\",\"\",AU45)","v":""},{"$f":"IF(AZ45=\"\",\"\",AZ45)","v":19},{"$f":"IF(BE45=\"\",\"\",BE45)","v":"dsq"},{"$f":"IF(BJ45=\"\",\"\",BJ45)","v":""},null,{"$f":"AD45+AI45+AN45+AS45+AX45+BC45+BH45","v":22},{"$f":"IF($F45>=5,IF(AB45=\"\",\"\",AB45),\"\")","v":""},{"$f":"IF($F45>=5,IF(AG45=\"\",\"\",AG45),\"\")","v":""},{"$f":"IF($F45>=5,IF(AL45=\"\",\"\",AL45),\"\")","v":""},{"$f":"IF($F45>=5,IF(AQ45=\"\",\"\",AQ45),\"\")","v":""},{"$f":"IF($F45>=5,IF(AV45=\"\",\"\",AV45),\"\")","v":""},{"$f":"IF($F45>=5,IF(BA45=\"\",\"\",BA45),\"\")","v":""},{"$f":"IF($F45>=5,IF(BF45=\"\",\"\",BF45),\"\")","v":""},{"$f":"IF($F45>=5,IF(BK45=\"\",\"\",BK45),\"\")","v":""},null,null,{"$f":"IF(ISNUMBER(AA45),(VLOOKUP(AA45,$BO$6:$BP$50,2)),0)","v":0},{"$f":"IF(AA45<>\"\",5,0)","v":0},{"$f":"AB45+AC45","v":0},null,null,{"$f":"IF(ISNUMBER(AF45),(VLOOKUP(AF45,$BO$6:$BP$50,2)),0)","v":0},{"$f":"IF(AF45<>\"\",5,0)","v":0},{"$f":"AG45+AH45","v":0},null,null,{"$f":"IF(ISNUMBER(AK45),(VLOOKUP(AK45,$BO$6:$BP$50,2)),0)","v":0},{"$f":"IF(AK45<>\"\",5,0)","v":0},{"$f":"AL45+AM45","v":0},null,null,{"$f":"IF(ISNUMBER(AP45),(VLOOKUP(AP45,$BO$6:$BP$50,2)),0)","v":0},{"$f":"IF(AP45<>\"\",5,0)","v":0},{"$f":"AQ45+AR45","v":0},null,null,{"$f":"IF(ISNUMBER(AU45),(VLOOKUP(AU45,$BO$6:$BP$50,2)),0)","v":0},{"$f":"IF(AU45<>\"\",5,0)","v":0},{"$f":"AV45+AW45","v":0},null,19,{"$f":"IF(ISNUMBER(AZ45),(VLOOKUP(AZ45,$BO$6:$BP$50,2)),0)","v":12},{"$f":"IF(AZ45<>\"\",5,0)","v":5},{"$f":"BA45+BB45","v":17},null,"dsq",{"$f":"IF(ISNUMBER(BE45),(VLOOKUP(BE45,$BO$6:$BP$50,2)),0)","v":0},{"$f":"IF(BE45<>\"\",5,0)","v":5},{"$f":"BF45+BG45","v":5},null,null,{"$f":"IF(ISNUMBER(BJ45),(VLOOKUP(BJ45,$BO$6:$BP$50,2)),0)","v":0},{"$f":"IF(BJ45<>\"\",5,0)","v":0},{"$f":"BK45+BL45","v":0},null,40,0,0,0,0,0,0,1,0,0]
[{"$f":"IF(E46<E45,BO46,A45)","v":41},"Erlandsen","Mats","Ullensaker",{"$f":"IF(F46<=4,Q46,(Q46-SUM(SMALL(R46:Y46,{1;2;3;4}))))","v":20},{"$f":"(IF(AC46=5,1,0)+IF(AH46=5,1,0)+IF(AM46=5,1,0)+IF(AR46=5,1,0)+IF(AW46=5,1,0)+IF(BB46=5,1,0)+IF(BG46=5,1,0)+IF(BL46=5,1,0))","v":1},null,{"$f":"IF(AA46=\"\",\"\",AA46)","v":""},{"$f":"IF(AF46=\"\",\"\",AF46)","v":""},{"$f":"IF(AK46=\"\",\"\",AK46)","v":""},{"$f":"IF(AP46=\"\",\"\",AP46)","v":""},{"$f":"IF(AU46=\"\",\"\",AU46)","v":16},{"$f":"IF(AZ46=\"\",\"\",AZ46)","v":""},{"$f":"IF(BE46=\"\",\"\",BE46)","v":""},{"$f":"IF(BJ46=\"\",\"\",BJ46)","v":""},null,{"$f":"AD46+AI46+AN46+AS46+AX46+BC46+BH46","v":20},{"$f":"IF($F46>=5,IF(AB46=\"\",\"\",AB46),\"\")","v":""},{"$f":"IF($F46>=5,IF(AG46=\"\",\"\",AG46),\"\")","v":""},{"$f":"IF($F46>=5,IF(AL46=\"\",\"\",AL46),\"\")","v":""},{"$f":"IF($F46>=5,IF(AQ46=\"\",\"\",AQ46),\"\")","v":""},{"$f":"IF($F46>=5,IF(AV46=\"\",\"\",AV46),\"\")","v":""},{"$f":"IF($F46>=5,IF(BA46=\"\",\"\",BA46),\"\")","v":""},{"$f":"IF($F46>=5,IF(BF46=\"\",\"\",BF46),\"\")","v":""},{"$f":"IF($F46>=5,IF(BK46=\"\",\"\",BK46),\"\")","v":""},null,null,{"$f":"IF(ISNUMBER(AA46),(VLOOKUP(AA46,$BO$6:$BP$50,2)),0)","v":0},{"$f":"IF(AA46<>\"\",5,0)","v":0},{"$f":"AB46+AC46","v":0},null,null,{"$f":"IF(ISNUMBER(AF46),(VLOOKUP(AF46,$BO$6:$BP$50,2)),0)","v":0},{"$f":"IF(AF46<>\"\",5,0)","v":0},{"$f":"AG46+AH46","v":0},null,null,{"$f":"IF(ISNUMBER(AK46),(VLOOKUP(AK46,$BO$6:$BP$50,2)),0)","v":0},{"$f":"IF(AK46<>\"\",5,0)","v":0},{"$f":"AL46+AM46","v":0},null,null,{"$f":"IF(ISNUMBER(AP46),(VLOOKUP(AP46,$BO$6:$BP$50,2)),0)","v":0},{"$f":"IF(AP46<>\"\",5,0)","v":0},{"$f":"AQ46+AR46","v":0},null,16,{"$f":"IF(ISNUMBER(AU46),(VLOOKUP(AU46,$BO$6:$BP$50,2)),0)","v":15},{"$f":"IF(AU46<>\"\",5,0)","v":5},{"$f":"AV46+AW46","v":20},null,null,{"$f":"IF(ISNUMBER(AZ46),(VLOOKUP(AZ46,$BO$6:$BP$50,2)),0)","v":0},{"$f":"IF(AZ46<>\"\",5,0)","v":0},{"$f":"BA46+BB46","v":0},null,null,{"$f":"IF(ISNUMBER(BE46),(VLOOKUP(BE46,$BO$6:$BP$50,2)),0)","v":0},{"$f":"IF(BE46<>\"\",5,0)","v":0},{"$f":"BF46+BG46","v":0},null,null,{"$f":"IF(ISNUMBER(BJ46),(VLOOKUP(BJ46,$BO$6:$BP$50,2)),0)","v":0},{"$f":"IF(BJ46<>\"\",5,0)","v":0},{"$f":"BK46+BL46","v":0},null,41,0,0,0,0,0,0,0,1,0]
[{"$f":"IF(E47<E46,BO47,A46)","v":42},"Manley","Hermann","Kjelsås",{"$f":"IF(F47<=4,Q47,(Q47-SUM(SMALL(R47:Y47,{1;2;3;4}))))","v":16},{"$f":"(IF(AC47=5,1,0)+IF(AH47=5,1,0)+IF(AM47=5,1,0)+IF(AR47=5,1,0)+IF(AW47=5,1,0)+IF(BB47=5,1,0)+IF(BG47=5,1,0)+IF(BL47=5,1,0))","v":1},null,{"$f":"IF(AA47=\"\",\"\",AA47)","v":""},{"$f":"IF(AF47=\"\",\"\",AF47)","v":""},{"$f":"IF(AK47=\"\",\"\",AK47)","v":""},{"$f":"IF(AP47=\"\",\"\",AP47)","v":""},{"$f":"IF(AU47=\"\",\"\",AU47)","v":""},{"$f":"IF(AZ47=\"\",\"\",AZ47)","v":""},{"$f":"IF(BE47=\"\",\"\",BE47)","v":20},{"$f":"IF(BJ47=\"\",\"\",BJ47)","v":""},null,{"$f":"AD47+AI47+AN47+AS47+AX47+BC47+BH47","v":16},{"$f":"IF($F47>=5,IF(AB47=\"\",\"\",AB47),\"\")","v":""},{"$f":"IF($F47>=5,IF(AG47=\"\",\"\",AG47),\"\")","v":""},{"$f":"IF($F47>=5,IF(AL47=\"\",\"\",AL47),\"\")","v":""},{"$f":"IF($F47>=5,IF(AQ47=\"\",\"\",AQ47),\"\")","v":""},{"$f":"IF($F47>=5,IF(AV47=\"\",\"\",AV47),\"\")","v":""},{"$f":"IF($F47>=5,IF(BA47=\"\",\"\",BA47),\"\")","v":""},{"$f":"IF($F47>=5,IF(BF47=\"\",\"\",BF47),\"\")","v":""},{"$f":"IF($F47>=5,IF(BK47=\"\",\"\",BK47),\"\")","v":""},null,null,{"$f":"IF(ISNUMBER(AA47),(VLOOKUP(AA47,$BO$6:$BP$50,2)),0)","v":0},{"$f":"IF(AA47<>\"\",5,0)","v":0},{"$f":"AB47+AC47","v":0},null,null,{"$f":"IF(ISNUMBER(AF47),(VLOOKUP(AF47,$BO$6:$BP$50,2)),0)","v":0},{"$f":"IF(AF47<>\"\",5,0)","v":0},{"$f":"AG47+AH47","v":0},null,null,{"$f":"IF(ISNUMBER(AK47),(VLOOKUP(AK47,$BO$6:$BP$50,2)),0)","v":0},{"$f":"IF(AK47<>\"\",5,0)","v":0},{"$f":"AL47+AM47","v":0},null,null,{"$f":"IF(ISNUMBER(AP47),(VLOOKUP(AP47,$BO$6:$BP$50,2)),0)","v":0},{"$f":"IF(AP47<>\"\",5,0)","v":0},{"$f":"AQ47+AR47","v":0},null,null,{"$f":"IF(ISNUMBER(AU47),(VLOOKUP(AU47,$BO$6:$BP$50,2)),0)","v":0},{"$f":"IF(AU47<>\"\",5,0)","v":0},{"$f":"AV47+AW47","v":0},null,null,{"$f":"IF(ISNUMBER(AZ47),(VLOOKUP(AZ47,$BO$6:$BP$50,2)),0)","v":0},{"$f":"IF(AZ47<>\"\",5,0)","v":0},{"$f":"BA47+BB47","v":0},null,20,{"$f":"IF(ISNUMBER(BE47),(VLOOKUP(BE47,$BO$6:$BP$50,2)),0)","v":11},{"$f":"IF(BE47<>\"\",5,0)","v":5},{"$f":"BF47+BG47","v":16},null,null,{"$f":"IF(ISNUMBER(BJ47),(VLOOKUP(BJ47,$BO$6:$BP$50,2)),0)","v":0},{"$f":"IF(BJ47<>\"\",5,0)","v":0},{"$f":"BK47+BL47","v":0},null,42,0,0,0,0,0,0,0,1,0]
[{"$f":"IF(E48<E47,BO48,A47)","v":43},"Ross","Hans Christian","Heming",{"$f":"IF(F48<=4,Q48,(Q48-SUM(SMALL(R48:Y48,{1;2;3;4}))))","v":14},{"$f":"(IF(AC48=5,1,0)+IF(AH48=5,1,0)+IF(AM48=5,1,0)+IF(AR48=5,1,0)+IF(AW48=5,1,0)+IF(BB48=5,1,0)+IF(BG48=5,1,0)+IF(BL48=5,1,0))","v":1},null,{"$f":"IF(AA48=\"\",\"\",AA48)","v":""},{"$f":"IF(AF48=\"\",\"\",AF48)","v":""},{"$f":"IF(AK48=\"\",\"\",AK48)","v":""},{"$f":"IF(AP48=\"\",\"\",AP48)","v":""},{"$f":"IF(AU48=\"\",\"\",AU48)","v":22},{"$f":"IF(AZ48=\"\",\"\",AZ48)","v":""},{"$f":"IF(BE48=\"\",\"\",BE48)","v":""},{"$f":"IF(BJ48=\"\",\"\",BJ48)","v":""},null,{"$f":"AD48+AI48+AN48+AS48+AX48+BC48+BH48","v":14},{"$f":"IF($F48>=5,IF(AB48=\"\",\"\",AB48),\"\")","v":""},{"$f":"IF($F48>=5,IF(AG48=\"\",\"\",AG48),\"\")","v":""},{"$f":"IF($F48>=5,IF(AL48=\"\",\"\",AL48),\"\")","v":""},{"$f":"IF($F48>=5,IF(AQ48=\"\",\"\",AQ48),\"\")","v":""},{"$f":"IF($F48>=5,IF(AV48=\"\",\"\",AV48),\"\")","v":""},{"$f":"IF($F48>=5,IF(BA48=\"\",\"\",BA48),\"\")","v":""},{"$f":"IF($F48>=5,IF(BF48=\"\",\"\",BF48),\"\")","v":""},{"$f":"IF($F48>=5,IF(BK48=\"\",\"\",BK48),\"\")","v":""},null,null,{"$f":"IF(ISNUMBER(AA48),(VLOOKUP(AA48,$BO$6:$BP$50,2)),0)","v":0},{"$f":"IF(AA48<>\"\",5,0)","v":0},{"$f":"AB48+AC48","v":0},null,null,{"$f":"IF(ISNUMBER(AF48),(VLOOKUP(AF48,$BO$6:$BP$50,2)),0)","v":0},{"$f":"IF(AF48<>\"\",5,0)","v":0},{"$f":"AG48+AH48","v":0},null,null,{"$f":"IF(ISNUMBER(AK48),(VLOOKUP(AK48,$BO$6:$BP$50,2)),0)","v":0},{"$f":"IF(AK48<>\"\",5,0)","v":0},{"$f":"AL48+AM48","v":0},null,null,{"$f":"IF(ISNUMBER(AP48),(VLOOKUP(AP48,$BO$6:$BP$50,2)),0)","v":0},{"$f":"IF(AP48<>\"\",5,0)","v":0},{"$f":"AQ48+AR48","v":0},null,22,{"$f":"IF(ISNUMBER(AU48),(VLOOKUP(AU48,$BO$6:$BP$50,2)),0)","v":9},{"$f":"IF(AU48<>\"\",5,0)","v":5},{"$f":"AV48+AW48","v":14},null,null,{"$f":"IF(ISNUMBER(AZ48),(VLOOKUP(AZ48,$BO$6:$BP$50,2)),0)","v":0},{"$f":"IF(AZ48<>\"\",5,0)","v":0},{"$f":"BA48+BB48","v":0},null,null,{"$f":"IF(ISNUMBER(BE48),(VLOOKUP(BE48,$BO$6:$BP$50,2)),0)","v":0},{"$f":"IF(BE48<>\"\",5,0)","v":0},{"$f":"BF48+BG48","v":0},null,null,{"$f":"IF(ISNUMBER(BJ48),(VLOOKUP(BJ48,$BO$6:$BP$50,2)),0)","v":0},{"$f":"IF(BJ48<>\"\",5,0)","v":0},{"$f":"BK48+BL48","v":0},null,43,0,0,0,0,0,0,0,0,1]
[{"$f":"IF(E49<E48,BO49,A48)","v":43},"Nyman","Carl Axel","Kjelsås",{"$f":"IF(F49<=4,Q49,(Q49-SUM(SMALL(R49:Y49,{1;2;3;4}))))","v":14},{"$f":"(IF(AC49=5,1,0)+IF(AH49=5,1,0)+IF(AM49=5,1,0)+IF(AR49=5,1,0)+IF(AW49=5,1,0)+IF(BB49=5,1,0)+IF(BG49=5,1,0)+IF(BL49=5,1,0))","v":1},null,{"$f":"IF(AA49=\"\",\"\",AA49)","v":""},{"$f":"IF(AF49=\"\",\"\",AF49)","v":""},{"$f":"IF(AK49=\"\",\"\",AK49)","v":""},{"$f":"IF(AP49=\"\",\"\",AP49)","v":""},{"$f":"IF(AU49=\"\",\"\",AU49)","v":""},{"$f":"IF(AZ49=\"\",\"\",AZ49)","v":""},{"$f":"IF(BE49=\"\",\"\",BE49)","v":22},{"$f":"IF(BJ49=\"\",\"\",BJ49)","v":""},null,{"$f":"AD49+AI49+AN49+AS49+AX49+BC49+BH49","v":14},{"$f":"IF($F49>=5,IF(AB49=\"\",\"\",AB49),\"\")","v":""},{"$f":"IF($F49>=5,IF(AG49=\"\",\"\",AG49),\"\")","v":""},{"$f":"IF($F49>=5,IF(AL49=\"\",\"\",AL49),\"\")","v":""},{"$f":"IF($F49>=5,IF(AQ49=\"\",\"\",AQ49),\"\")","v":""},{"$f":"IF($F49>=5,IF(AV49=\"\",\"\",AV49),\"\")","v":""},{"$f":"IF($F49>=5,IF(BA49=\"\",\"\",BA49),\"\")","v":""},{"$f":"IF($F49>=5,IF(BF49=\"\",\"\",BF49),\"\")","v":""},{"$f":"IF($F49>=5,IF(BK49=\"\",\"\",BK49),\"\")","v":""},null,null,{"$f":"IF(ISNUMBER(AA49),(VLOOKUP(AA49,$BO$6:$BP$50,2)),0)","v":0},{"$f":"IF(AA49<>\"\",5,0)","v":0},{"$f":"AB49+AC49","v":0},null,null,{"$f":"IF(ISNUMBER(AF49),(VLOOKUP(AF49,$BO$6:$BP$50,2)),0)","v":0},{"$f":"IF(AF49<>\"\",5,0)","v":0},{"$f":"AG49+AH49","v":0},null,null,{"$f":"IF(ISNUMBER(AK49),(VLOOKUP(AK49,$BO$6:$BP$50,2)),0)","v":0},{"$f":"IF(AK49<>\"\",5,0)","v":0},{"$f":"AL49+AM49","v":0},null,null,{"$f":"IF(ISNUMBER(AP49),(VLOOKUP(AP49,$BO$6:$BP$50,2)),0)","v":0},{"$f":"IF(AP49<>\"\",5,0)","v":0},{"$f":"AQ49+AR49","v":0},null,null,{"$f":"IF(ISNUMBER(AU49),(VLOOKUP(AU49,$BO$6:$BP$50,2)),0)","v":0},{"$f":"IF(AU49<>\"\",5,0)","v":0},{"$f":"AV49+AW49","v":0},null,null,{"$f":"IF(ISNUMBER(AZ49),(VLOOKUP(AZ49,$BO$6:$BP$50,2)),0)","v":0},{"$f":"IF(AZ49<>\"\",5,0)","v":0},{"$f":"BA49+BB49","v":0},null,22,{"$f":"IF(ISNUMBER(BE49),(VLOOKUP(BE49,$BO$6:$BP$50,2)),0)","v":9},{"$f":"IF(BE49<>\"\",5,0)","v":5},{"$f":"BF49+BG49","v":14},null,null,{"$f":"IF(ISNUMBER(BJ49),(VLOOKUP(BJ49,$BO$6:$BP$50,2)),0)","v":0},{"$f":"IF(BJ49<>\"\",5,0)","v":0},{"$f":"BK49+BL49","v":0},null,44,0,0,0,0,0,0,0,1,0]
[{"$f":"IF(E50<E49,BO50,A49)","v":45},"Valasjø","Henrik","Heming",{"$f":"IF(F50<=4,Q50,(Q50-SUM(SMALL(R50:Y50,{1;2;3;4}))))","v":13},{"$f":"(IF(AC50=5,1,0)+IF(AH50=5,1,0)+IF(AM50=5,1,0)+IF(AR50=5,1,0)+IF(AW50=5,1,0)+IF(BB50=5,1,0)+IF(BG50=5,1,0)+IF(BL50=5,1,0))","v":1},null,{"$f":"IF(AA50=\"\",\"\",AA50)","v":""},{"$f":"IF(AF50=\"\",\"\",AF50)","v":""},{"$f":"IF(AK50=\"\",\"\",AK50)","v":""},{"$f":"IF(AP50=\"\",\"\",AP50)","v":""},{"$f":"IF(AU50=\"\",\"\",AU50)","v":23},{"$f":"IF(AZ50=\"\",\"\",AZ50)","v":""},{"$f":"IF(BE50=\"\",\"\",BE50)","v":""},{"$f":"IF(BJ50=\"\",\"\",BJ50)","v":""},null,{"$f":"AD50+AI50+AN50+AS50+AX50+BC50+BH50","v":13},{"$f":"IF($F41>=5,IF(AB50=\"\",\"\",AB50),\"\")","v":""},{"$f":"IF($F41>=5,IF(AG50=\"\",\"\",AG50),\"\")","v":""},{"$f":"IF($F41>=5,IF(AL50=\"\",\"\",AL50),\"\")","v":""},{"$f":"IF($F41>=5,IF(AQ50=\"\",\"\",AQ50),\"\")","v":""},{"$f":"IF($F41>=5,IF(AR50=\"\",\"\",AR50),\"\")","v":""},{"$f":"IF($F41>=5,IF(AV50=\"\",\"\",AV50),\"\")","v":""},{"$f":"IF($F41>=5,IF(BA50=\"\",\"\",BA50),\"\")","v":""},{"$f":"IF($F41>=5,IF(BF50=\"\",\"\",BF50),\"\")","v":""},null,null,{"$f":"IF(ISNUMBER(AA50),(VLOOKUP(AA50,$BO$6:$BP$50,2)),0)","v":0},{"$f":"IF(AA50<>\"\",5,0)","v":0},{"$f":"AB50+AC50","v":0},null,null,{"$f":"IF(ISNUMBER(AF50),(VLOOKUP(AF50,$BO$6:$BP$50,2)),0)","v":0},{"$f":"IF(AF50<>\"\",5,0)","v":0},{"$f":"AG50+AH50","v":0},null,null,{"$f":"IF(ISNUMBER(AK50),(VLOOKUP(AK50,$BO$6:$BP$50,2)),0)","v":0},{"$f":"IF(AK50<>\"\",5,0)","v":0},{"$f":"AL50+AM50","v":0},null,null,{"$f":"IF(ISNUMBER(AP50),(VLOOKUP(AP50,$BO$6:$BP$50,2)),0)","v":0},{"$f":"IF(AP50<>\"\",5,0)","v":0},{"$f":"AQ50+AR50","v":0},null,23,{"$f":"IF(ISNUMBER(AU50),(VLOOKUP(AU50,$BO$6:$BP$50,2)),0)","v":8},{"$f":"IF(AU50<>\"\",5,0)","v":5},{"$f":"AV50+AW50","v":13},null,null,{"$f":"IF(ISNUMBER(AZ50),(VLOOKUP(AZ50,$BO$6:$BP$50,2)),0)","v":0},{"$f":"IF(AZ50<>\"\",5,0)","v":0},{"$f":"BA50+BB50","v":0},null,null,{"$f":"IF(ISNUMBER(BE50),(VLOOKUP(BE50,$BO$6:$BP$50,2)),0)","v":0},{"$f":"IF(BE50<>\"\",5,0)","v":0},{"$f":"BF50+BG50","v":0},null,null,{"$f":"IF(ISNUMBER(BJ50),(VLOOKUP(BJ50,$BO$6:$BP$50,2)),0)","v":0},{"$f":"IF(BJ50<>\"\",5,0)","v":0},{"$f":"BK50+BL50","v":0},null,45,0,0,0,0,0,0,0,1,0]
[{"$f":"IF(E51<E50,BO51,A50)","v":46},"Aulestad","Herman","Lørenskog",{"$f":"IF(F51<=4,Q51,(Q51-SUM(SMALL(R51:Y51,{1;2;3;4}))))","v":12},{"$f":"(IF(AC51=5,1,0)+IF(AH51=5,1,0)+IF(AM51=5,1,0)+IF(AR51=5,1,0)+IF(AW51=5,1,0)+IF(BB51=5,1,0)+IF(BG51=5,1,0)+IF(BL51=5,1,0))","v":1},null,{"$f":"IF(AA51=\"\",\"\",AA51)","v":""},{"$f":"IF(AF51=\"\",\"\",AF51)","v":""},{"$f":"IF(AK51=\"\",\"\",AK51)","v":""},{"$f":"IF(AP51=\"\",\"\",AP51)","v":""},{"$f":"IF(AU51=\"\",\"\",AU51)","v":""},{"$f":"IF(AZ51=\"\",\"\",AZ51)","v":24},{"$f":"IF(BE51=\"\",\"\",BE51)","v":""},{"$f":"IF(BJ51=\"\",\"\",BJ51)","v":""},null,{"$f":"AD51+AI51+AN51+AS51+AX51+BC51+BH51","v":12},{"$f":"IF($F42>=5,IF(AB51=\"\",\"\",AB51),\"\")","v":""},{"$f":"IF($F42>=5,IF(AG51=\"\",\"\",AG51),\"\")","v":""},{"$f":"IF($F42>=5,IF(AL51=\"\",\"\",AL51),\"\")","v":""},{"$f":"IF($F42>=5,IF(AQ51=\"\",\"\",AQ51),\"\")","v":""},{"$f":"IF($F42>=5,IF(AR51=\"\",\"\",AR51),\"\")","v":""},{"$f":"IF($F42>=5,IF(AV51=\"\",\"\",AV51),\"\")","v":""},{"$f":"IF($F42>=5,IF(BA51=\"\",\"\",BA51),\"\")","v":""},{"$f":"IF($F42>=5,IF(BF51=\"\",\"\",BF51),\"\")","v":""},null,null,{"$f":"IF(ISNUMBER(AA51),(VLOOKUP(AA51,$BO$6:$BP$50,2)),0)","v":0},{"$f":"IF(AA51<>\"\",5,0)","v":0},{"$f":"AB51+AC51","v":0},null,null,{"$f":"IF(ISNUMBER(AF51),(VLOOKUP(AF51,$BO$6:$BP$50,2)),0)","v":0},{"$f":"IF(AF51<>\"\",5,0)","v":0},{"$f":"AG51+AH51","v":0},null,null,{"$f":"IF(ISNUMBER(AK51),(VLOOKUP(AK51,$BO$6:$BP$50,2)),0)","v":0},{"$f":"IF(AK51<>\"\",5,0)","v":0},{"$f":"AL51+AM51","v":0},null,null,{"$f":"IF(ISNUMBER(AP51),(VLOOKUP(AP51,$BO$6:$BP$50,2)),0)","v":0},{"$f":"IF(AP51<>\"\",5,0)","v":0},{"$f":"AQ51+AR51","v":0},null,null,{"$f":"IF(ISNUMBER(AU51),(VLOOKUP(AU51,$BO$6:$BP$50,2)),0)","v":0},{"$f":"IF(AU51<>\"\",5,0)","v":0},{"$f":"AV51+AW51","v":0},null,24,{"$f":"IF(ISNUMBER(AZ51),(VLOOKUP(AZ51,$BO$6:$BP$50,2)),0)","v":7},{"$f":"IF(AZ51<>\"\",5,0)","v":5},{"$f":"BA51+BB51","v":12},null,null,{"$f":"IF(ISNUMBER(BE51),(VLOOKUP(BE51,$BO$6:$BP$50,2)),0)","v":0},{"$f":"IF(BE51<>\"\",5,0)","v":0},{"$f":"BF51+BG51","v":0},null,null,{"$f":"IF(ISNUMBER(BJ51),(VLOOKUP(BJ51,$BO$6:$BP$50,2)),0)","v":0},{"$f":"IF(BJ51<>\"\",5,0)","v":0},{"$f":"BK51+BL51","v":0},null,46,0,0,{"$f":"IF($F42=7,1,0)","v":0},0,0,0,0,1,0]
[{"$f":"IF(E52<E51,BO52,A51)","v":47},"Axelsen","Alfred","Kjelsås",{"$f":"IF(F52<=4,Q52,(Q52-SUM(SMALL(R52:Y52,{1;2;3;4}))))","v":5},{"$f":"(IF(AC52=5,1,0)+IF(AH52=5,1,0)+IF(AM52=5,1,0)+IF(AR52=5,1,0)+IF(AW52=5,1,0)+IF(BB52=5,1,0)+IF(BG52=5,1,0)+IF(BL52=5,1,0))","v":1},null,{"$f":"IF(AA52=\"\",\"\",AA52)","v":""},{"$f":"IF(AF52=\"\",\"\",AF52)","v":"dsq"},{"$f":"IF(AK52=\"\",\"\",AK52)","v":""},{"$f":"IF(AP52=\"\",\"\",AP52)","v":""},{"$f":"IF(AU52=\"\",\"\",AU52)","v":""},{"$f":"IF(AZ52=\"\",\"\",AZ52)","v":""},{"$f":"IF(BE52=\"\",\"\",BE52)","v":""},{"$f":"IF(BJ52=\"\",\"\",BJ52)","v":""},null,{"$f":"AD52+AI52+AN52+AS52+AX52+BC52+BH52","v":5},{"$f":"IF($F52>=5,IF(AB52=\"\",\"\",AB52),\"\")","v":""},{"$f":"IF($F52>=5,IF(AG52=\"\",\"\",AG52),\"\")","v":""},{"$f":"IF($F52>=5,IF(AL52=\"\",\"\",AL52),\"\")","v":""},{"$f":"IF($F52>=5,IF(AQ52=\"\",\"\",AQ52),\"\")","v":""},{"$f":"IF($F52>=5,IF(AV52=\"\",\"\",AV52),\"\")","v":""},{"$f":"IF($F52>=5,IF(BA52=\"\",\"\",BA52),\"\")","v":""},{"$f":"IF($F52>=5,IF(BF52=\"\",\"\",BF52),\"\")","v":""},{"$f":"IF($F52>=5,IF(BK52=\"\",\"\",BK52),\"\")","v":""},null,null,{"$f":"IF(ISNUMBER(AA52),(VLOOKUP(AA52,$BO$6:$BP$50,2)),0)","v":0},{"$f":"IF(AA52<>\"\",5,0)","v":0},{"$f":"AB52+AC52","v":0},null,"dsq",{"$f":"IF(ISNUMBER(AF52),(VLOOKUP(AF52,$BO$6:$BP$50,2)),0)","v":0},{"$f":"IF(AF52<>\"\",5,0)","v":5},{"$f":"AG52+AH52","v":5},null,null,{"$f":"IF(ISNUMBER(AK52),(VLOOKUP(AK52,$BO$6:$BP$50,2)),0)","v":0},{"$f":"IF(AK52<>\"\",5,0)","v":0},{"$f":"AL52+AM52","v":0},null,null,{"$f":"IF(ISNUMBER(AP52),(VLOOKUP(AP52,$BO$6:$BP$50,2)),0)","v":0},{"$f":"IF(AP52<>\"\",5,0)","v":0},{"$f":"AQ52+AR52","v":0},null,null,{"$f":"IF(ISNUMBER(AU52),(VLOOKUP(AU52,$BO$6:$BP$50,2)),0)","v":0},{"$f":"IF(AU52<>\"\",5,0)","v":0},{"$f":"AV52+AW52","v":0},null,null,{"$f":"IF(ISNUMBER(AZ52),(VLOOKUP(AZ52,$BO$6:$BP$50,2)),0)","v":0},{"$f":"IF(AZ52<>\"\",5,0)","v":0},{"$f":"BA52+BB52","v":0},null,null,{"$f":"IF(ISNUMBER(BE52),(VLOOKUP(BE52,$BO$6:$BP$50,2)),0)","v":0},{"$f":"IF(BE52<>\"\",5,0)","v":0},{"$f":"BF52+BG52","v":0},null,null,{"$f":"IF(ISNUMBER(BJ52),(VLOOKUP(BJ52,$BO$6:$BP$50,2)),0)","v":0},{"$f":"IF(BJ52<>\"\",5,0)","v":0},{"$f":"BK52+BL52","v":0},null,47,0,0,0,0,0,0,0,1,0]
[{"$f":"IF(E53<E52,BO53,A52)","v":47},"Skavik","Trym Skogheim","Heming",{"$f":"IF(F53<=4,Q53,(Q53-SUM(SMALL(R53:Y53,{1;2;3;4}))))","v":5},{"$f":"(IF(AC53=5,1,0)+IF(AH53=5,1,0)+IF(AM53=5,1,0)+IF(AR53=5,1,0)+IF(AW53=5,1,0)+IF(BB53=5,1,0)+IF(BG53=5,1,0)+IF(BL53=5,1,0))","v":1},null,{"$f":"IF(AA53=\"\",\"\",AA53)","v":""},{"$f":"IF(AF53=\"\",\"\",AF53)","v":""},{"$f":"IF(AK53=\"\",\"\",AK53)","v":""},{"$f":"IF(AP53=\"\",\"\",AP53)","v":""},{"$f":"IF(AU53=\"\",\"\",AU53)","v":"dnf"},{"$f":"IF(AZ53=\"\",\"\",AZ53)","v":""},{"$f":"IF(BE53=\"\",\"\",BE53)","v":""},{"$f":"IF(BJ53=\"\",\"\",BJ53)","v":""},null,{"$f":"AD53+AI53+AN53+AS53+AX53+BC53+BH53","v":5},{"$f":"IF($F53>=5,IF(AB53=\"\",\"\",AB53),\"\")","v":""},{"$f":"IF($F53>=5,IF(AG53=\"\",\"\",AG53),\"\")","v":""},{"$f":"IF($F53>=5,IF(AL53=\"\",\"\",AL53),\"\")","v":""},{"$f":"IF($F53>=5,IF(AQ53=\"\",\"\",AQ53),\"\")","v":""},{"$f":"IF($F53>=5,IF(AV53=\"\",\"\",AV53),\"\")","v":""},{"$f":"IF($F53>=5,IF(BA53=\"\",\"\",BA53),\"\")","v":""},{"$f":"IF($F53>=5,IF(BF53=\"\",\"\",BF53),\"\")","v":""},{"$f":"IF($F53>=5,IF(BK53=\"\",\"\",BK53),\"\")","v":""},null,null,{"$f":"IF(ISNUMBER(AA53),(VLOOKUP(AA53,$BO$6:$BP$50,2)),0)","v":0},{"$f":"IF(AA53<>\"\",5,0)","v":0},{"$f":"AB53+AC53","v":0},null,null,{"$f":"IF(ISNUMBER(AF53),(VLOOKUP(AF53,$BO$6:$BP$50,2)),0)","v":0},{"$f":"IF(AF53<>\"\",5,0)","v":0},{"$f":"AG53+AH53","v":0},null,null,{"$f":"IF(ISNUMBER(AK53),(VLOOKUP(AK53,$BO$6:$BP$50,2)),0)","v":0},{"$f":"IF(AK53<>\"\",5,0)","v":0},{"$f":"AL53+AM53","v":0},null,null,{"$f":"IF(ISNUMBER(AP53),(VLOOKUP(AP53,$BO$6:$BP$50,2)),0)","v":0},{"$f":"IF(AP53<>\"\",5,0)","v":0},{"$f":"AQ53+AR53","v":0},null,"dnf",{"$f":"IF(ISNUMBER(AU53),(VLOOKUP(AU53,$BO$6:$BP$50,2)),0)","v":0},{"$f":"IF(AU53<>\"\",5,0)","v":5},{"$f":"AV53+AW53","v":5},null,null,{"$f":"IF(ISNUMBER(AZ53),(VLOOKUP(AZ53,$BO$6:$BP$50,2)),0)","v":0},{"$f":"IF(AZ53<>\"\",5,0)","v":0},{"$f":"BA53+BB53","v":0},null,null,{"$f":"IF(ISNUMBER(BE53),(VLOOKUP(BE53,$BO$6:$BP$50,2)),0)","v":0},{"$f":"IF(BE53<>\"\",5,0)","v":0},{"$f":"BF53+BG53","v":0},null,null,{"$f":"IF(ISNUMBER(BJ53),(VLOOKUP(BJ53,$BO$6:$BP$50,2)),0)","v":0},{"$f":"IF(BJ53<>\"\",5,0)","v":0},{"$f":"BK53+BL53","v":0},null,48,0]

{"sheet":"J12 2018","index":3,"n_rows":72,"n_cols":76,"rows_kept":72,"cut":false,"hidden":false,"merged":[[0,42,0,45],[2,26,2,29],[2,31,2,34],[2,36,2,39],[2,41,2,44],[3,62,3,64],[4,7,4,14],[4,17,4,24],[2,51,2,54],[2,56,2,59],[2,61,2,64],[3,27,3,29],[3,32,3,34],[3,37,3,39],[3,42,3,44],[3,47,3,49],[3,52,3,54],[3,57,3,59],[2,46,2,49]]}
["Resultatliste Oslo Cup 2018 - Jenter 12 år"]
[{"$f":"'Forside 2018'!A2","v":"Etter 7 av 8 renn"}]
[null,null,null,null,null,null,null,"IRS Rennet","Ljan Rennet","Njård Rennet","Ready Rennet","Telenor Arena Cup","Euro-tecfarten","Oslo Alpinfestival SL","Oslo Alpinfestival SSL",null,null,"IRS Rennet","Ljan Rennet","Njård Rennet","Ready Rennet","Telenor Arena Cup","Euro-tecfarten","Oslo Alpinfestival SL","Oslo Alpinfestival SSL",null,"--------IRS Rennet----------",null,null,null,null,"----------Ljan Rennet---------",null,null,null,null,"--------Njård Rennet----------",null,null,null,null,"--------Ready Rennet---------",null,null,null,null,"-----Telenor Arena Cup----",null,null,null,null,"------Euro-tecfarten--------",null,null,null,null,"---Oslo Alpinfestival SL---",null,null,null,null,"---Oslo Alpinfestival SSL---"]
[null,null,null,null,null,"Antall",null,"2018-02-03","2018-02-04","2018-02-10","2018-02-11","2018-02-14","2018-02-28","2018-03-03","2018-03-04",null,"Poeng","2018-02-03","2018-02-04","2018-02-10","2018-02-11","2018-02-14","2018-02-28","2018-03-03","2018-03-04",null,null,"--------Poeng--------",null,null,null,null,"--------Poeng--------",null,null,null,null,"-------Poeng---------",null,null,null,null,"-------Poeng---------",null,null,null,null,"-------Poeng---------",null,null,null,null,"-------Poeng---------",null,null,null,null,"-------Poeng---------",null,null,null,null,"-------Poeng---------",null,null,null,null,null,"Løpere med ","Løpere med ","Løpere med ","Løpere med ","Løpere med ","Løpere med ","Løpere med ","Løpere med "]
["Plass","Etternavn","Fornavn","Klubb","Poeng","renn",null,"------------------------------Plassering i rennene---------------------------------",null,null,null,null,null,null,null,null,"brutto","----------------Resultatpoeng hvis mer enn 4 renn----------------",null,null,null,null,null,null,null,null,"Plass","Res.","Del.","Tot.",null,"Plass","Res.","Del.","Tot.",null,"Plass","Res.","Del.","Tot.",null,"Plass","Res.","Del.","Tot.",null,"Plass","Res.","Del.","Tot.",null,"Plass","Res.","Del.","Tot.",null,"Plass","Res.","Del.","Tot.",null,"Plass","Res.","Del.","Tot.",null,"Plass","Poeng","8 renn","7 renn","6 renn","5 renn","4 renn","3 renn","2 renn","kun 1 renn"]
[{"$f":"IF(E6<E5,BO6,A5)","v":1},"Frederiksen","Charlotte C L","Ready",{"$f":"IF(F6<=4,Q6,(Q6-SUM(SMALL(R6:Y6,{1;2;3;4}))))","v":375},{"$f":"(IF(AC6=5,1,0)+IF(AH6=5,1,0)+IF(AM6=5,1,0)+IF(AR6=5,1,0)+IF(AW6=5,1,0)+IF(BB6=5,1,0)+IF(BG6=5,1,0)+IF(BL6=5,1,0))","v":7},null,{"$f":"IF(AA6=\"\",\"\",AA6)","v":2},{"$f":"IF(AF6=\"\",\"\",AF6)","v":3},{"$f":"IF(AK6=\"\",\"\",AK6)","v":2},{"$f":"IF(AP6=\"\",\"\",AP6)","v":2},{"$f":"IF(AU6=\"\",\"\",AU6)","v":1},{"$f":"IF(AZ6=\"\",\"\",AZ6)","v":5},{"$f":"IF(BE6=\"\",\"\",BE6)","v":"dsq"},{"$f":"IF(BJ6=\"\",\"\",BJ6)","v":""},null,{"$f":"AD6+AI6+AN6+AS6+AX6+BC6+BH6","v":480},{"$f":"IF($F6>=5,IF(AB6=\"\",\"\",AB6),\"\")","v":80},{"$f":"IF($F6>=5,IF(AG6=\"\",\"\",AG6),\"\")","v":60},{"$f":"IF($F6>=5,IF(AL6=\"\",\"\",AL6),\"\")","v":80},{"$f":"IF($F6>=5,IF(AQ6=\"\",\"\",AQ6),\"\")","v":80},{"$f":"IF($F6>=5,IF(AV6=\"\",\"\",AV6),\"\")","v":100},{"$f":"IF($F6>=5,IF(BA6=\"\",\"\",BA6),\"\")","v":45},{"$f":"IF($F6>=5,IF(BF6=\"\",\"\",BF6),\"\")","v":0},{"$f":"IF($F6>=5,IF(BK6=\"\",\"\",BK6),\"\")","v":0},null,2,{"$f":"IF(ISNUMBER(AA6),(VLOOKUP(AA6,$BO$6:$BP$50,2)),0)","v":80},{"$f":"IF(AA6<>\"\",5,0)","v":5},{"$f":"AB6+AC6","v":85},null,3,{"$f":"IF(ISNUMBER(AF6),(VLOOKUP(AF6,$BO$6:$BP$50,2)),0)","v":60},{"$f":"IF(AF6<>\"\",5,0)","v":5},{"$f":"AG6+AH6","v":65},null,2,{"$f":"IF(ISNUMBER(AK6),(VLOOKUP(AK6,$BO$6:$BP$50,2)),0)","v":80},{"$f":"IF(AK6<>\"\",5,0)","v":5},{"$f":"AL6+AM6","v":85},null,2,{"$f":"IF(ISNUMBER(AP6),(VLOOKUP(AP6,$BO$6:$BP$50,2)),0)","v":80},{"$f":"IF(AP6<>\"\",5,0)","v":5},{"$f":"AQ6+AR6","v":85},null,1,{"$f":"IF(ISNUMBER(AU6),(VLOOKUP(AU6,$BO$6:$BP$50,2)),0)","v":100},{"$f":"IF(AU6<>\"\",5,0)","v":5},{"$f":"AV6+AW6","v":105},null,5,{"$f":"IF(ISNUMBER(AZ6),(VLOOKUP(AZ6,$BO$6:$BP$50,2)),0)","v":45},{"$f":"IF(AZ6<>\"\",5,0)","v":5},{"$f":"BA6+BB6","v":50},null,"dsq",{"$f":"IF(ISNUMBER(BE6),(VLOOKUP(BE6,$BO$6:$BP$50,2)),0)","v":0},{"$f":"IF(BE6<>\"\",5,0)","v":5},{"$f":"BF6+BG6","v":5},null,null,{"$f":"IF(ISNUMBER(BJ6),(VLOOKUP(BJ6,$BO$6:$BP$50,2)),0)","v":0},{"$f":"IF(BJ6<>\"\",5,0)","v":0},{"$f":"BK6+BL6","v":0},null,1,100,{"$f":"IF($F6=8,1,0)","v":0},{"$f":"IF($F6=7,1,0)","v":1},{"$f":"IF($F6=6,1,0)","v":0},{"$f":"IF($F6=5,1,0)","v":0},{"$f":"IF($F6=4,1,0)","v":0},{"$f":"IF($F6=3,1,0)","v":0},{"$f":"IF($F6=2,1,0)","v":0},{"$f":"IF($F6=1,1,0)","v":0}]
[{"$f":"IF(E7<E6,BO7,A6)","v":1},"Rasmussen","Cornelia Nystrøm","Heming",{"$f":"IF(F7<=4,Q7,(Q7-SUM(SMALL(R7:Y7,{1;2;3;4}))))","v":375},{"$f":"(IF(AC7=5,1,0)+IF(AH7=5,1,0)+IF(AM7=5,1,0)+IF(AR7=5,1,0)+IF(AW7=5,1,0)+IF(BB7=5,1,0)+IF(BG7=5,1,0)+IF(BL7=5,1,0))","v":7},null,{"$f":"IF(AA7=\"\",\"\",AA7)","v":4},{"$f":"IF(AF7=\"\",\"\",AF7)","v":2},{"$f":"IF(AK7=\"\",\"\",AK7)","v":3},{"$f":"IF(AP7=\"\",\"\",AP7)","v":1},{"$f":"IF(AU7=\"\",\"\",AU7)","v":4},{"$f":"IF(AZ7=\"\",\"\",AZ7)","v":1},{"$f":"IF(BE7=\"\",\"\",BE7)","v":16},{"$f":"IF(BJ7=\"\",\"\",BJ7)","v":""},null,{"$f":"AD7+AI7+AN7+AS7+AX7+BC7+BH7","v":490},{"$f":"IF($F7>=5,IF(AB7=\"\",\"\",AB7),\"\")","v":50},{"$f":"IF($F7>=5,IF(AG7=\"\",\"\",AG7),\"\")","v":80},{"$f":"IF($F7>=5,IF(AL7=\"\",\"\",AL7),\"\")","v":60},{"$f":"IF($F7>=5,IF(AQ7=\"\",\"\",AQ7),\"\")","v":100},{"$f":"IF($F7>=5,IF(AV7=\"\",\"\",AV7),\"\")","v":50},{"$f":"IF($F7>=5,IF(BA7=\"\",\"\",BA7),\"\")","v":100},{"$f":"IF($F7>=5,IF(BF7=\"\",\"\",BF7),\"\")","v":15},{"$f":"IF($F7>=5,IF(BK7=\"\",\"\",BK7),\"\")","v":0},null,4,{"$f":"IF(ISNUMBER(AA7),(VLOOKUP(AA7,$BO$6:$BP$50,2)),0)","v":50},{"$f":"IF(AA7<>\"\",5,0)","v":5},{"$f":"AB7+AC7","v":55},null,2,{"$f":"IF(ISNUMBER(AF7),(VLOOKUP(AF7,$BO$6:$BP$50,2)),0)","v":80},{"$f":"IF(AF7<>\"\",5,0)","v":5},{"$f":"AG7+AH7","v":85},null,3,{"$f":"IF(ISNUMBER(AK7),(VLOOKUP(AK7,$BO$6:$BP$50,2)),0)","v":60},{"$f":"IF(AK7<>\"\",5,0)","v":5},{"$f":"AL7+AM7","v":65},null,1,{"$f":"IF(ISNUMBER(AP7),(VLOOKUP(AP7,$BO$6:$BP$50,2)),0)","v":100},{"$f":"IF(AP7<>\"\",5,0)","v":5},{"$f":"AQ7+AR7","v":105},null,4,{"$f":"IF(ISNUMBER(AU7),(VLOOKUP(AU7,$BO$6:$BP$50,2)),0)","v":50},{"$f":"IF(AU7<>\"\",5,0)","v":5},{"$f":"AV7+AW7","v":55},null,1,{"$f":"IF(ISNUMBER(AZ7),(VLOOKUP(AZ7,$BO$6:$BP$50,2)),0)","v":100},{"$f":"IF(AZ7<>\"\",5,0)","v":5},{"$f":"BA7+BB7","v":105},null,16,{"$f":"IF(ISNUMBER(BE7),(VLOOKUP(BE7,$BO$6:$BP$50,2)),0)","v":15},{"$f":"IF(BE7<>\"\",5,0)","v":5},{"$f":"BF7+BG7","v":20},null,null,{"$f":"IF(ISNUMBER(BJ7),(VLOOKUP(BJ7,$BO$6:$BP$50,2)),0)","v":0},{"$f":"IF(BJ7<>\"\",5,0)","v":0},{"$f":"BK7+BL7","v":0},null,2,80,{"$f":"IF($F7=8,1,0)","v":0},1,0,0,0,0,0,0]
[{"$f":"IF(E8<E7,BO8,A7)","v":3},"Rasmussen","Maisen Holst","Stabæk",{"$f":"IF(F8<=4,Q8,(Q8-SUM(SMALL(R8:Y8,{1;2;3;4}))))","v":365},{"$f":"(IF(AC8=5,1,0)+IF(AH8=5,1,0)+IF(AM8=5,1,0)+IF(AR8=5,1,0)+IF(AW8=5,1,0)+IF(BB8=5,1,0)+IF(BG8=5,1,0)+IF(BL8=5,1,0))","v":5},null,{"$f":"IF(AA8=\"\",\"\",AA8)","v":1},{"$f":"IF(AF8=\"\",\"\",AF8)","v":"dsq"},{"$f":"IF(AK8=\"\",\"\",AK8)","v":1},{"$f":"IF(AP8=\"\",\"\",AP8)","v":""},{"$f":"IF(AU8=\"\",\"\",AU8)","v":3},{"$f":"IF(AZ8=\"\",\"\",AZ8)","v":2},{"$f":"IF(BE8=\"\",\"\",BE8)","v":""},{"$f":"IF(BJ8=\"\",\"\",BJ8)","v":""},null,{"$f":"AD8+AI8+AN8+AS8+AX8+BC8+BH8","v":365},{"$f":"IF($F8>=5,IF(AB8=\"\",\"\",AB8),\"\")","v":100},{"$f":"IF($F8>=5,IF(AG8=\"\",\"\",AG8),\"\")","v":0},{"$f":"IF($F8>=5,IF(AL8=\"\",\"\",AL8),\"\")","v":100},{"$f":"IF($F8>=5,IF(AQ8=\"\",\"\",AQ8),\"\")","v":0},{"$f":"IF($F8>=5,IF(AV8=\"\",\"\",AV8),\"\")","v":60},{"$f":"IF($F8>=5,IF(BA8=\"\",\"\",BA8),\"\")","v":80},{"$f":"IF($F8>=5,IF(BF8=\"\",\"\",BF8),\"\")","v":0},{"$f":"IF($F8>=5,IF(BK8=\"\",\"\",BK8),\"\")","v":0},null,1,{"$f":"IF(ISNUMBER(AA8),(VLOOKUP(AA8,$BO$6:$BP$50,2)),0)","v":100},{"$f":"IF(AA8<>\"\",5,0)","v":5},{"$f":"AB8+AC8","v":105},null,"dsq",{"$f":"IF(ISNUMBER(AF8),(VLOOKUP(AF8,$BO$6:$BP$50,2)),0)","v":0},{"$f":"IF(AF8<>\"\",5,0)","v":5},{"$f":"AG8+AH8","v":5},null,1,{"$f":"IF(ISNUMBER(AK8),(VLOOKUP(AK8,$BO$6:$BP$50,2)),0)","v":100},{"$f":"IF(AK8<>\"\",5,0)","v":5},{"$f":"AL8+AM8","v":105},null,null,{"$f":"IF(ISNUMBER(AP8),(VLOOKUP(AP8,$BO$6:$BP$50,2)),0)","v":0},{"$f":"IF(AP8<>\"\",5,0)","v":0},{"$f":"AQ8+AR8","v":0},null,3,{"$f":"IF(ISNUMBER(AU8),(VLOOKUP(AU8,$BO$6:$BP$50,2)),0)","v":60},{"$f":"IF(AU8<>\"\",5,0)","v":5},{"$f":"AV8+AW8","v":65},null,2,{"$f":"IF(ISNUMBER(AZ8),(VLOOKUP(AZ8,$BO$6:$BP$50,2)),0)","v":80},{"$f":"IF(AZ8<>\"\",5,0)","v":5},{"$f":"BA8+BB8","v":85},null,null,{"$f":"IF(ISNUMBER(BE8),(VLOOKUP(BE8,$BO$6:$BP$50,2)),0)","v":0},{"$f":"IF(BE8<>\"\",5,0)","v":0},{"$f":"BF8+BG8","v":0},null,null,{"$f":"IF(ISNUMBER(BJ8),(VLOOKUP(BJ8,$BO$6:$BP$50,2)),0)","v":0},{"$f":"IF(BJ8<>\"\",5,0)","v":0},{"$f":"BK8+BL8","v":0},null,3,60,0,0,0,1,0,0,0,0]
[{"$f":"IF(E9<E8,BO9,A8)","v":4},"Finn-Hansen","Nora","Heming",{"$f":"IF(F9<=4,Q9,(Q9-SUM(SMALL(R9:Y9,{1;2;3;4}))))","v":325},{"$f":"(IF(AC9=5,1,0)+IF(AH9=5,1,0)+IF(AM9=5,1,0)+IF(AR9=5,1,0)+IF(AW9=5,1,0)+IF(BB9=5,1,0)+IF(BG9=5,1,0)+IF(BL9=5,1,0))","v":7},null,{"$f":"IF(AA9=\"\",\"\",AA9)","v":3},{"$f":"IF(AF9=\"\",\"\",AF9)","v":4},{"$f":"IF(AK9=\"\",\"\",AK9)","v":4},{"$f":"IF(AP9=\"\",\"\",AP9)","v":4},{"$f":"IF(AU9=\"\",\"\",AU9)","v":7},{"$f":"IF(AZ9=\"\",\"\",AZ9)","v":2},{"$f":"IF(BE9=\"\",\"\",BE9)","v":1},{"$f":"IF(BJ9=\"\",\"\",BJ9)","v":""},null,{"$f":"AD9+AI9+AN9+AS9+AX9+BC9+BH9","v":461},{"$f":"IF($F9>=5,IF(AB9=\"\",\"\",AB9),\"\")","v":60},{"$f":"IF($F9>=5,IF(AG9=\"\",\"\",AG9),\"\")","v":50},{"$f":"IF($F9>=5,IF(AL9=\"\",\"\",AL9),\"\")","v":50},{"$f":"IF($F9>=5,IF(AQ9=\"\",\"\",AQ9),\"\")","v":50},{"$f":"IF($F9>=5,IF(AV9=\"\",\"\",AV9),\"\")","v":36},{"$f":"IF($F9>=5,IF(BA9=\"\",\"\",BA9),\"\")","v":80},{"$f":"IF($F9>=5,IF(BF9=\"\",\"\",BF9),\"\")","v":100},{"$f":"IF($F9>=5,IF(BK9=\"\",\"\",BK9),\"\")","v":0},null,3,{"$f":"IF(ISNUMBER(AA9),(VLOOKUP(AA9,$BO$6:$BP$50,2)),0)","v":60},{"$f":"IF(AA9<>\"\",5,0)","v":5},{"$f":"AB9+AC9","v":65},null,4,{"$f":"IF(ISNUMBER(AF9),(VLOOKUP(AF9,$BO$6:$BP$50,2)),0)","v":50},{"$f":"IF(AF9<>\"\",5,0)","v":5},{"$f":"AG9+AH9","v":55},null,4,{"$f":"IF(ISNUMBER(AK9),(VLOOKUP(AK9,$BO$6:$BP$50,2)),0)","v":50},{"$f":"IF(AK9<>\"\",5,0)","v":5},{"$f":"AL9+AM9","v":55},null,4,{"$f":"IF(ISNUMBER(AP9),(VLOOKUP(AP9,$BO$6:$BP$50,2)),0)","v":50},{"$f":"IF(AP9<>\"\",5,0)","v":5},{"$f":"AQ9+AR9","v":55},null,7,{"$f":"IF(ISNUMBER(AU9),(VLOOKUP(AU9,$BO$6:$BP$50,2)),0)","v":36},{"$f":"IF(AU9<>\"\",5,0)","v":5},{"$f":"AV9+AW9","v":41},null,2,{"$f":"IF(ISNUMBER(AZ9),(VLOOKUP(AZ9,$BO$6:$BP$50,2)),0)","v":80},{"$f":"IF(AZ9<>\"\",5,0)","v":5},{"$f":"BA9+BB9","v":85},null,1,{"$f":"IF(ISNUMBER(BE9),(VLOOKUP(BE9,$BO$6:$BP$50,2)),0)","v":100},{"$f":"IF(BE9<>\"\",5,0)","v":5},{"$f":"BF9+BG9","v":105},null,null,{"$f":"IF(ISNUMBER(BJ9),(VLOOKUP(BJ9,$BO$6:$BP$50,2)),0)","v":0},{"$f":"IF(BJ9<>\"\",5,0)","v":0},{"$f":"BK9+BL9","v":0},null,4,50,0,1,0,0,0,0,0,0]
[{"$f":"IF(E10<E9,BO10,A9)","v":5},"Wessel-aas","camilla","Heming",{"$f":"IF(F10<=4,Q10,(Q10-SUM(SMALL(R10:Y10,{1;2;3;4}))))","v":255},{"$f":"(IF(AC10=5,1,0)+IF(AH10=5,1,0)+IF(AM10=5,1,0)+IF(AR10=5,1,0)+IF(AW10=5,1,0)+IF(BB10=5,1,0)+IF(BG10=5,1,0)+IF(BL10=5,1,0))","v":5},null,{"$f":"IF(AA10=\"\",\"\",AA10)","v":5},{"$f":"IF(AF10=\"\",\"\",AF10)","v":1},{"$f":"IF(AK10=\"\",\"\",AK10)","v":8},{"$f":"IF(AP10=\"\",\"\",AP10)","v":5},{"$f":"IF(AU10=\"\",\"\",AU10)","v":6},{"$f":"IF(AZ10=\"\",\"\",AZ10)","v":""},{"$f":"IF(BE10=\"\",\"\",BE10)","v":""},{"$f":"IF(BJ10=\"\",\"\",BJ10)","v":""},null,{"$f":"AD10+AI10+AN10+AS10+AX10+BC10+BH10","v":287},{"$f":"IF($F10>=5,IF(AB10=\"\",\"\",AB10),\"\")","v":45},{"$f":"IF($F10>=5,IF(AG10=\"\",\"\",AG10),\"\")","v":100},{"$f":"IF($F10>=5,IF(AL10=\"\",\"\",AL10),\"\")","v":32},{"$f":"IF($F10>=5,IF(AQ10=\"\",\"\",AQ10),\"\")","v":45},{"$f":"IF($F10>=5,IF(AV10=\"\",\"\",AV10),\"\")","v":40},{"$f":"IF($F10>=5,IF(BA10=\"\",\"\",BA10),\"\")","v":0},{"$f":"IF($F10>=5,IF(BF10=\"\",\"\",BF10),\"\")","v":0},{"$f":"IF($F10>=5,IF(BK10=\"\",\"\",BK10),\"\")","v":0},null,5,{"$f":"IF(ISNUMBER(AA10),(VLOOKUP(AA10,$BO$6:$BP$50,2)),0)","v":45},{"$f":"IF(AA10<>\"\",5,0)","v":5},{"$f":"AB10+AC10","v":50},null,1,{"$f":"IF(ISNUMBER(AF10),(VLOOKUP(AF10,$BO$6:$BP$50,2)),0)","v":100},{"$f":"IF(AF10<>\"\",5,0)","v":5},{"$f":"AG10+AH10","v":105},null,8,{"$f":"IF(ISNUMBER(AK10),(VLOOKUP(AK10,$BO$6:$BP$50,2)),0)","v":32},{"$f":"IF(AK10<>\"\",5,0)","v":5},{"$f":"AL10+AM10","v":37},null,5,{"$f":"IF(ISNUMBER(AP10),(VLOOKUP(AP10,$BO$6:$BP$50,2)),0)","v":45},{"$f":"IF(AP10<>\"\",5,0)","v":5},{"$f":"AQ10+AR10","v":50},null,6,{"$f":"IF(ISNUMBER(AU10),(VLOOKUP(AU10,$BO$6:$BP$50,2)),0)","v":40},{"$f":"IF(AU10<>\"\",5,0)","v":5},{"$f":"AV10+AW10","v":45},null,null,{"$f":"IF(ISNUMBER(AZ10),(VLOOKUP(AZ10,$BO$6:$BP$50,2)),0)","v":0},{"$f":"IF(AZ10<>\"\",5,0)","v":0},{"$f":"BA10+BB10","v":0},null,null,{"$f":"IF(ISNUMBER(BE10),(VLOOKUP(BE10,$BO$6:$BP$50,2)),0)","v":0},{"$f":"IF(BE10<>\"\",5,0)","v":0},{"$f":"BF10+BG10","v":0},null,null,{"$f":"IF(ISNUMBER(BJ10),(VLOOKUP(BJ10,$BO$6:$BP$50,2)),0)","v":0},{"$f":"IF(BJ10<>\"\",5,0)","v":0},{"$f":"BK10+BL10","v":0},null,5,45,0,0,0,1,0,0,0,0]
[{"$f":"IF(E11<E10,BO11,A10)","v":6},"Hoel","Hermine Owesen","Heming",{"$f":"IF(F11<=4,Q11,(Q11-SUM(SMALL(R11:Y11,{1;2;3;4}))))","v":231},{"$f":"(IF(AC11=5,1,0)+IF(AH11=5,1,0)+IF(AM11=5,1,0)+IF(AR11=5,1,0)+IF(AW11=5,1,0)+IF(BB11=5,1,0)+IF(BG11=5,1,0)+IF(BL11=5,1,0))","v":5},null,{"$f":"IF(AA11=\"\",\"\",AA11)","v":7},{"$f":"IF(AF11=\"\",\"\",AF11)","v":7},{"$f":"IF(AK11=\"\",\"\",AK11)","v":5},{"$f":"IF(AP11=\"\",\"\",AP11)","v":""},{"$f":"IF(AU11=\"\",\"\",AU11)","v":5},{"$f":"IF(AZ11=\"\",\"\",AZ11)","v":""},{"$f":"IF(BE11=\"\",\"\",BE11)","v":2},{"$f":"IF(BJ11=\"\",\"\",BJ11)","v":""},null,{"$f":"AD11+AI11+AN11+AS11+AX11+BC11+BH11","v":267},{"$f":"IF($F11>=5,IF(AB11=\"\",\"\",AB11),\"\")","v":36},{"$f":"IF($F11>=5,IF(AG11=\"\",\"\",AG11),\"\")","v":36},{"$f":"IF($F11>=5,IF(AL11=\"\",\"\",AL11),\"\")","v":45},{"$f":"IF($F11>=5,IF(AQ11=\"\",\"\",AQ11),\"\")","v":0},{"$f":"IF($F11>=5,IF(AV11=\"\",\"\",AV11),\"\")","v":45},{"$f":"IF($F11>=5,IF(BA11=\"\",\"\",BA11),\"\")","v":0},{"$f":"IF($F11>=5,IF(BF11=\"\",\"\",BF11),\"\")","v":80},{"$f":"IF($F11>=5,IF(BK11=\"\",\"\",BK11),\"\")","v":0},null,7,{"$f":"IF(ISNUMBER(AA11),(VLOOKUP(AA11,$BO$6:$BP$50,2)),0)","v":36},{"$f":"IF(AA11<>\"\",5,0)","v":5},{"$f":"AB11+AC11","v":41},null,7,{"$f":"IF(ISNUMBER(AF11),(VLOOKUP(AF11,$BO$6:$BP$50,2)),0)","v":36},{"$f":"IF(AF11<>\"\",5,0)","v":5},{"$f":"AG11+AH11","v":41},null,5,{"$f":"IF(ISNUMBER(AK11),(VLOOKUP(AK11,$BO$6:$BP$50,2)),0)","v":45},{"$f":"IF(AK11<>\"\",5,0)","v":5},{"$f":"AL11+AM11","v":50},null,null,{"$f":"IF(ISNUMBER(AP11),(VLOOKUP(AP11,$BO$6:$BP$50,2)),0)","v":0},{"$f":"IF(AP11<>\"\",5,0)","v":0},{"$f":"AQ11+AR11","v":0},null,5,{"$f":"IF(ISNUMBER(AU11),(VLOOKUP(AU11,$BO$6:$BP$50,2)),0)","v":45},{"$f":"IF(AU11<>\"\",5,0)","v":5},{"$f":"AV11+AW11","v":50},null,null,{"$f":"IF(ISNUMBER(AZ11),(VLOOKUP(AZ11,$BO$6:$BP$50,2)),0)","v":0},{"$f":"IF(AZ11<>\"\",5,0)","v":0},{"$f":"BA11+BB11","v":0},null,2,{"$f":"IF(ISNUMBER(BE11),(VLOOKUP(BE11,$BO$6:$BP$50,2)),0)","v":80},{"$f":"IF(BE11<>\"\",5,0)","v":5},{"$f":"BF11+BG11","v":85},null,null,{"$f":"IF(ISNUMBER(BJ11),(VLOOKUP(BJ11,$BO$6:$BP$50,2)),0)","v":0},{"$f":"IF(BJ11<>\"\",5,0)","v":0},{"$f":"BK11+BL11","v":0},null,6,40,0,0,0,1,0,0,0,0]
[{"$f":"IF(E12<E11,BO12,A11)","v":7},"Aandahl","Nicola Alexandra","Ready",{"$f":"IF(F12<=4,Q12,(Q12-SUM(SMALL(R12:Y12,{1;2;3;4}))))","v":230},{"$f":"(IF(AC12=5,1,0)+IF(AH12=5,1,0)+IF(AM12=5,1,0)+IF(AR12=5,1,0)+IF(AW12=5,1,0)+IF(BB12=5,1,0)+IF(BG12=5,1,0)+IF(BL12=5,1,0))","v":7},null,{"$f":"IF(AA12=\"\",\"\",AA12)","v":9},{"$f":"IF(AF12=\"\",\"\",AF12)","v":5},{"$f":"IF(AK12=\"\",\"\",AK12)","v":6},{"$f":"IF(AP12=\"\",\"\",AP12)","v":3},{"$f":"IF(AU12=\"\",\"\",AU12)","v":30},{"$f":"IF(AZ12=\"\",\"\",AZ12)","v":8},{"$f":"IF(BE12=\"\",\"\",BE12)","v":4},{"$f":"IF(BJ12=\"\",\"\",BJ12)","v":""},null,{"$f":"AD12+AI12+AN12+AS12+AX12+BC12+BH12","v":292},{"$f":"IF($F12>=5,IF(AB12=\"\",\"\",AB12),\"\")","v":29},{"$f":"IF($F12>=5,IF(AG12=\"\",\"\",AG12),\"\")","v":45},{"$f":"IF($F12>=5,IF(AL12=\"\",\"\",AL12),\"\")","v":40},{"$f":"IF($F12>=5,IF(AQ12=\"\",\"\",AQ12),\"\")","v":60},{"$f":"IF($F12>=5,IF(AV12=\"\",\"\",AV12),\"\")","v":1},{"$f":"IF($F12>=5,IF(BA12=\"\",\"\",BA12),\"\")","v":32},{"$f":"IF($F12>=5,IF(BF12=\"\",\"\",BF12),\"\")","v":50},{"$f":"IF($F12>=5,IF(BK12=\"\",\"\",BK12),\"\")","v":0},null,9,{"$f":"IF(ISNUMBER(AA12),(VLOOKUP(AA12,$BO$6:$BP$50,2)),0)","v":29},{"$f":"IF(AA12<>\"\",5,0)","v":5},{"$f":"AB12+AC12","v":34},null,5,{"$f":"IF(ISNUMBER(AF12),(VLOOKUP(AF12,$BO$6:$BP$50,2)),0)","v":45},{"$f":"IF(AF12<>\"\",5,0)","v":5},{"$f":"AG12+AH12","v":50},null,6,{"$f":"IF(ISNUMBER(AK12),(VLOOKUP(AK12,$BO$6:$BP$50,2)),0)","v":40},{"$f":"IF(AK12<>\"\",5,0)","v":5},{"$f":"AL12+AM12","v":45},null,3,{"$f":"IF(ISNUMBER(AP12),(VLOOKUP(AP12,$BO$6:$BP$50,2)),0)","v":60},{"$f":"IF(AP12<>\"\",5,0)","v":5},{"$f":"AQ12+AR12","v":65},null,30,{"$f":"IF(ISNUMBER(AU12),(VLOOKUP(AU12,$BO$6:$BP$50,2)),0)","v":1},{"$f":"IF(AU12<>\"\",5,0)","v":5},{"$f":"AV12+AW12","v":6},null,8,{"$f":"IF(ISNUMBER(AZ12),(VLOOKUP(AZ12,$BO$6:$BP$50,2)),0)","v":32},{"$f":"IF(AZ12<>\"\",5,0)","v":5},{"$f":"BA12+BB12","v":37},null,4,{"$f":"IF(ISNUMBER(BE12),(VLOOKUP(BE12,$BO$6:$BP$50,2)),0)","v":50},{"$f":"IF(BE12<>\"\",5,0)","v":5},{"$f":"BF12+BG12","v":55},null,null,{"$f":"IF(ISNUMBER(BJ12),(VLOOKUP(BJ12,$BO$6:$BP$50,2)),0)","v":0},{"$f":"IF(BJ12<>\"\",5,0)","v":0},{"$f":"BK12+BL12","v":0},null,7,36,0,1,0,0,0,0,0,0]
[{"$f":"IF(E13<E12,BO13,A12)","v":8},"Thorsby","Pernille","Heming",{"$f":"IF(F13<=4,Q13,(Q13-SUM(SMALL(R13:Y13,{1;2;3;4}))))","v":163},{"$f":"(IF(AC13=5,1,0)+IF(AH13=5,1,0)+IF(AM13=5,1,0)+IF(AR13=5,1,0)+IF(AW13=5,1,0)+IF(BB13=5,1,0)+IF(BG13=5,1,0)+IF(BL13=5,1,0))","v":5},null,{"$f":"IF(AA13=\"\",\"\",AA13)","v":6},{"$f":"IF(AF13=\"\",\"\",AF13)","v":9},{"$f":"IF(AK13=\"\",\"\",AK13)","v":9},{"$f":"IF(AP13=\"\",\"\",AP13)","v":6},{"$f":"IF(AU13=\"\",\"\",AU13)","v":9},{"$f":"IF(AZ13=\"\",\"\",AZ13)","v":""},{"$f":"IF(BE13=\"\",\"\",BE13)","v":""},{"$f":"IF(BJ13=\"\",\"\",BJ13)","v":""},null,{"$f":"AD13+AI13+AN13+AS13+AX13+BC13+BH13","v":192},{"$f":"IF($F13>=5,IF(AB13=\"\",\"\",AB13),\"\")","v":40},{"$f":"IF($F13>=5,IF(AG13=\"\",\"\",AG13),\"\")","v":29},{"$f":"IF($F13>=5,IF(AL13=\"\",\"\",AL13),\"\")","v":29},{"$f":"IF($F13>=5,IF(AQ13=\"\",\"\",AQ13),\"\")","v":40},{"$f":"IF($F13>=5,IF(AV13=\"\",\"\",AV13),\"\")","v":29},{"$f":"IF($F13>=5,IF(BA13=\"\",\"\",BA13),\"\")","v":0},{"$f":"IF($F13>=5,IF(BF13=\"\",\"\",BF13),\"\")","v":0},{"$f":"IF($F13>=5,IF(BK13=\"\",\"\",BK13),\"\")","v":0},null,6,{"$f":"IF(ISNUMBER(AA13),(VLOOKUP(AA13,$BO$6:$BP$50,2)),0)","v":40},{"$f":"IF(AA13<>\"\",5,0)","v":5},{"$f":"AB13+AC13","v":45},null,9,{"$f":"IF(ISNUMBER(AF13),(VLOOKUP(AF13,$BO$6:$BP$50,2)),0)","v":29},{"$f":"IF(AF13<>\"\",5,0)","v":5},{"$f":"AG13+AH13","v":34},null,9,{"$f":"IF(ISNUMBER(AK13),(VLOOKUP(AK13,$BO$6:$BP$50,2)),0)","v":29},{"$f":"IF(AK13<>\"\",5,0)","v":5},{"$f":"AL13+AM13","v":34},null,6,{"$f":"IF(ISNUMBER(AP13),(VLOOKUP(AP13,$BO$6:$BP$50,2)),0)","v":40},{"$f":"IF(AP13<>\"\",5,0)","v":5},{"$f":"AQ13+AR13","v":45},null,9,{"$f":"IF(ISNUMBER(AU13),(VLOOKUP(AU13,$BO$6:$BP$50,2)),0)","v":29},{"$f":"IF(AU13<>\"\",5,0)","v":5},{"$f":"AV13+AW13","v":34},null,null,{"$f":"IF(ISNUMBER(AZ13),(VLOOKUP(AZ13,$BO$6:$BP$50,2)),0)","v":0},{"$f":"IF(AZ13<>\"\",5,0)","v":0},{"$f":"BA13+BB13","v":0},null,null,{"$f":"IF(ISNUMBER(BE13),(VLOOKUP(BE13,$BO$6:$BP$50,2)),0)","v":0},{"$f":"IF(BE13<>\"\",5,0)","v":0},{"$f":"BF13+BG13","v":0},null,null,{"$f":"IF(ISNUMBER(BJ13),(VLOOKUP(BJ13,$BO$6:$BP$50,2)),0)","v":0},{"$f":"IF(BJ13<>\"\",5,0)","v":0},{"$f":"BK13+BL13","v":0},null,8,32,0,0,0,1,0,0,0,0]
[{"$f":"IF(E14<E13,BO14,A13)","v":9},"Sartz-Lunde","Emily Nell","Heming",{"$f":"IF(F14<=4,Q14,(Q14-SUM(SMALL(R14:Y14,{1;2;3;4}))))","v":161},{"$f":"(IF(AC14=5,1,0)+IF(AH14=5,1,0)+IF(AM14=5,1,0)+IF(AR14=5,1,0)+IF(AW14=5,1,0)+IF(BB14=5,1,0)+IF(BG14=5,1,0)+IF(BL14=5,1,0))","v":4},null,{"$f":"IF(AA14=\"\",\"\",AA14)","v":""},{"$f":"IF(AF14=\"\",\"\",AF14)","v":""},{"$f":"IF(AK14=\"\",\"\",AK14)","v":7},{"$f":"IF(AP14=\"\",\"\",AP14)","v":10},{"$f":"IF(AU14=\"\",\"\",AU14)","v":""},{"$f":"IF(AZ14=\"\",\"\",AZ14)","v":4},{"$f":"IF(BE14=\"\",\"\",BE14)","v":9},{"$f":"IF(BJ14=\"\",\"\",BJ14)","v":""},null,{"$f":"AD14+AI14+AN14+AS14+AX14+BC14+BH14","v":161},{"$f":"IF($F14>=5,IF(AB14=\"\",\"\",AB14),\"\")","v":""},{"$f":"IF($F14>=5,IF(AG14=\"\",\"\",AG14),\"\")","v":""},{"$f":"IF($F14>=5,IF(AL14=\"\",\"\",AL14),\"\")","v":""},{"$f":"IF($F14>=5,IF(AQ14=\"\",\"\",AQ14),\"\")","v":""},{"$f":"IF($F14>=5,IF(AV14=\"\",\"\",AV14),\"\")","v":""},{"$f":"IF($F14>=5,IF(BA14=\"\",\"\",BA14),\"\")","v":""},{"$f":"IF($F14>=5,IF(BF14=\"\",\"\",BF14),\"\")","v":""},{"$f":"IF($F14>=5,IF(BK14=\"\",\"\",BK14),\"\")","v":""},null,null,{"$f":"IF(ISNUMBER(AA14),(VLOOKUP(AA14,$BO$6:$BP$50,2)),0)","v":0},{"$f":"IF(AA14<>\"\",5,0)","v":0},{"$f":"AB14+AC14","v":0},null,null,{"$f":"IF(ISNUMBER(AF14),(VLOOKUP(AF14,$BO$6:$BP$50,2)),0)","v":0},{"$f":"IF(AF14<>\"\",5,0)","v":0},{"$f":"AG14+AH14","v":0},null,7,{"$f":"IF(ISNUMBER(AK14),(VLOOKUP(AK14,$BO$6:$BP$50,2)),0)","v":36},{"$f":"IF(AK14<>\"\",5,0)","v":5},{"$f":"AL14+AM14","v":41},null,10,{"$f":"IF(ISNUMBER(AP14),(VLOOKUP(AP14,$BO$6:$BP$50,2)),0)","v":26},{"$f":"IF(AP14<>\"\",5,0)","v":5},{"$f":"AQ14+AR14","v":31},null,null,{"$f":"IF(ISNUMBER(AU14),(VLOOKUP(AU14,$BO$6:$BP$50,2)),0)","v":0},{"$f":"IF(AU14<>\"\",5,0)","v":0},{"$f":"AV14+AW14","v":0},null,4,{"$f":"IF(ISNUMBER(AZ14),(VLOOKUP(AZ14,$BO$6:$BP$50,2)),0)","v":50},{"$f":"IF(AZ14<>\"\",5,0)","v":5},{"$f":"BA14+BB14","v":55},null,9,{"$f":"IF(ISNUMBER(BE14),(VLOOKUP(BE14,$BO$6:$BP$50,2)),0)","v":29},{"$f":"IF(BE14<>\"\",5,0)","v":5},{"$f":"BF14+BG14","v":34},null,null,{"$f":"IF(ISNUMBER(BJ14),(VLOOKUP(BJ14,$BO$6:$BP$50,2)),0)","v":0},{"$f":"IF(BJ14<>\"\",5,0)","v":0},{"$f":"BK14+BL14","v":0},null,9,29,0,0,0,0,1,0,0,0]
[{"$f":"IF(E15<E14,BO15,A14)","v":10},"Norstrand","Nicoline","Heming",{"$f":"IF(F15<=4,Q15,(Q15-SUM(SMALL(R15:Y15,{1;2;3;4}))))","v":152},{"$f":"(IF(AC15=5,1,0)+IF(AH15=5,1,0)+IF(AM15=5,1,0)+IF(AR15=5,1,0)+IF(AW15=5,1,0)+IF(BB15=5,1,0)+IF(BG15=5,1,0)+IF(BL15=5,1,0))","v":4},null,{"$f":"IF(AA15=\"\",\"\",AA15)","v":""},{"$f":"IF(AF15=\"\",\"\",AF15)","v":""},{"$f":"IF(AK15=\"\",\"\",AK15)","v":12},{"$f":"IF(AP15=\"\",\"\",AP15)","v":8},{"$f":"IF(AU15=\"\",\"\",AU15)","v":14},{"$f":"IF(AZ15=\"\",\"\",AZ15)","v":""},{"$f":"IF(BE15=\"\",\"\",BE15)","v":3},{"$f":"IF(BJ15=\"\",\"\",BJ15)","v":""},null,{"$f":"AD15+AI15+AN15+AS15+AX15+BC15+BH15","v":152},{"$f":"IF($F15>=5,IF(AB15=\"\",\"\",AB15),\"\")","v":""},{"$f":"IF($F15>=5,IF(AG15=\"\",\"\",AG15),\"\")","v":""},{"$f":"IF($F15>=5,IF(AL15=\"\",\"\",AL15),\"\")","v":""},{"$f":"IF($F15>=5,IF(AQ15=\"\",\"\",AQ15),\"\")","v":""},{"$f":"IF($F15>=5,IF(AV15=\"\",\"\",AV15),\"\")","v":""},{"$f":"IF($F15>=5,IF(BA15=\"\",\"\",BA15),\"\")","v":""},{"$f":"IF($F15>=5,IF(BF15=\"\",\"\",BF15),\"\")","v":""},{"$f":"IF($F15>=5,IF(BK15=\"\",\"\",BK15),\"\")","v":""},null,null,{"$f":"IF(ISNUMBER(AA15),(VLOOKUP(AA15,$BO$6:$BP$50,2)),0)","v":0},{"$f":"IF(AA15<>\"\",5,0)","v":0},{"$f":"AB15+AC15","v":0},null,null,{"$f":"IF(ISNUMBER(AF15),(VLOOKUP(AF15,$BO$6:$BP$50,2)),0)","v":0},{"$f":"IF(AF15<>\"\",5,0)","v":0},{"$f":"AG15+AH15","v":0},null,12,{"$f":"IF(ISNUMBER(AK15),(VLOOKUP(AK15,$BO$6:$BP$50,2)),0)","v":22},{"$f":"IF(AK15<>\"\",5,0)","v":5},{"$f":"AL15+AM15","v":27},null,8,{"$f":"IF(ISNUMBER(AP15),(VLOOKUP(AP15,$BO$6:$BP$50,2)),0)","v":32},{"$f":"IF(AP15<>\"\",5,0)","v":5},{"$f":"AQ15+AR15","v":37},null,14,{"$f":"IF(ISNUMBER(AU15),(VLOOKUP(AU15,$BO$6:$BP$50,2)),0)","v":18},{"$f":"IF(AU15<>\"\",5,0)","v":5},{"$f":"AV15+AW15","v":23},null,null,{"$f":"IF(ISNUMBER(AZ15),(VLOOKUP(AZ15,$BO$6:$BP$50,2)),0)","v":0},{"$f":"IF(AZ15<>\"\",5,0)","v":0},{"$f":"BA15+BB15","v":0},null,3,{"$f":"IF(ISNUMBER(BE15),(VLOOKUP(BE15,$BO$6:$BP$50,2)),0)","v":60},{"$f":"IF(BE15<>\"\",5,0)","v":5},{"$f":"BF15+BG15","v":65},null,null,{"$f":"IF(ISNUMBER(BJ15),(VLOOKUP(BJ15,$BO$6:$BP$50,2)),0)","v":0},{"$f":"IF(BJ15<>\"\",5,0)","v":0},{"$f":"BK15+BL15","v":0},null,10,26,0,0,0,0,1,0,0,0]
[{"$f":"IF(E16<E15,BO16,A15)","v":11},"Alsos","Synne","Ready",{"$f":"IF(F16<=4,Q16,(Q16-SUM(SMALL(R16:Y16,{1;2;3;4}))))","v":145},{"$f":"(IF(AC16=5,1,0)+IF(AH16=5,1,0)+IF(AM16=5,1,0)+IF(AR16=5,1,0)+IF(AW16=5,1,0)+IF(BB16=5,1,0)+IF(BG16=5,1,0)+IF(BL16=5,1,0))","v":5},null,{"$f":"IF(AA16=\"\",\"\",AA16)","v":8},{"$f":"IF(AF16=\"\",\"\",AF16)","v":6},{"$f":"IF(AK16=\"\",\"\",AK16)","v":10},{"$f":"IF(AP16=\"\",\"\",AP16)","v":18},{"$f":"IF(AU16=\"\",\"\",AU16)","v":12},{"$f":"IF(AZ16=\"\",\"\",AZ16)","v":""},{"$f":"IF(BE16=\"\",\"\",BE16)","v":""},{"$f":"IF(BJ16=\"\",\"\",BJ16)","v":""},null,{"$f":"AD16+AI16+AN16+AS16+AX16+BC16+BH16","v":158},{"$f":"IF($F16>=5,IF(AB16=\"\",\"\",AB16),\"\")","v":32},{"$f":"IF($F16>=5,IF(AG16=\"\",\"\",AG16),\"\")","v":40},{"$f":"IF($F16>=5,IF(AL16=\"\",\"\",AL16),\"\")","v":26},{"$f":"IF($F16>=5,IF(AQ16=\"\",\"\",AQ16),\"\")","v":13},{"$f":"IF($F16>=5,IF(AV16=\"\",\"\",AV16),\"\")","v":22},{"$f":"IF($F16>=5,IF(BA16=\"\",\"\",BA16),\"\")","v":0},{"$f":"IF($F16>=5,IF(BF16=\"\",\"\",BF16),\"\")","v":0},{"$f":"IF($F16>=5,IF(BK16=\"\",\"\",BK16),\"\")","v":0},null,8,{"$f":"IF(ISNUMBER(AA16),(VLOOKUP(AA16,$BO$6:$BP$50,2)),0)","v":32},{"$f":"IF(AA16<>\"\",5,0)","v":5},{"$f":"AB16+AC16","v":37},null,6,{"$f":"IF(ISNUMBER(AF16),(VLOOKUP(AF16,$BO$6:$BP$50,2)),0)","v":40},{"$f":"IF(AF16<>\"\",5,0)","v":5},{"$f":"AG16+AH16","v":45},null,10,{"$f":"IF(ISNUMBER(AK16),(VLOOKUP(AK16,$BO$6:$BP$50,2)),0)","v":26},{"$f":"IF(AK16<>\"\",5,0)","v":5},{"$f":"AL16+AM16","v":31},null,18,{"$f":"IF(ISNUMBER(AP16),(VLOOKUP(AP16,$BO$6:$BP$50,2)),0)","v":13},{"$f":"IF(AP16<>\"\",5,0)","v":5},{"$f":"AQ16+AR16","v":18},null,12,{"$f":"IF(ISNUMBER(AU16),(VLOOKUP(AU16,$BO$6:$BP$50,2)),0)","v":22},{"$f":"IF(AU16<>\"\",5,0)","v":5},{"$f":"AV16+AW16","v":27},null,null,{"$f":"IF(ISNUMBER(AZ16),(VLOOKUP(AZ16,$BO$6:$BP$50,2)),0)","v":0},{"$f":"IF(AZ16<>\"\",5,0)","v":0},{"$f":"BA16+BB16","v":0},null,null,{"$f":"IF(ISNUMBER(BE16),(VLOOKUP(BE16,$BO$6:$BP$50,2)),0)","v":0},{"$f":"IF(BE16<>\"\",5,0)","v":0},{"$f":"BF16+BG16","v":0},null,null,{"$f":"IF(ISNUMBER(BJ16),(VLOOKUP(BJ16,$BO$6:$BP$50,2)),0)","v":0},{"$f":"IF(BJ16<>\"\",5,0)","v":0},{"$f":"BK16+BL16","v":0},null,11,24,0,0,0,1,0,0,0,0]
[{"$f":"IF(E17<E16,BO17,A16)","v":12},"Granerud","Cornelie Hemme","Ljan",{"$f":"IF(F17<=4,Q17,(Q17-SUM(SMALL(R17:Y17,{1;2;3;4}))))","v":144},{"$f":"(IF(AC17=5,1,0)+IF(AH17=5,1,0)+IF(AM17=5,1,0)+IF(AR17=5,1,0)+IF(AW17=5,1,0)+IF(BB17=5,1,0)+IF(BG17=5,1,0)+IF(BL17=5,1,0))","v":6},null,{"$f":"IF(AA17=\"\",\"\",AA17)","v":"dnf"},{"$f":"IF(AF17=\"\",\"\",AF17)","v":"dsq"},{"$f":"IF(AK17=\"\",\"\",AK17)","v":11},{"$f":"IF(AP17=\"\",\"\",AP17)","v":7},{"$f":"IF(AU17=\"\",\"\",AU17)","v":17},{"$f":"IF(AZ17=\"\",\"\",AZ17)","v":""},{"$f":"IF(BE17=\"\",\"\",BE17)","v":6},{"$f":"IF(BJ17=\"\",\"\",BJ17)","v":""},null,{"$f":"AD17+AI17+AN17+AS17+AX17+BC17+BH17","v":144},{"$f":"IF($F17>=5,IF(AB17=\"\",\"\",AB17),\"\")","v":0},{"$f":"IF($F17>=5,IF(AG17=\"\",\"\",AG17),\"\")","v":0},{"$f":"IF($F17>=5,IF(AL17=\"\",\"\",AL17),\"\")","v":24},{"$f":"IF($F17>=5,IF(AQ17=\"\",\"\",AQ17),\"\")","v":36},{"$f":"IF($F17>=5,IF(AV17=\"\",\"\",AV17),\"\")","v":14},{"$f":"IF($F17>=5,IF(BA17=\"\",\"\",BA17),\"\")","v":0},{"$f":"IF($F17>=5,IF(BF17=\"\",\"\",BF17),\"\")","v":40},{"$f":"IF($F17>=5,IF(BK17=\"\",\"\",BK17),\"\")","v":0},null,"dnf",{"$f":"IF(ISNUMBER(AA17),(VLOOKUP(AA17,$BO$6:$BP$50,2)),0)","v":0},{"$f":"IF(AA17<>\"\",5,0)","v":5},{"$f":"AB17+AC17","v":5},null,"dsq",{"$f":"IF(ISNUMBER(AF17),(VLOOKUP(AF17,$BO$6:$BP$50,2)),0)","v":0},{"$f":"IF(AF17<>\"\",5,0)","v":5},{"$f":"AG17+AH17","v":5},null,11,{"$f":"IF(ISNUMBER(AK17),(VLOOKUP(AK17,$BO$6:$BP$50,2)),0)","v":24},{"$f":"IF(AK17<>\"\",5,0)","v":5},{"$f":"AL17+AM17","v":29},null,7,{"$f":"IF(ISNUMBER(AP17),(VLOOKUP(AP17,$BO$6:$BP$50,2)),0)","v":36},{"$f":"IF(AP17<>\"\",5,0)","v":5},{"$f":"AQ17+AR17","v":41},null,17,{"$f":"IF(ISNUMBER(AU17),(VLOOKUP(AU17,$BO$6:$BP$50,2)),0)","v":14},{"$f":"IF(AU17<>\"\",5,0)","v":5},{"$f":"AV17+AW17","v":19},null,null,{"$f":"IF(ISNUMBER(AZ17),(VLOOKUP(AZ17,$BO$6:$BP$50,2)),0)","v":0},{"$f":"IF(AZ17<>\"\",5,0)","v":0},{"$f":"BA17+BB17","v":0},null,6,{"$f":"IF(ISNUMBER(BE17),(VLOOKUP(BE17,$BO$6:$BP$50,2)),0)","v":40},{"$f":"IF(BE17<>\"\",5,0)","v":5},{"$f":"BF17+BG17","v":45},null,null,{"$f":"IF(ISNUMBER(BJ17),(VLOOKUP(BJ17,$BO$6:$BP$50,2)),0)","v":0},{"$f":"IF(BJ17<>\"\",5,0)","v":0},{"$f":"BK17+BL17","v":0},null,12,22,0,0,1,0,0,0,0,0]
[{"$f":"IF(E18<E17,BO18,A17)","v":13},"Bjørnstad","Erika Scheid","IRS",{"$f":"IF(F18<=4,Q18,(Q18-SUM(SMALL(R18:Y18,{1;2;3;4}))))","v":138},{"$f":"(IF(AC18=5,1,0)+IF(AH18=5,1,0)+IF(AM18=5,1,0)+IF(AR18=5,1,0)+IF(AW18=5,1,0)+IF(BB18=5,1,0)+IF(BG18=5,1,0)+IF(BL18=5,1,0))","v":6},null,{"$f":"IF(AA18=\"\",\"\",AA18)","v":13},{"$f":"IF(AF18=\"\",\"\",AF18)","v":10},{"$f":"IF(AK18=\"\",\"\",AK18)","v":23},{"$f":"IF(AP18=\"\",\"\",AP18)","v":17},{"$f":"IF(AU18=\"\",\"\",AU18)","v":""},{"$f":"IF(AZ18=\"\",\"\",AZ18)","v":7},{"$f":"IF(BE18=\"\",\"\",BE18)","v":10},{"$f":"IF(BJ18=\"\",\"\",BJ18)","v":""},null,{"$f":"AD18+AI18+AN18+AS18+AX18+BC18+BH18","v":160},{"$f":"IF($F18>=5,IF(AB18=\"\",\"\",AB18),\"\")","v":20},{"$f":"IF($F18>=5,IF(AG18=\"\",\"\",AG18),\"\")","v":26},{"$f":"IF($F18>=5,IF(AL18=\"\",\"\",AL18),\"\")","v":8},{"$f":"IF($F18>=5,IF(AQ18=\"\",\"\",AQ18),\"\")","v":14},{"$f":"IF($F18>=5,IF(AV18=\"\",\"\",AV18),\"\")","v":0},{"$f":"IF($F18>=5,IF(BA18=\"\",\"\",BA18),\"\")","v":36},{"$f":"IF($F18>=5,IF(BF18=\"\",\"\",BF18),\"\")","v":26},{"$f":"IF($F18>=5,IF(BK18=\"\",\"\",BK18),\"\")","v":0},null,13,{"$f":"IF(ISNUMBER(AA18),(VLOOKUP(AA18,$BO$6:$BP$50,2)),0)","v":20},{"$f":"IF(AA18<>\"\",5,0)","v":5},{"$f":"AB18+AC18","v":25},null,10,{"$f":"IF(ISNUMBER(AF18),(VLOOKUP(AF18,$BO$6:$BP$50,2)),0)","v":26},{"$f":"IF(AF18<>\"\",5,0)","v":5},{"$f":"AG18+AH18","v":31},null,23,{"$f":"IF(ISNUMBER(AK18),(VLOOKUP(AK18,$BO$6:$BP$50,2)),0)","v":8},{"$f":"IF(AK18<>\"\",5,0)","v":5},{"$f":"AL18+AM18","v":13},null,17,{"$f":"IF(ISNUMBER(AP18),(VLOOKUP(AP18,$BO$6:$BP$50,2)),0)","v":14},{"$f":"IF(AP18<>\"\",5,0)","v":5},{"$f":"AQ18+AR18","v":19},null,null,{"$f":"IF(ISNUMBER(AU18),(VLOOKUP(AU18,$BO$6:$BP$50,2)),0)","v":0},{"$f":"IF(AU18<>\"\",5,0)","v":0},{"$f":"AV18+AW18","v":0},null,7,{"$f":"IF(ISNUMBER(AZ18),(VLOOKUP(AZ18,$BO$6:$BP$50,2)),0)","v":36},{"$f":"IF(AZ18<>\"\",5,0)","v":5},{"$f":"BA18+BB18","v":41},null,10,{"$f":"IF(ISNUMBER(BE18),(VLOOKUP(BE18,$BO$6:$BP$50,2)),0)","v":26},{"$f":"IF(BE18<>\"\",5,0)","v":5},{"$f":"BF18+BG18","v":31},null,null,{"$f":"IF(ISNUMBER(BJ18),(VLOOKUP(BJ18,$BO$6:$BP$50,2)),0)","v":0},{"$f":"IF(BJ18<>\"\",5,0)","v":0},{"$f":"BK18+BL18","v":0},null,13,20,0,{"$f":"IF($F17=7,1,0)","v":0},{"$f":"IF($F17=6,1,0)","v":1},{"$f":"IF($F17=5,1,0)","v":0},{"$f":"IF($F17=4,1,0)","v":0},{"$f":"IF($F17=3,1,0)","v":0},{"$f":"IF($F17=2,1,0)","v":0},{"$f":"IF($F17=1,1,0)","v":0}]
[{"$f":"IF(E19<E18,BO19,A18)","v":14},"Horgen","Alexandra Astrup","Heming",{"$f":"IF(F19<=4,Q19,(Q19-SUM(SMALL(R19:Y19,{1;2;3;4}))))","v":134},{"$f":"(IF(AC19=5,1,0)+IF(AH19=5,1,0)+IF(AM19=5,1,0)+IF(AR19=5,1,0)+IF(AW19=5,1,0)+IF(BB19=5,1,0)+IF(BG19=5,1,0)+IF(BL19=5,1,0))","v":4},null,{"$f":"IF(AA19=\"\",\"\",AA19)","v":10},{"$f":"IF(AF19=\"\",\"\",AF19)","v":8},{"$f":"IF(AK19=\"\",\"\",AK19)","v":""},{"$f":"IF(AP19=\"\",\"\",AP19)","v":""},{"$f":"IF(AU19=\"\",\"\",AU19)","v":13},{"$f":"IF(AZ19=\"\",\"\",AZ19)","v":""},{"$f":"IF(BE19=\"\",\"\",BE19)","v":7},{"$f":"IF(BJ19=\"\",\"\",BJ19)","v":""},null,{"$f":"AD19+AI19+AN19+AS19+AX19+BC19+BH19","v":134},{"$f":"IF($F19>=5,IF(AB19=\"\",\"\",AB19),\"\")","v":""},{"$f":"IF($F19>=5,IF(AG19=\"\",\"\",AG19),\"\")","v":""},{"$f":"IF($F19>=5,IF(AL19=\"\",\"\",AL19),\"\")","v":""},{"$f":"IF($F19>=5,IF(AQ19=\"\",\"\",AQ19),\"\")","v":""},{"$f":"IF($F19>=5,IF(AV19=\"\",\"\",AV19),\"\")","v":""},{"$f":"IF($F19>=5,IF(BA19=\"\",\"\",BA19),\"\")","v":""},{"$f":"IF($F19>=5,IF(BF19=\"\",\"\",BF19),\"\")","v":""},{"$f":"IF($F19>=5,IF(BK19=\"\",\"\",BK19),\"\")","v":""},null,10,{"$f":"IF(ISNUMBER(AA19),(VLOOKUP(AA19,$BO$6:$BP$50,2)),0)","v":26},{"$f":"IF(AA19<>\"\",5,0)","v":5},{"$f":"AB19+AC19","v":31},null,8,{"$f":"IF(ISNUMBER(AF19),(VLOOKUP(AF19,$BO$6:$BP$50,2)),0)","v":32},{"$f":"IF(AF19<>\"\",5,0)","v":5},{"$f":"AG19+AH19","v":37},null,null,{"$f":"IF(ISNUMBER(AK19),(VLOOKUP(AK19,$BO$6:$BP$50,2)),0)","v":0},{"$f":"IF(AK19<>\"\",5,0)","v":0},{"$f":"AL19+AM19","v":0},null,null,{"$f":"IF(ISNUMBER(AP19),(VLOOKUP(AP19,$BO$6:$BP$50,2)),0)","v":0},{"$f":"IF(AP19<>\"\",5,0)","v":0},{"$f":"AQ19+AR19","v":0},null,13,{"$f":"IF(ISNUMBER(AU19),(VLOOKUP(AU19,$BO$6:$BP$50,2)),0)","v":20},{"$f":"IF(AU19<>\"\",5,0)","v":5},{"$f":"AV19+AW19","v":25},null,null,{"$f":"IF(ISNUMBER(AZ19),(VLOOKUP(AZ19,$BO$6:$BP$50,2)),0)","v":0},{"$f":"IF(AZ19<>\"\",5,0)","v":0},{"$f":"BA19+BB19","v":0},null,7,{"$f":"IF(ISNUMBER(BE19),(VLOOKUP(BE19,$BO$6:$BP$50,2)),0)","v":36},{"$f":"IF(BE19<>\"\",5,0)","v":5},{"$f":"BF19+BG19","v":41},null,null,{"$f":"IF(ISNUMBER(BJ19),(VLOOKUP(BJ19,$BO$6:$BP$50,2)),0)","v":0},{"$f":"IF(BJ19<>\"\",5,0)","v":0},{"$f":"BK19+BL19","v":0},null,14,18,0,{"$f":"IF($F18=7,1,0)","v":0},{"$f":"IF($F18=6,1,0)","v":1},{"$f":"IF($F18=5,1,0)","v":0},{"$f":"IF($F18=4,1,0)","v":0},{"$f":"IF($F18=3,1,0)","v":0},{"$f":"IF($F18=2,1,0)","v":0},{"$f":"IF($F18=1,1,0)","v":0}]
[{"$f":"IF(E20<E19,BO20,A19)","v":15},"Solberg","Erle","Ready",{"$f":"IF(F20<=4,Q20,(Q20-SUM(SMALL(R20:Y20,{1;2;3;4}))))","v":118},{"$f":"(IF(AC20=5,1,0)+IF(AH20=5,1,0)+IF(AM20=5,1,0)+IF(AR20=5,1,0)+IF(AW20=5,1,0)+IF(BB20=5,1,0)+IF(BG20=5,1,0)+IF(BL20=5,1,0))","v":6},null,{"$f":"IF(AA20=\"\",\"\",AA20)","v":"dsq"},{"$f":"IF(AF20=\"\",\"\",AF20)","v":14},{"$f":"IF(AK20=\"\",\"\",AK20)","v":""},{"$f":"IF(AP20=\"\",\"\",AP20)","v":19},{"$f":"IF(AU20=\"\",\"\",AU20)","v":25},{"$f":"IF(AZ20=\"\",\"\",AZ20)","v":6},{"$f":"IF(BE20=\"\",\"\",BE20)","v":14},{"$f":"IF(BJ20=\"\",\"\",BJ20)","v":""},null,{"$f":"AD20+AI20+AN20+AS20+AX20+BC20+BH20","v":124},{"$f":"IF($F20>=5,IF(AB20=\"\",\"\",AB20),\"\")","v":0},{"$f":"IF($F20>=5,IF(AG20=\"\",\"\",AG20),\"\")","v":18},{"$f":"IF($F20>=5,IF(AL20=\"\",\"\",AL20),\"\")","v":0},{"$f":"IF($F20>=5,IF(AQ20=\"\",\"\",AQ20),\"\")","v":12},{"$f":"IF($F20>=5,IF(AV20=\"\",\"\",AV20),\"\")","v":6},{"$f":"IF($F20>=5,IF(BA20=\"\",\"\",BA20),\"\")","v":40},{"$f":"IF($F20>=5,IF(BF20=\"\",\"\",BF20),\"\")","v":18},{"$f":"IF($F20>=5,IF(BK20=\"\",\"\",BK20),\"\")","v":0},null,"dsq",{"$f":"IF(ISNUMBER(AA20),(VLOOKUP(AA20,$BO$6:$BP$50,2)),0)","v":0},{"$f":"IF(AA20<>\"\",5,0)","v":5},{"$f":"AB20+AC20","v":5},null,14,{"$f":"IF(ISNUMBER(AF20),(VLOOKUP(AF20,$BO$6:$BP$50,2)),0)","v":18},{"$f":"IF(AF20<>\"\",5,0)","v":5},{"$f":"AG20+AH20","v":23},null,null,{"$f":"IF(ISNUMBER(AK20),(VLOOKUP(AK20,$BO$6:$BP$50,2)),0)","v":0},{"$f":"IF(AK20<>\"\",5,0)","v":0},{"$f":"AL20+AM20","v":0},null,19,{"$f":"IF(ISNUMBER(AP20),(VLOOKUP(AP20,$BO$6:$BP$50,2)),0)","v":12},{"$f":"IF(AP20<>\"\",5,0)","v":5},{"$f":"AQ20+AR20","v":17},null,25,{"$f":"IF(ISNUMBER(AU20),(VLOOKUP(AU20,$BO$6:$BP$50,2)),0)","v":6},{"$f":"IF(AU20<>\"\",5,0)","v":5},{"$f":"AV20+AW20","v":11},null,6,{"$f":"IF(ISNUMBER(AZ20),(VLOOKUP(AZ20,$BO$6:$BP$50,2)),0)","v":40},{"$f":"IF(AZ20<>\"\",5,0)","v":5},{"$f":"BA20+BB20","v":45},null,14,{"$f":"IF(ISNUMBER(BE20),(VLOOKUP(BE20,$BO$6:$BP$50,2)),0)","v":18},{"$f":"IF(BE20<>\"\",5,0)","v":5},{"$f":"BF20+BG20","v":23},null,null,{"$f":"IF(ISNUMBER(BJ20),(VLOOKUP(BJ20,$BO$6:$BP$50,2)),0)","v":0},{"$f":"IF(BJ20<>\"\",5,0)","v":0},{"$f":"BK20+BL20","v":0},null,15,16,0,{"$f":"IF($F19=7,1,0)","v":0},{"$f":"IF($F19=6,1,0)","v":0},{"$f":"IF($F19=5,1,0)","v":0},{"$f":"IF($F19=4,1,0)","v":1},{"$f":"IF($F19=3,1,0)","v":0},{"$f":"IF($F19=2,1,0)","v":0},{"$f":"IF($F19=1,1,0)","v":0}]
[{"$f":"IF(E21<E20,BO21,A20)","v":16},"Solheim","Cornelia Margrethe Lysne","Njård",{"$f":"IF(F21<=4,Q21,(Q21-SUM(SMALL(R21:Y21,{1;2;3;4}))))","v":117},{"$f":"(IF(AC21=5,1,0)+IF(AH21=5,1,0)+IF(AM21=5,1,0)+IF(AR21=5,1,0)+IF(AW21=5,1,0)+IF(BB21=5,1,0)+IF(BG21=5,1,0)+IF(BL21=5,1,0))","v":5},null,{"$f":"IF(AA21=\"\",\"\",AA21)","v":15},{"$f":"IF(AF21=\"\",\"\",AF21)","v":""},{"$f":"IF(AK21=\"\",\"\",AK21)","v":14},{"$f":"IF(AP21=\"\",\"\",AP21)","v":9},{"$f":"IF(AU21=\"\",\"\",AU21)","v":20},{"$f":"IF(AZ21=\"\",\"\",AZ21)","v":9},{"$f":"IF(BE21=\"\",\"\",BE21)","v":""},{"$f":"IF(BJ21=\"\",\"\",BJ21)","v":""},null,{"$f":"AD21+AI21+AN21+AS21+AX21+BC21+BH21","v":128},{"$f":"IF($F21>=5,IF(AB21=\"\",\"\",AB21),\"\")","v":16},{"$f":"IF($F21>=5,IF(AG21=\"\",\"\",AG21),\"\")","v":0},{"$f":"IF($F21>=5,IF(AL21=\"\",\"\",AL21),\"\")","v":18},{"$f":"IF($F21>=5,IF(AQ21=\"\",\"\",AQ21),\"\")","v":29},{"$f":"IF($F21>=5,IF(AV21=\"\",\"\",AV21),\"\")","v":11},{"$f":"IF($F21>=5,IF(BA21=\"\",\"\",BA21),\"\")","v":29},{"$f":"IF($F21>=5,IF(BF21=\"\",\"\",BF21),\"\")","v":0},{"$f":"IF($F21>=5,IF(BK21=\"\",\"\",BK21),\"\")","v":0},null,15,{"$f":"IF(ISNUMBER(AA21),(VLOOKUP(AA21,$BO$6:$BP$50,2)),0)","v":16},{"$f":"IF(AA21<>\"\",5,0)","v":5},{"$f":"AB21+AC21","v":21},null,null,{"$f":"IF(ISNUMBER(AF21),(VLOOKUP(AF21,$BO$6:$BP$50,2)),0)","v":0},{"$f":"IF(AF21<>\"\",5,0)","v":0},{"$f":"AG21+AH21","v":0},null,14,{"$f":"IF(ISNUMBER(AK21),(VLOOKUP(AK21,$BO$6:$BP$50,2)),0)","v":18},{"$f":"IF(AK21<>\"\",5,0)","v":5},{"$f":"AL21+AM21","v":23},null,9,{"$f":"IF(ISNUMBER(AP21),(VLOOKUP(AP21,$BO$6:$BP$50,2)),0)","v":29},{"$f":"IF(AP21<>\"\",5,0)","v":5},{"$f":"AQ21+AR21","v":34},null,20,{"$f":"IF(ISNUMBER(AU21),(VLOOKUP(AU21,$BO$6:$BP$50,2)),0)","v":11},{"$f":"IF(AU21<>\"\",5,0)","v":5},{"$f":"AV21+AW21","v":16},null,9,{"$f":"IF(ISNUMBER(AZ21),(VLOOKUP(AZ21,$BO$6:$BP$50,2)),0)","v":29},{"$f":"IF(AZ21<>\"\",5,0)","v":5},{"$f":"BA21+BB21","v":34},null,null,{"$f":"IF(ISNUMBER(BE21),(VLOOKUP(BE21,$BO$6:$BP$50,2)),0)","v":0},{"$f":"IF(BE21<>\"\",5,0)","v":0},{"$f":"BF21+BG21","v":0},null,null,{"$f":"IF(ISNUMBER(BJ21),(VLOOKUP(BJ21,$BO$6:$BP$50,2)),0)","v":0},{"$f":"IF(BJ21<>\"\",5,0)","v":0},{"$f":"BK21+BL21","v":0},null,16,15,0,{"$f":"IF($F19=7,1,0)","v":0},{"$f":"IF($F19=6,1,0)","v":0},{"$f":"IF($F19=5,1,0)","v":0},{"$f":"IF($F19=4,1,0)","v":1},{"$f":"IF($F19=3,1,0)","v":0},{"$f":"IF($F19=2,1,0)","v":0},{"$f":"IF($F19=1,1,0)","v":0}]
[{"$f":"IF(E22<E21,BO22,A21)","v":17},"Brækken","Eili","IRS",{"$f":"IF(F22<=4,Q22,(Q22-SUM(SMALL(R22:Y22,{1;2;3;4}))))","v":109},{"$f":"(IF(AC22=5,1,0)+IF(AH22=5,1,0)+IF(AM22=5,1,0)+IF(AR22=5,1,0)+IF(AW22=5,1,0)+IF(BB22=5,1,0)+IF(BG22=5,1,0)+IF(BL22=5,1,0))","v":5},null,{"$f":"IF(AA22=\"\",\"\",AA22)","v":14},{"$f":"IF(AF22=\"\",\"\",AF22)","v":11},{"$f":"IF(AK22=\"\",\"\",AK22)","v":18},{"$f":"IF(AP22=\"\",\"\",AP22)","v":12},{"$f":"IF(AU22=\"\",\"\",AU22)","v":""},{"$f":"IF(AZ22=\"\",\"\",AZ22)","v":""},{"$f":"IF(BE22=\"\",\"\",BE22)","v":13},{"$f":"IF(BJ22=\"\",\"\",BJ22)","v":""},null,{"$f":"AD22+AI22+AN22+AS22+AX22+BC22+BH22","v":122},{"$f":"IF($F22>=5,IF(AB22=\"\",\"\",AB22),\"\")","v":18},{"$f":"IF($F22>=5,IF(AG22=\"\",\"\",AG22),\"\")","v":24},{"$f":"IF($F22>=5,IF(AL22=\"\",\"\",AL22),\"\")","v":13},{"$f":"IF($F22>=5,IF(AQ22=\"\",\"\",AQ22),\"\")","v":22},{"$f":"IF($F22>=5,IF(AV22=\"\",\"\",AV22),\"\")","v":0},{"$f":"IF($F22>=5,IF(BA22=\"\",\"\",BA22),\"\")","v":0},{"$f":"IF($F22>=5,IF(BF22=\"\",\"\",BF22),\"\")","v":20},{"$f":"IF($F22>=5,IF(BK22=\"\",\"\",BK22),\"\")","v":0},null,14,{"$f":"IF(ISNUMBER(AA22),(VLOOKUP(AA22,$BO$6:$BP$50,2)),0)","v":18},{"$f":"IF(AA22<>\"\",5,0)","v":5},{"$f":"AB22+AC22","v":23},null,11,{"$f":"IF(ISNUMBER(AF22),(VLOOKUP(AF22,$BO$6:$BP$50,2)),0)","v":24},{"$f":"IF(AF22<>\"\",5,0)","v":5},{"$f":"AG22+AH22","v":29},null,18,{"$f":"IF(ISNUMBER(AK22),(VLOOKUP(AK22,$BO$6:$BP$50,2)),0)","v":13},{"$f":"IF(AK22<>\"\",5,0)","v":5},{"$f":"AL22+AM22","v":18},null,12,{"$f":"IF(ISNUMBER(AP22),(VLOOKUP(AP22,$BO$6:$BP$50,2)),0)","v":22},{"$f":"IF(AP22<>\"\",5,0)","v":5},{"$f":"AQ22+AR22","v":27},null,null,{"$f":"IF(ISNUMBER(AU22),(VLOOKUP(AU22,$BO$6:$BP$50,2)),0)","v":0},{"$f":"IF(AU22<>\"\",5,0)","v":0},{"$f":"AV22+AW22","v":0},null,null,{"$f":"IF(ISNUMBER(AZ22),(VLOOKUP(AZ22,$BO$6:$BP$50,2)),0)","v":0},{"$f":"IF(AZ22<>\"\",5,0)","v":0},{"$f":"BA22+BB22","v":0},null,13,{"$f":"IF(ISNUMBER(BE22),(VLOOKUP(BE22,$BO$6:$BP$50,2)),0)","v":20},{"$f":"IF(BE22<>\"\",5,0)","v":5},{"$f":"BF22+BG22","v":25},null,null,{"$f":"IF(ISNUMBER(BJ22),(VLOOKUP(BJ22,$BO$6:$BP$50,2)),0)","v":0},{"$f":"IF(BJ22<>\"\",5,0)","v":0},{"$f":"BK22+BL22","v":0},null,17,14,0,0,1,0,0,0,0,0]
[{"$f":"IF(E23<E22,BO23,A22)","v":18},"Benjamin-Wormdahl","Sarah Louise","Heming",{"$f":"IF(F23<=4,Q23,(Q23-SUM(SMALL(R23:Y23,{1;2;3;4}))))","v":101},{"$f":"(IF(AC23=5,1,0)+IF(AH23=5,1,0)+IF(AM23=5,1,0)+IF(AR23=5,1,0)+IF(AW23=5,1,0)+IF(BB23=5,1,0)+IF(BG23=5,1,0)+IF(BL23=5,1,0))","v":4},null,{"$f":"IF(AA23=\"\",\"\",AA23)","v":""},{"$f":"IF(AF23=\"\",\"\",AF23)","v":""},{"$f":"IF(AK23=\"\",\"\",AK23)","v":""},{"$f":"IF(AP23=\"\",\"\",AP23)","v":13},{"$f":"IF(AU23=\"\",\"\",AU23)","v":18},{"$f":"IF(AZ23=\"\",\"\",AZ23)","v":11},{"$f":"IF(BE23=\"\",\"\",BE23)","v":11},{"$f":"IF(BJ23=\"\",\"\",BJ23)","v":""},null,{"$f":"AD23+AI23+AN23+AS23+AX23+BC23+BH23","v":101},{"$f":"IF($F23>=5,IF(AB23=\"\",\"\",AB23),\"\")","v":""},{"$f":"IF($F23>=5,IF(AG23=\"\",\"\",AG23),\"\")","v":""},{"$f":"IF($F23>=5,IF(AL23=\"\",\"\",AL23),\"\")","v":""},{"$f":"IF($F23>=5,IF(AQ23=\"\",\"\",AQ23),\"\")","v":""},{"$f":"IF($F23>=5,IF(AV23=\"\",\"\",AV23),\"\")","v":""},{"$f":"IF($F23>=5,IF(BA23=\"\",\"\",BA23),\"\")","v":""},{"$f":"IF($F23>=5,IF(BF23=\"\",\"\",BF23),\"\")","v":""},{"$f":"IF($F23>=5,IF(BK23=\"\",\"\",BK23),\"\")","v":""},null,null,{"$f":"IF(ISNUMBER(AA23),(VLOOKUP(AA23,$BO$6:$BP$50,2)),0)","v":0},{"$f":"IF(AA23<>\"\",5,0)","v":0},{"$f":"AB23+AC23","v":0},null,null,{"$f":"IF(ISNUMBER(AF23),(VLOOKUP(AF23,$BO$6:$BP$50,2)),0)","v":0},{"$f":"IF(AF23<>\"\",5,0)","v":0},{"$f":"AG23+AH23","v":0},null,null,{"$f":"IF(ISNUMBER(AK23),(VLOOKUP(AK23,$BO$6:$BP$50,2)),0)","v":0},{"$f":"IF(AK23<>\"\",5,0)","v":0},{"$f":"AL23+AM23","v":0},null,13,{"$f":"IF(ISNUMBER(AP23),(VLOOKUP(AP23,$BO$6:$BP$50,2)),0)","v":20},{"$f":"IF(AP23<>\"\",5,0)","v":5},{"$f":"AQ23+AR23","v":25},null,18,{"$f":"IF(ISNUMBER(AU23),(VLOOKUP(AU23,$BO$6:$BP$50,2)),0)","v":13},{"$f":"IF(AU23<>\"\",5,0)","v":5},{"$f":"AV23+AW23","v":18},null,11,{"$f":"IF(ISNUMBER(AZ23),(VLOOKUP(AZ23,$BO$6:$BP$50,2)),0)","v":24},{"$f":"IF(AZ23<>\"\",5,0)","v":5},{"$f":"BA23+BB23","v":29},null,11,{"$f":"IF(ISNUMBER(BE23),(VLOOKUP(BE23,$BO$6:$BP$50,2)),0)","v":24},{"$f":"IF(BE23<>\"\",5,0)","v":5},{"$f":"BF23+BG23","v":29},null,null,{"$f":"IF(ISNUMBER(BJ23),(VLOOKUP(BJ23,$BO$6:$BP$50,2)),0)","v":0},{"$f":"IF(BJ23<>\"\",5,0)","v":0},{"$f":"BK23+BL23","v":0},null,18,13,0,0,0,1,0,0,0,0]
[{"$f":"IF(E24<E23,BO24,A23)","v":19},"Øye","Alva Østnes","IRS",{"$f":"IF(F24<=4,Q24,(Q24-SUM(SMALL(R24:Y24,{1;2;3;4}))))","v":96},{"$f":"(IF(AC24=5,1,0)+IF(AH24=5,1,0)+IF(AM24=5,1,0)+IF(AR24=5,1,0)+IF(AW24=5,1,0)+IF(BB24=5,1,0)+IF(BG24=5,1,0)+IF(BL24=5,1,0))","v":4},null,{"$f":"IF(AA24=\"\",\"\",AA24)","v":12},{"$f":"IF(AF24=\"\",\"\",AF24)","v":17},{"$f":"IF(AK24=\"\",\"\",AK24)","v":""},{"$f":"IF(AP24=\"\",\"\",AP24)","v":""},{"$f":"IF(AU24=\"\",\"\",AU24)","v":23},{"$f":"IF(AZ24=\"\",\"\",AZ24)","v":""},{"$f":"IF(BE24=\"\",\"\",BE24)","v":8},{"$f":"IF(BJ24=\"\",\"\",BJ24)","v":""},null,{"$f":"AD24+AI24+AN24+AS24+AX24+BC24+BH24","v":96},{"$f":"IF($F24>=5,IF(AB24=\"\",\"\",AB24),\"\")","v":""},{"$f":"IF($F24>=5,IF(AG24=\"\",\"\",AG24),\"\")","v":""},{"$f":"IF($F24>=5,IF(AL24=\"\",\"\",AL24),\"\")","v":""},{"$f":"IF($F24>=5,IF(AQ24=\"\",\"\",AQ24),\"\")","v":""},{"$f":"IF($F24>=5,IF(AV24=\"\",\"\",AV24),\"\")","v":""},{"$f":"IF($F24>=5,IF(BA24=\"\",\"\",BA24),\"\")","v":""},{"$f":"IF($F24>=5,IF(BF24=\"\",\"\",BF24),\"\")","v":""},{"$f":"IF($F24>=5,IF(BK24=\"\",\"\",BK24),\"\")","v":""},null,12,{"$f":"IF(ISNUMBER(AA24),(VLOOKUP(AA24,$BO$6:$BP$50,2)),0)","v":22},{"$f":"IF(AA24<>\"\",5,0)","v":5},{"$f":"AB24+AC24","v":27},null,17,{"$f":"IF(ISNUMBER(AF24),(VLOOKUP(AF24,$BO$6:$BP$50,2)),0)","v":14},{"$f":"IF(AF24<>\"\",5,0)","v":5},{"$f":"AG24+AH24","v":19},null,null,{"$f":"IF(ISNUMBER(AK24),(VLOOKUP(AK24,$BO$6:$BP$50,2)),0)","v":0},{"$f":"IF(AK24<>\"\",5,0)","v":0},{"$f":"AL24+AM24","v":0},null,null,{"$f":"IF(ISNUMBER(AP24),(VLOOKUP(AP24,$BO$6:$BP$50,2)),0)","v":0},{"$f":"IF(AP24<>\"\",5,0)","v":0},{"$f":"AQ24+AR24","v":0},null,23,{"$f":"IF(ISNUMBER(AU24),(VLOOKUP(AU24,$BO$6:$BP$50,2)),0)","v":8},{"$f":"IF(AU24<>\"\",5,0)","v":5},{"$f":"AV24+AW24","v":13},null,null,{"$f":"IF(ISNUMBER(AZ24),(VLOOKUP(AZ24,$BO$6:$BP$50,2)),0)","v":0},{"$f":"IF(AZ24<>\"\",5,0)","v":0},{"$f":"BA24+BB24","v":0},null,8,{"$f":"IF(ISNUMBER(BE24),(VLOOKUP(BE24,$BO$6:$BP$50,2)),0)","v":32},{"$f":"IF(BE24<>\"\",5,0)","v":5},{"$f":"BF24+BG24","v":37},null,null,{"$f":"IF(ISNUMBER(BJ24),(VLOOKUP(BJ24,$BO$6:$BP$50,2)),0)","v":0},{"$f":"IF(BJ24<>\"\",5,0)","v":0},{"$f":"BK24+BL24","v":0},null,19,12,0,0,0,1,0,0,0,0]
[{"$f":"IF(E25<E24,BO25,A24)","v":20},"Aardal","Mina","NERO",{"$f":"IF(F25<=4,Q25,(Q25-SUM(SMALL(R25:Y25,{1;2;3;4}))))","v":89},{"$f":"(IF(AC25=5,1,0)+IF(AH25=5,1,0)+IF(AM25=5,1,0)+IF(AR25=5,1,0)+IF(AW25=5,1,0)+IF(BB25=5,1,0)+IF(BG25=5,1,0)+IF(BL25=5,1,0))","v":3},null,{"$f":"IF(AA25=\"\",\"\",AA25)","v":""},{"$f":"IF(AF25=\"\",\"\",AF25)","v":""},{"$f":"IF(AK25=\"\",\"\",AK25)","v":17},{"$f":"IF(AP25=\"\",\"\",AP25)","v":""},{"$f":"IF(AU25=\"\",\"\",AU25)","v":16},{"$f":"IF(AZ25=\"\",\"\",AZ25)","v":""},{"$f":"IF(BE25=\"\",\"\",BE25)","v":5},{"$f":"IF(BJ25=\"\",\"\",BJ25)","v":""},null,{"$f":"AD25+AI25+AN25+AS25+AX25+BC25+BH25","v":89},{"$f":"IF($F25>=5,IF(AB25=\"\",\"\",AB25),\"\")","v":""},{"$f":"IF($F25>=5,IF(AG25=\"\",\"\",AG25),\"\")","v":""},{"$f":"IF($F25>=5,IF(AL25=\"\",\"\",AL25),\"\")","v":""},{"$f":"IF($F25>=5,IF(AQ25=\"\",\"\",AQ25),\"\")","v":""},{"$f":"IF($F25>=5,IF(AV25=\"\",\"\",AV25),\"\")","v":""},{"$f":"IF($F25>=5,IF(BA25=\"\",\"\",BA25),\"\")","v":""},{"$f":"IF($F25>=5,IF(BF25=\"\",\"\",BF25),\"\")","v":""},{"$f":"IF($F25>=5,IF(BK25=\"\",\"\",BK25),\"\")","v":""},null,null,{"$f":"IF(ISNUMBER(AA25),(VLOOKUP(AA25,$BO$6:$BP$50,2)),0)","v":0},{"$f":"IF(AA25<>\"\",5,0)","v":0},{"$f":"AB25+AC25","v":0},null,null,{"$f":"IF(ISNUMBER(AF25),(VLOOKUP(AF25,$BO$6:$BP$50,2)),0)","v":0},{"$f":"IF(AF25<>\"\",5,0)","v":0},{"$f":"AG25+AH25","v":0},null,17,{"$f":"IF(ISNUMBER(AK25),(VLOOKUP(AK25,$BO$6:$BP$50,2)),0)","v":14},{"$f":"IF(AK25<>\"\",5,0)","v":5},{"$f":"AL25+AM25","v":19},null,null,{"$f":"IF(ISNUMBER(AP25),(VLOOKUP(AP25,$BO$6:$BP$50,2)),0)","v":0},{"$f":"IF(AP25<>\"\",5,0)","v":0},{"$f":"AQ25+AR25","v":0},null,16,{"$f":"IF(ISNUMBER(AU25),(VLOOKUP(AU25,$BO$6:$BP$50,2)),0)","v":15},{"$f":"IF(AU25<>\"\",5,0)","v":5},{"$f":"AV25+AW25","v":20},null,null,{"$f":"IF(ISNUMBER(AZ25),(VLOOKUP(AZ25,$BO$6:$BP$50,2)),0)","v":0},{"$f":"IF(AZ25<>\"\",5,0)","v":0},{"$f":"BA25+BB25","v":0},null,5,{"$f":"IF(ISNUMBER(BE25),(VLOOKUP(BE25,$BO$6:$BP$50,2)),0)","v":45},{"$f":"IF(BE25<>\"\",5,0)","v":5},{"$f":"BF25+BG25","v":50},null,null,{"$f":"IF(ISNUMBER(BJ25),(VLOOKUP(BJ25,$BO$6:$BP$50,2)),0)","v":0},{"$f":"IF(BJ25<>\"\",5,0)","v":0},{"$f":"BK25+BL25","v":0},null,20,11,0,0,0,0,1,0,0,0]
[{"$f":"IF(E26<E25,BO26,A25)","v":21},"Braathen","Selma Georgia","Stabæk",{"$f":"IF(F26<=4,Q26,(Q26-SUM(SMALL(R26:Y26,{1;2;3;4}))))","v":85},{"$f":"(IF(AC26=5,1,0)+IF(AH26=5,1,0)+IF(AM26=5,1,0)+IF(AR26=5,1,0)+IF(AW26=5,1,0)+IF(BB26=5,1,0)+IF(BG26=5,1,0)+IF(BL26=5,1,0))","v":1},null,{"$f":"IF(AA26=\"\",\"\",AA26)","v":""},{"$f":"IF(AF26=\"\",\"\",AF26)","v":""},{"$f":"IF(AK26=\"\",\"\",AK26)","v":""},{"$f":"IF(AP26=\"\",\"\",AP26)","v":""},{"$f":"IF(AU26=\"\",\"\",AU26)","v":2},{"$f":"IF(AZ26=\"\",\"\",AZ26)","v":""},{"$f":"IF(BE26=\"\",\"\",BE26)","v":""},{"$f":"IF(BJ26=\"\",\"\",BJ26)","v":""},null,{"$f":"AD26+AI26+AN26+AS26+AX26+BC26+BH26","v":85},{"$f":"IF($F26>=5,IF(AB26=\"\",\"\",AB26),\"\")","v":""},{"$f":"IF($F26>=5,IF(AG26=\"\",\"\",AG26),\"\")","v":""},{"$f":"IF($F26>=5,IF(AL26=\"\",\"\",AL26),\"\")","v":""},{"$f":"IF($F26>=5,IF(AQ26=\"\",\"\",AQ26),\"\")","v":""},{"$f":"IF($F26>=5,IF(AV26=\"\",\"\",AV26),\"\")","v":""},{"$f":"IF($F26>=5,IF(BA26=\"\",\"\",BA26),\"\")","v":""},{"$f":"IF($F26>=5,IF(BF26=\"\",\"\",BF26),\"\")","v":""},{"$f":"IF($F26>=5,IF(BK26=\"\",\"\",BK26),\"\")","v":""},null,null,{"$f":"IF(ISNUMBER(AA26),(VLOOKUP(AA26,$BO$6:$BP$50,2)),0)","v":0},{"$f":"IF(AA26<>\"\",5,0)","v":0},{"$f":"AB26+AC26","v":0},null,null,{"$f":"IF(ISNUMBER(AF26),(VLOOKUP(AF26,$BO$6:$BP$50,2)),0)","v":0},{"$f":"IF(AF26<>\"\",5,0)","v":0},{"$f":"AG26+AH26","v":0},null,null,{"$f":"IF(ISNUMBER(AK26),(VLOOKUP(AK26,$BO$6:$BP$50,2)),0)","v":0},{"$f":"IF(AK26<>\"\",5,0)","v":0},{"$f":"AL26+AM26","v":0},null,null,{"$f":"IF(ISNUMBER(AP26),(VLOOKUP(AP26,$BO$6:$BP$50,2)),0)","v":0},{"$f":"IF(AP26<>\"\",5,0)","v":0},{"$f":"AQ26+AR26","v":0},null,2,{"$f":"IF(ISNUMBER(AU26),(VLOOKUP(AU26,$BO$6:$BP$50,2)),0)","v":80},{"$f":"IF(AU26<>\"\",5,0)","v":5},{"$f":"AV26+AW26","v":85},null,null,{"$f":"IF(ISNUMBER(AZ26),(VLOOKUP(AZ26,$BO$6:$BP$50,2)),0)","v":0},{"$f":"IF(AZ26<>\"\",5,0)","v":0},{"$f":"BA26+BB26","v":0},null,null,{"$f":"IF(ISNUMBER(BE26),(VLOOKUP(BE26,$BO$6:$BP$50,2)),0)","v":0},{"$f":"IF(BE26<>\"\",5,0)","v":0},{"$f":"BF26+BG26","v":0},null,null,{"$f":"IF(ISNUMBER(BJ26),(VLOOKUP(BJ26,$BO$6:$BP$50,2)),0)","v":0},{"$f":"IF(BJ26<>\"\",5,0)","v":0},{"$f":"BK26+BL26","v":0},null,21,10,0,0,0,0,1,0,0,0]
[{"$f":"IF(E27<E26,BO27,A26)","v":22},"Solhusløkk","Carina","IRS",{"$f":"IF(F27<=4,Q27,(Q27-SUM(SMALL(R27:Y27,{1;2;3;4}))))","v":83},{"$f":"(IF(AC27=5,1,0)+IF(AH27=5,1,0)+IF(AM27=5,1,0)+IF(AR27=5,1,0)+IF(AW27=5,1,0)+IF(BB27=5,1,0)+IF(BG27=5,1,0)+IF(BL27=5,1,0))","v":6},null,{"$f":"IF(AA27=\"\",\"\",AA27)","v":18},{"$f":"IF(AF27=\"\",\"\",AF27)","v":16},{"$f":"IF(AK27=\"\",\"\",AK27)","v":24},{"$f":"IF(AP27=\"\",\"\",AP27)","v":20},{"$f":"IF(AU27=\"\",\"\",AU27)","v":26},{"$f":"IF(AZ27=\"\",\"\",AZ27)","v":""},{"$f":"IF(BE27=\"\",\"\",BE27)","v":17},{"$f":"IF(BJ27=\"\",\"\",BJ27)","v":""},null,{"$f":"AD27+AI27+AN27+AS27+AX27+BC27+BH27","v":95},{"$f":"IF($F27>=5,IF(AB27=\"\",\"\",AB27),\"\")","v":13},{"$f":"IF($F27>=5,IF(AG27=\"\",\"\",AG27),\"\")","v":15},{"$f":"IF($F27>=5,IF(AL27=\"\",\"\",AL27),\"\")","v":7},{"$f":"IF($F27>=5,IF(AQ27=\"\",\"\",AQ27),\"\")","v":11},{"$f":"IF($F27>=5,IF(AV27=\"\",\"\",AV27),\"\")","v":5},{"$f":"IF($F27>=5,IF(BA27=\"\",\"\",BA27),\"\")","v":0},{"$f":"IF($F27>=5,IF(BF27=\"\",\"\",BF27),\"\")","v":14},{"$f":"IF($F27>=5,IF(BK27=\"\",\"\",BK27),\"\")","v":0},null,18,{"$f":"IF(ISNUMBER(AA27),(VLOOKUP(AA27,$BO$6:$BP$50,2)),0)","v":13},{"$f":"IF(AA27<>\"\",5,0)","v":5},{"$f":"AB27+AC27","v":18},null,16,{"$f":"IF(ISNUMBER(AF27),(VLOOKUP(AF27,$BO$6:$BP$50,2)),0)","v":15},{"$f":"IF(AF27<>\"\",5,0)","v":5},{"$f":"AG27+AH27","v":20},null,24,{"$f":"IF(ISNUMBER(AK27),(VLOOKUP(AK27,$BO$6:$BP$50,2)),0)","v":7},{"$f":"IF(AK27<>\"\",5,0)","v":5},{"$f":"AL27+AM27","v":12},null,20,{"$f":"IF(ISNUMBER(AP27),(VLOOKUP(AP27,$BO$6:$BP$50,2)),0)","v":11},{"$f":"IF(AP27<>\"\",5,0)","v":5},{"$f":"AQ27+AR27","v":16},null,26,{"$f":"IF(ISNUMBER(AU27),(VLOOKUP(AU27,$BO$6:$BP$50,2)),0)","v":5},{"$f":"IF(AU27<>\"\",5,0)","v":5},{"$f":"AV27+AW27","v":10},null,null,{"$f":"IF(ISNUMBER(AZ27),(VLOOKUP(AZ27,$BO$6:$BP$50,2)),0)","v":0},{"$f":"IF(AZ27<>\"\",5,0)","v":0},{"$f":"BA27+BB27","v":0},null,17,{"$f":"IF(ISNUMBER(BE27),(VLOOKUP(BE27,$BO$6:$BP$50,2)),0)","v":14},{"$f":"IF(BE27<>\"\",5,0)","v":5},{"$f":"BF27+BG27","v":19},null,null,{"$f":"IF(ISNUMBER(BJ27),(VLOOKUP(BJ27,$BO$6:$BP$50,2)),0)","v":0},{"$f":"IF(BJ27<>\"\",5,0)","v":0},{"$f":"BK27+BL27","v":0},null,22,9,0,0,0,0,0,1,0,0]
[{"$f":"IF(E28<E27,BO28,A27)","v":23},"Brandi","Philippa","Ready",{"$f":"IF(F28<=4,Q28,(Q28-SUM(SMALL(R28:Y28,{1;2;3;4}))))","v":76},{"$f":"(IF(AC28=5,1,0)+IF(AH28=5,1,0)+IF(AM28=5,1,0)+IF(AR28=5,1,0)+IF(AW28=5,1,0)+IF(BB28=5,1,0)+IF(BG28=5,1,0)+IF(BL28=5,1,0))","v":5},null,{"$f":"IF(AA28=\"\",\"\",AA28)","v":""},{"$f":"IF(AF28=\"\",\"\",AF28)","v":""},{"$f":"IF(AK28=\"\",\"\",AK28)","v":15},{"$f":"IF(AP28=\"\",\"\",AP28)","v":21},{"$f":"IF(AU28=\"\",\"\",AU28)","v":22},{"$f":"IF(AZ28=\"\",\"\",AZ28)","v":"dsq"},{"$f":"IF(BE28=\"\",\"\",BE28)","v":15},{"$f":"IF(BJ28=\"\",\"\",BJ28)","v":""},null,{"$f":"AD28+AI28+AN28+AS28+AX28+BC28+BH28","v":76},{"$f":"IF($F28>=5,IF(AB28=\"\",\"\",AB28),\"\")","v":0},{"$f":"IF($F28>=5,IF(AG28=\"\",\"\",AG28),\"\")","v":0},{"$f":"IF($F28>=5,IF(AL28=\"\",\"\",AL28),\"\")","v":16},{"$f":"IF($F28>=5,IF(AQ28=\"\",\"\",AQ28),\"\")","v":10},{"$f":"IF($F28>=5,IF(AV28=\"\",\"\",AV28),\"\")","v":9},{"$f":"IF($F28>=5,IF(BA28=\"\",\"\",BA28),\"\")","v":0},{"$f":"IF($F28>=5,IF(BF28=\"\",\"\",BF28),\"\")","v":16},{"$f":"IF($F28>=5,IF(BK28=\"\",\"\",BK28),\"\")","v":0},null,null,{"$f":"IF(ISNUMBER(AA28),(VLOOKUP(AA28,$BO$6:$BP$50,2)),0)","v":0},{"$f":"IF(AA28<>\"\",5,0)","v":0},{"$f":"AB28+AC28","v":0},null,null,{"$f":"IF(ISNUMBER(AF28),(VLOOKUP(AF28,$BO$6:$BP$50,2)),0)","v":0},{"$f":"IF(AF28<>\"\",5,0)","v":0},{"$f":"AG28+AH28","v":0},null,15,{"$f":"IF(ISNUMBER(AK28),(VLOOKUP(AK28,$BO$6:$BP$50,2)),0)","v":16},{"$f":"IF(AK28<>\"\",5,0)","v":5},{"$f":"AL28+AM28","v":21},null,21,{"$f":"IF(ISNUMBER(AP28),(VLOOKUP(AP28,$BO$6:$BP$50,2)),0)","v":10},{"$f":"IF(AP28<>\"\",5,0)","v":5},{"$f":"AQ28+AR28","v":15},null,22,{"$f":"IF(ISNUMBER(AU28),(VLOOKUP(AU28,$BO$6:$BP$50,2)),0)","v":9},{"$f":"IF(AU28<>\"\",5,0)","v":5},{"$f":"AV28+AW28","v":14},null,"dsq",{"$f":"IF(ISNUMBER(AZ28),(VLOOKUP(AZ28,$BO$6:$BP$50,2)),0)","v":0},{"$f":"IF(AZ28<>\"\",5,0)","v":5},{"$f":"BA28+BB28","v":5},null,15,{"$f":"IF(ISNUMBER(BE28),(VLOOKUP(BE28,$BO$6:$BP$50,2)),0)","v":16},{"$f":"IF(BE28<>\"\",5,0)","v":5},{"$f":"BF28+BG28","v":21},null,null,{"$f":"IF(ISNUMBER(BJ28),(VLOOKUP(BJ28,$BO$6:$BP$50,2)),0)","v":0},{"$f":"IF(BJ28<>\"\",5,0)","v":0},{"$f":"BK28+BL28","v":0},null,23,8,0,{"$f":"IF($F23=7,1,0)","v":0},{"$f":"IF($F23=6,1,0)","v":0},{"$f":"IF($F23=5,1,0)","v":0},{"$f":"IF($F23=4,1,0)","v":1},{"$f":"IF($F23=3,1,0)","v":0},{"$f":"IF($F23=2,1,0)","v":0},{"$f":"IF($F23=1,1,0)","v":0}]
[{"$f":"IF(E29<E28,BO29,A28)","v":24},"Dynna","Nathalie Østnes","IRS",{"$f":"IF(F29<=4,Q29,(Q29-SUM(SMALL(R29:Y29,{1;2;3;4}))))","v":71},{"$f":"(IF(AC29=5,1,0)+IF(AH29=5,1,0)+IF(AM29=5,1,0)+IF(AR29=5,1,0)+IF(AW29=5,1,0)+IF(BB29=5,1,0)+IF(BG29=5,1,0)+IF(BL29=5,1,0))","v":4},null,{"$f":"IF(AA29=\"\",\"\",AA29)","v":11},{"$f":"IF(AF29=\"\",\"\",AF29)","v":"dsq"},{"$f":"IF(AK29=\"\",\"\",AK29)","v":""},{"$f":"IF(AP29=\"\",\"\",AP29)","v":16},{"$f":"IF(AU29=\"\",\"\",AU29)","v":19},{"$f":"IF(AZ29=\"\",\"\",AZ29)","v":""},{"$f":"IF(BE29=\"\",\"\",BE29)","v":""},{"$f":"IF(BJ29=\"\",\"\",BJ29)","v":""},null,{"$f":"AD29+AI29+AN29+AS29+AX29+BC29+BH29","v":71},{"$f":"IF($F29>=5,IF(AB29=\"\",\"\",AB29),\"\")","v":""},{"$f":"IF($F29>=5,IF(AG29=\"\",\"\",AG29),\"\")","v":""},{"$f":"IF($F29>=5,IF(AL29=\"\",\"\",AL29),\"\")","v":""},{"$f":"IF($F29>=5,IF(AQ29=\"\",\"\",AQ29),\"\")","v":""},{"$f":"IF($F29>=5,IF(AV29=\"\",\"\",AV29),\"\")","v":""},{"$f":"IF($F29>=5,IF(BA29=\"\",\"\",BA29),\"\")","v":""},{"$f":"IF($F29>=5,IF(BF29=\"\",\"\",BF29),\"\")","v":""},{"$f":"IF($F29>=5,IF(BK29=\"\",\"\",BK29),\"\")","v":""},null,11,{"$f":"IF(ISNUMBER(AA29),(VLOOKUP(AA29,$BO$6:$BP$50,2)),0)","v":24},{"$f":"IF(AA29<>\"\",5,0)","v":5},{"$f":"AB29+AC29","v":29},null,"dsq",{"$f":"IF(ISNUMBER(AF29),(VLOOKUP(AF29,$BO$6:$BP$50,2)),0)","v":0},{"$f":"IF(AF29<>\"\",5,0)","v":5},{"$f":"AG29+AH29","v":5},null,null,{"$f":"IF(ISNUMBER(AK29),(VLOOKUP(AK29,$BO$6:$BP$50,2)),0)","v":0},{"$f":"IF(AK29<>\"\",5,0)","v":0},{"$f":"AL29+AM29","v":0},null,16,{"$f":"IF(ISNUMBER(AP29),(VLOOKUP(AP29,$BO$6:$BP$50,2)),0)","v":15},{"$f":"IF(AP29<>\"\",5,0)","v":5},{"$f":"AQ29+AR29","v":20},null,19,{"$f":"IF(ISNUMBER(AU29),(VLOOKUP(AU29,$BO$6:$BP$50,2)),0)","v":12},{"$f":"IF(AU29<>\"\",5,0)","v":5},{"$f":"AV29+AW29","v":17},null,null,{"$f":"IF(ISNUMBER(AZ29),(VLOOKUP(AZ29,$BO$6:$BP$50,2)),0)","v":0},{"$f":"IF(AZ29<>\"\",5,0)","v":0},{"$f":"BA29+BB29","v":0},null,null,{"$f":"IF(ISNUMBER(BE29),(VLOOKUP(BE29,$BO$6:$BP$50,2)),0)","v":0},{"$f":"IF(BE29<>\"\",5,0)","v":0},{"$f":"BF29+BG29","v":0},null,null,{"$f":"IF(ISNUMBER(BJ29),(VLOOKUP(BJ29,$BO$6:$BP$50,2)),0)","v":0},{"$f":"IF(BJ29<>\"\",5,0)","v":0},{"$f":"BK29+BL29","v":0},null,24,7,0,{"$f":"IF($F24=7,1,0)","v":0},{"$f":"IF($F24=6,1,0)","v":0},{"$f":"IF($F24=5,1,0)","v":0},{"$f":"IF($F24=4,1,0)","v":1},{"$f":"IF($F24=3,1,0)","v":0},{"$f":"IF($F24=2,1,0)","v":0},{"$f":"IF($F24=1,1,0)","v":0}]
[{"$f":"IF(E30<E29,BO30,A29)","v":24},"Hystad","Fanny","HSIL",{"$f":"IF(F30<=4,Q30,(Q30-SUM(SMALL(R30:Y30,{1;2;3;4}))))","v":71},{"$f":"(IF(AC30=5,1,0)+IF(AH30=5,1,0)+IF(AM30=5,1,0)+IF(AR30=5,1,0)+IF(AW30=5,1,0)+IF(BB30=5,1,0)+IF(BG30=5,1,0)+IF(BL30=5,1,0))","v":3},null,{"$f":"IF(AA30=\"\",\"\",AA30)","v":""},{"$f":"IF(AF30=\"\",\"\",AF30)","v":""},{"$f":"IF(AK30=\"\",\"\",AK30)","v":21},{"$f":"IF(AP30=\"\",\"\",AP30)","v":""},{"$f":"IF(AU30=\"\",\"\",AU30)","v":""},{"$f":"IF(AZ30=\"\",\"\",AZ30)","v":12},{"$f":"IF(BE30=\"\",\"\",BE30)","v":11},{"$f":"IF(BJ30=\"\",\"\",BJ30)","v":""},null,{"$f":"AD30+AI30+AN30+AS30+AX30+BC30+BH30","v":71},{"$f":"IF($F30>=5,IF(AB30=\"\",\"\",AB30),\"\")","v":""},{"$f":"IF($F30>=5,IF(AG30=\"\",\"\",AG30),\"\")","v":""},{"$f":"IF($F30>=5,IF(AL30=\"\",\"\",AL30),\"\")","v":""},{"$f":"IF($F30>=5,IF(AQ30=\"\",\"\",AQ30),\"\")","v":""},{"$f":"IF($F30>=5,IF(AV30=\"\",\"\",AV30),\"\")","v":""},{"$f":"IF($F30>=5,IF(BA30=\"\",\"\",BA30),\"\")","v":""},{"$f":"IF($F30>=5,IF(BF30=\"\",\"\",BF30),\"\")","v":""},{"$f":"IF($F30>=5,IF(BK30=\"\",\"\",BK30),\"\")","v":""},null,null,{"$f":"IF(ISNUMBER(AA30),(VLOOKUP(AA30,$BO$6:$BP$50,2)),0)","v":0},{"$f":"IF(AA30<>\"\",5,0)","v":0},{"$f":"AB30+AC30","v":0},null,null,{"$f":"IF(ISNUMBER(AF30),(VLOOKUP(AF30,$BO$6:$BP$50,2)),0)","v":0},{"$f":"IF(AF30<>\"\",5,0)","v":0},{"$f":"AG30+AH30","v":0},null,21,{"$f":"IF(ISNUMBER(AK30),(VLOOKUP(AK30,$BO$6:$BP$50,2)),0)","v":10},{"$f":"IF(AK30<>\"\",5,0)","v":5},{"$f":"AL30+AM30","v":15},null,null,{"$f":"IF(ISNUMBER(AP30),(VLOOKUP(AP30,$BO$6:$BP$50,2)),0)","v":0},{"$f":"IF(AP30<>\"\",5,0)","v":0},{"$f":"AQ30+AR30","v":0},null,null,{"$f":"IF(ISNUMBER(AU30),(VLOOKUP(AU30,$BO$6:$BP$50,2)),0)","v":0},{"$f":"IF(AU30<>\"\",5,0)","v":0},{"$f":"AV30+AW30","v":0},null,12,{"$f":"IF(ISNUMBER(AZ30),(VLOOKUP(AZ30,$BO$6:$BP$50,2)),0)","v":22},{"$f":"IF(AZ30<>\"\",5,0)","v":5},{"$f":"BA30+BB30","v":27},null,11,{"$f":"IF(ISNUMBER(BE30),(VLOOKUP(BE30,$BO$6:$BP$50,2)),0)","v":24},{"$f":"IF(BE30<>\"\",5,0)","v":5},{"$f":"BF30+BG30","v":29},null,null,{"$f":"IF(ISNUMBER(BJ30),(VLOOKUP(BJ30,$BO$6:$BP$50,2)),0)","v":0},{"$f":"IF(BJ30<>\"\",5,0)","v":0},{"$f":"BK30+BL30","v":0},null,25,6,0,{"$f":"IF($F25=7,1,0)","v":0},{"$f":"IF($F25=6,1,0)","v":0},{"$f":"IF($F25=5,1,0)","v":0},{"$f":"IF($F25=4,1,0)","v":0},{"$f":"IF($F25=3,1,0)","v":1},{"$f":"IF($F25=2,1,0)","v":0},{"$f":"IF($F25=1,1,0)","v":0}]
[{"$f":"IF(E31<E30,BO31,A30)","v":26},"Hurlen","Hermine Erichsen","Njård",{"$f":"IF(F31<=4,Q31,(Q31-SUM(SMALL(R31:Y31,{1;2;3;4}))))","v":65},{"$f":"(IF(AC31=5,1,0)+IF(AH31=5,1,0)+IF(AM31=5,1,0)+IF(AR31=5,1,0)+IF(AW31=5,1,0)+IF(BB31=5,1,0)+IF(BG31=5,1,0)+IF(BL31=5,1,0))","v":5},null,{"$f":"IF(AA31=\"\",\"\",AA31)","v":""},{"$f":"IF(AF31=\"\",\"\",AF31)","v":""},{"$f":"IF(AK31=\"\",\"\",AK31)","v":26},{"$f":"IF(AP31=\"\",\"\",AP31)","v":22},{"$f":"IF(AU31=\"\",\"\",AU31)","v":28},{"$f":"IF(AZ31=\"\",\"\",AZ31)","v":16},{"$f":"IF(BE31=\"\",\"\",BE31)","v":20},{"$f":"IF(BJ31=\"\",\"\",BJ31)","v":""},null,{"$f":"AD31+AI31+AN31+AS31+AX31+BC31+BH31","v":68},{"$f":"IF($F31>=5,IF(AB31=\"\",\"\",AB31),\"\")","v":0},{"$f":"IF($F31>=5,IF(AG31=\"\",\"\",AG31),\"\")","v":0},{"$f":"IF($F31>=5,IF(AL31=\"\",\"\",AL31),\"\")","v":5},{"$f":"IF($F31>=5,IF(AQ31=\"\",\"\",AQ31),\"\")","v":9},{"$f":"IF($F31>=5,IF(AV31=\"\",\"\",AV31),\"\")","v":3},{"$f":"IF($F31>=5,IF(BA31=\"\",\"\",BA31),\"\")","v":15},{"$f":"IF($F31>=5,IF(BF31=\"\",\"\",BF31),\"\")","v":11},{"$f":"IF($F31>=5,IF(BK31=\"\",\"\",BK31),\"\")","v":0},null,null,{"$f":"IF(ISNUMBER(AA31),(VLOOKUP(AA31,$BO$6:$BP$50,2)),0)","v":0},{"$f":"IF(AA31<>\"\",5,0)","v":0},{"$f":"AB31+AC31","v":0},null,null,{"$f":"IF(ISNUMBER(AF31),(VLOOKUP(AF31,$BO$6:$BP$50,2)),0)","v":0},{"$f":"IF(AF31<>\"\",5,0)","v":0},{"$f":"AG31+AH31","v":0},null,26,{"$f":"IF(ISNUMBER(AK31),(VLOOKUP(AK31,$BO$6:$BP$50,2)),0)","v":5},{"$f":"IF(AK31<>\"\",5,0)","v":5},{"$f":"AL31+AM31","v":10},null,22,{"$f":"IF(ISNUMBER(AP31),(VLOOKUP(AP31,$BO$6:$BP$50,2)),0)","v":9},{"$f":"IF(AP31<>\"\",5,0)","v":5},{"$f":"AQ31+AR31","v":14},null,28,{"$f":"IF(ISNUMBER(AU31),(VLOOKUP(AU31,$BO$6:$BP$50,2)),0)","v":3},{"$f":"IF(AU31<>\"\",5,0)","v":5},{"$f":"AV31+AW31","v":8},null,16,{"$f":"IF(ISNUMBER(AZ31),(VLOOKUP(AZ31,$BO$6:$BP$50,2)),0)","v":15},{"$f":"IF(AZ31<>\"\",5,0)","v":5},{"$f":"BA31+BB31","v":20},null,20,{"$f":"IF(ISNUMBER(BE31),(VLOOKUP(BE31,$BO$6:$BP$50,2)),0)","v":11},{"$f":"IF(BE31<>\"\",5,0)","v":5},{"$f":"BF31+BG31","v":16},null,null,{"$f":"IF(ISNUMBER(BJ31),(VLOOKUP(BJ31,$BO$6:$BP$50,2)),0)","v":0},{"$f":"IF(BJ31<>\"\",5,0)","v":0},{"$f":"BK31+BL31","v":0},null,26,5,0,{"$f":"IF($F25=7,1,0)","v":0},{"$f":"IF($F25=6,1,0)","v":0},{"$f":"IF($F25=5,1,0)","v":0},{"$f":"IF($F25=4,1,0)","v":0},{"$f":"IF($F25=3,1,0)","v":1},{"$f":"IF($F25=2,1,0)","v":0},{"$f":"IF($F25=1,1,0)","v":0}]
[{"$f":"IF(E32<E31,BO32,A31)","v":27},"Rustad","PetronellaG","Njård",{"$f":"IF(F32<=4,Q32,(Q32-SUM(SMALL(R32:Y32,{1;2;3;4}))))","v":64},{"$f":"(IF(AC32=5,1,0)+IF(AH32=5,1,0)+IF(AM32=5,1,0)+IF(AR32=5,1,0)+IF(AW32=5,1,0)+IF(BB32=5,1,0)+IF(BG32=5,1,0)+IF(BL32=5,1,0))","v":4},null,{"$f":"IF(AA32=\"\",\"\",AA32)","v":17},{"$f":"IF(AF32=\"\",\"\",AF32)","v":""},{"$f":"IF(AK32=\"\",\"\",AK32)","v":19},{"$f":"IF(AP32=\"\",\"\",AP32)","v":14},{"$f":"IF(AU32=\"\",\"\",AU32)","v":"dnf"},{"$f":"IF(AZ32=\"\",\"\",AZ32)","v":""},{"$f":"IF(BE32=\"\",\"\",BE32)","v":""},{"$f":"IF(BJ32=\"\",\"\",BJ32)","v":""},null,{"$f":"AD32+AI32+AN32+AS32+AX32+BC32+BH32","v":64},{"$f":"IF($F32>=5,IF(AB32=\"\",\"\",AB32),\"\")","v":""},{"$f":"IF($F32>=5,IF(AG32=\"\",\"\",AG32),\"\")","v":""},{"$f":"IF($F32>=5,IF(AL32=\"\",\"\",AL32),\"\")","v":""},{"$f":"IF($F32>=5,IF(AQ32=\"\",\"\",AQ32),\"\")","v":""},{"$f":"IF($F32>=5,IF(AV32=\"\",\"\",AV32),\"\")","v":""},{"$f":"IF($F32>=5,IF(BA32=\"\",\"\",BA32),\"\")","v":""},{"$f":"IF($F32>=5,IF(BF32=\"\",\"\",BF32),\"\")","v":""},{"$f":"IF($F32>=5,IF(BK32=\"\",\"\",BK32),\"\")","v":""},null,17,{"$f":"IF(ISNUMBER(AA32),(VLOOKUP(AA32,$BO$6:$BP$50,2)),0)","v":14},{"$f":"IF(AA32<>\"\",5,0)","v":5},{"$f":"AB32+AC32","v":19},null,null,{"$f":"IF(ISNUMBER(AF32),(VLOOKUP(AF32,$BO$6:$BP$50,2)),0)","v":0},{"$f":"IF(AF32<>\"\",5,0)","v":0},{"$f":"AG32+AH32","v":0},null,19,{"$f":"IF(ISNUMBER(AK32),(VLOOKUP(AK32,$BO$6:$BP$50,2)),0)","v":12},{"$f":"IF(AK32<>\"\",5,0)","v":5},{"$f":"AL32+AM32","v":17},null,14,{"$f":"IF(ISNUMBER(AP32),(VLOOKUP(AP32,$BO$6:$BP$50,2)),0)","v":18},{"$f":"IF(AP32<>\"\",5,0)","v":5},{"$f":"AQ32+AR32","v":23},null,"dnf",{"$f":"IF(ISNUMBER(AU32),(VLOOKUP(AU32,$BO$6:$BP$50,2)),0)","v":0},{"$f":"IF(AU32<>\"\",5,0)","v":5},{"$f":"AV32+AW32","v":5},null,null,{"$f":"IF(ISNUMBER(AZ32),(VLOOKUP(AZ32,$BO$6:$BP$50,2)),0)","v":0},{"$f":"IF(AZ32<>\"\",5,0)","v":0},{"$f":"BA32+BB32","v":0},null,null,{"$f":"IF(ISNUMBER(BE32),(VLOOKUP(BE32,$BO$6:$BP$50,2)),0)","v":0},{"$f":"IF(BE32<>\"\",5,0)","v":0},{"$f":"BF32+BG32","v":0},null,null,{"$f":"IF(ISNUMBER(BJ32),(VLOOKUP(BJ32,$BO$6:$BP$50,2)),0)","v":0},{"$f":"IF(BJ32<>\"\",5,0)","v":0},{"$f":"BK32+BL32","v":0},null,27,4,0,{"$f":"IF($F26=7,1,0)","v":0},{"$f":"IF($F26=6,1,0)","v":0},{"$f":"IF($F26=5,1,0)","v":0},{"$f":"IF($F26=4,1,0)","v":0},{"$f":"IF($F26=3,1,0)","v":0},{"$f":"IF($F26=2,1,0)","v":0},{"$f":"IF($F26=1,1,0)","v":1}]
[{"$f":"IF(E33<E32,BO33,A32)","v":28},"Swenson","Lily Aster Larsdatter","Ljan",{"$f":"IF(F33<=4,Q33,(Q33-SUM(SMALL(R33:Y33,{1;2;3;4}))))","v":63},{"$f":"(IF(AC33=5,1,0)+IF(AH33=5,1,0)+IF(AM33=5,1,0)+IF(AR33=5,1,0)+IF(AW33=5,1,0)+IF(BB33=5,1,0)+IF(BG33=5,1,0)+IF(BL33=5,1,0))","v":4},null,{"$f":"IF(AA33=\"\",\"\",AA33)","v":"dsq"},{"$f":"IF(AF33=\"\",\"\",AF33)","v":13},{"$f":"IF(AK33=\"\",\"\",AK33)","v":""},{"$f":"IF(AP33=\"\",\"\",AP33)","v":15},{"$f":"IF(AU33=\"\",\"\",AU33)","v":24},{"$f":"IF(AZ33=\"\",\"\",AZ33)","v":""},{"$f":"IF(BE33=\"\",\"\",BE33)","v":""},{"$f":"IF(BJ33=\"\",\"\",BJ33)","v":""},null,{"$f":"AD33+AI33+AN33+AS33+AX33+BC33+BH33","v":63},{"$f":"IF($F33>=5,IF(AB33=\"\",\"\",AB33),\"\")","v":""},{"$f":"IF($F33>=5,IF(AG33=\"\",\"\",AG33),\"\")","v":""},{"$f":"IF($F33>=5,IF(AL33=\"\",\"\",AL33),\"\")","v":""},{"$f":"IF($F33>=5,IF(AQ33=\"\",\"\",AQ33),\"\")","v":""},{"$f":"IF($F33>=5,IF(AV33=\"\",\"\",AV33),\"\")","v":""},{"$f":"IF($F33>=5,IF(BA33=\"\",\"\",BA33),\"\")","v":""},{"$f":"IF($F33>=5,IF(BF33=\"\",\"\",BF33),\"\")","v":""},{"$f":"IF($F33>=5,IF(BK33=\"\",\"\",BK33),\"\")","v":""},null,"dsq",{"$f":"IF(ISNUMBER(AA33),(VLOOKUP(AA33,$BO$6:$BP$50,2)),0)","v":0},{"$f":"IF(AA33<>\"\",5,0)","v":5},{"$f":"AB33+AC33","v":5},null,13,{"$f":"IF(ISNUMBER(AF33),(VLOOKUP(AF33,$BO$6:$BP$50,2)),0)","v":20},{"$f":"IF(AF33<>\"\",5,0)","v":5},{"$f":"AG33+AH33","v":25},null,null,{"$f":"IF(ISNUMBER(AK33),(VLOOKUP(AK33,$BO$6:$BP$50,2)),0)","v":0},{"$f":"IF(AK33<>\"\",5,0)","v":0},{"$f":"AL33+AM33","v":0},null,15,{"$f":"IF(ISNUMBER(AP33),(VLOOKUP(AP33,$BO$6:$BP$50,2)),0)","v":16},{"$f":"IF(AP33<>\"\",5,0)","v":5},{"$f":"AQ33+AR33","v":21},null,24,{"$f":"IF(ISNUMBER(AU33),(VLOOKUP(AU33,$BO$6:$BP$50,2)),0)","v":7},{"$f":"IF(AU33<>\"\",5,0)","v":5},{"$f":"AV33+AW33","v":12},null,null,{"$f":"IF(ISNUMBER(AZ33),(VLOOKUP(AZ33,$BO$6:$BP$50,2)),0)","v":0},{"$f":"IF(AZ33<>\"\",5,0)","v":0},{"$f":"BA33+BB33","v":0},null,null,{"$f":"IF(ISNUMBER(BE33),(VLOOKUP(BE33,$BO$6:$BP$50,2)),0)","v":0},{"$f":"IF(BE33<>\"\",5,0)","v":0},{"$f":"BF33+BG33","v":0},null,null,{"$f":"IF(ISNUMBER(BJ33),(VLOOKUP(BJ33,$BO$6:$BP$50,2)),0)","v":0},{"$f":"IF(BJ33<>\"\",5,0)","v":0},{"$f":"BK33+BL33","v":0},null,28,3,0,0,1,0,0,0,0,0]
[{"$f":"IF(E34<E33,BO34,A33)","v":29},"Talen","Henriette Young","Heming",{"$f":"IF(F34<=4,Q34,(Q34-SUM(SMALL(R34:Y34,{1;2;3;4}))))","v":62},{"$f":"(IF(AC34=5,1,0)+IF(AH34=5,1,0)+IF(AM34=5,1,0)+IF(AR34=5,1,0)+IF(AW34=5,1,0)+IF(BB34=5,1,0)+IF(BG34=5,1,0)+IF(BL34=5,1,0))","v":3},null,{"$f":"IF(AA34=\"\",\"\",AA34)","v":16},{"$f":"IF(AF34=\"\",\"\",AF34)","v":12},{"$f":"IF(AK34=\"\",\"\",AK34)","v":""},{"$f":"IF(AP34=\"\",\"\",AP34)","v":""},{"$f":"IF(AU34=\"\",\"\",AU34)","v":21},{"$f":"IF(AZ34=\"\",\"\",AZ34)","v":""},{"$f":"IF(BE34=\"\",\"\",BE34)","v":""},{"$f":"IF(BJ34=\"\",\"\",BJ34)","v":""},null,{"$f":"AD34+AI34+AN34+AS34+AX34+BC34+BH34","v":62},{"$f":"IF($F34>=5,IF(AB34=\"\",\"\",AB34),\"\")","v":""},{"$f":"IF($F34>=5,IF(AG34=\"\",\"\",AG34),\"\")","v":""},{"$f":"IF($F34>=5,IF(AL34=\"\",\"\",AL34),\"\")","v":""},{"$f":"IF($F34>=5,IF(AQ34=\"\",\"\",AQ34),\"\")","v":""},{"$f":"IF($F34>=5,IF(AV34=\"\",\"\",AV34),\"\")","v":""},{"$f":"IF($F34>=5,IF(BA34=\"\",\"\",BA34),\"\")","v":""},{"$f":"IF($F34>=5,IF(BF34=\"\",\"\",BF34),\"\")","v":""},{"$f":"IF($F34>=5,IF(BK34=\"\",\"\",BK34),\"\")","v":""},null,16,{"$f":"IF(ISNUMBER(AA34),(VLOOKUP(AA34,$BO$6:$BP$50,2)),0)","v":15},{"$f":"IF(AA34<>\"\",5,0)","v":5},{"$f":"AB34+AC34","v":20},null,12,{"$f":"IF(ISNUMBER(AF34),(VLOOKUP(AF34,$BO$6:$BP$50,2)),0)","v":22},{"$f":"IF(AF34<>\"\",5,0)","v":5},{"$f":"AG34+AH34","v":27},null,null,{"$f":"IF(ISNUMBER(AK34),(VLOOKUP(AK34,$BO$6:$BP$50,2)),0)","v":0},{"$f":"IF(AK34<>\"\",5,0)","v":0},{"$f":"AL34+AM34","v":0},null,null,{"$f":"IF(ISNUMBER(AP34),(VLOOKUP(AP34,$BO$6:$BP$50,2)),0)","v":0},{"$f":"IF(AP34<>\"\",5,0)","v":0},{"$f":"AQ34+AR34","v":0},null,21,{"$f":"IF(ISNUMBER(AU34),(VLOOKUP(AU34,$BO$6:$BP$50,2)),0)","v":10},{"$f":"IF(AU34<>\"\",5,0)","v":5},{"$f":"AV34+AW34","v":15},null,null,{"$f":"IF(ISNUMBER(AZ34),(VLOOKUP(AZ34,$BO$6:$BP$50,2)),0)","v":0},{"$f":"IF(AZ34<>\"\",5,0)","v":0},{"$f":"BA34+BB34","v":0},null,null,{"$f":"IF(ISNUMBER(BE34),(VLOOKUP(BE34,$BO$6:$BP$50,2)),0)","v":0},{"$f":"IF(BE34<>\"\",5,0)","v":0},{"$f":"BF34+BG34","v":0},null,null,{"$f":"IF(ISNUMBER(BJ34),(VLOOKUP(BJ34,$BO$6:$BP$50,2)),0)","v":0},{"$f":"IF(BJ34<>\"\",5,0)","v":0},{"$f":"BK34+BL34","v":0},null,29,2,0,0,0,1,0,0,0,0]
[{"$f":"IF(E35<E34,BO35,A34)","v":30},"Botten","Maren Stavseng","Rælingen",{"$f":"IF(F35<=4,Q35,(Q35-SUM(SMALL(R35:Y35,{1;2;3;4}))))","v":60},{"$f":"(IF(AC35=5,1,0)+IF(AH35=5,1,0)+IF(AM35=5,1,0)+IF(AR35=5,1,0)+IF(AW35=5,1,0)+IF(BB35=5,1,0)+IF(BG35=5,1,0)+IF(BL35=5,1,0))","v":2},null,{"$f":"IF(AA35=\"\",\"\",AA35)","v":""},{"$f":"IF(AF35=\"\",\"\",AF35)","v":""},{"$f":"IF(AK35=\"\",\"\",AK35)","v":""},{"$f":"IF(AP35=\"\",\"\",AP35)","v":""},{"$f":"IF(AU35=\"\",\"\",AU35)","v":11},{"$f":"IF(AZ35=\"\",\"\",AZ35)","v":10},{"$f":"IF(BE35=\"\",\"\",BE35)","v":""},{"$f":"IF(BJ35=\"\",\"\",BJ35)","v":""},null,{"$f":"AD35+AI35+AN35+AS35+AX35+BC35+BH35","v":60},{"$f":"IF($F35>=5,IF(AB35=\"\",\"\",AB35),\"\")","v":""},{"$f":"IF($F35>=5,IF(AG35=\"\",\"\",AG35),\"\")","v":""},{"$f":"IF($F35>=5,IF(AL35=\"\",\"\",AL35),\"\")","v":""},{"$f":"IF($F35>=5,IF(AQ35=\"\",\"\",AQ35),\"\")","v":""},{"$f":"IF($F35>=5,IF(AV35=\"\",\"\",AV35),\"\")","v":""},{"$f":"IF($F35>=5,IF(BA35=\"\",\"\",BA35),\"\")","v":""},{"$f":"IF($F35>=5,IF(BF35=\"\",\"\",BF35),\"\")","v":""},{"$f":"IF($F35>=5,IF(BK35=\"\",\"\",BK35),\"\")","v":""},null,null,{"$f":"IF(ISNUMBER(AA35),(VLOOKUP(AA35,$BO$6:$BP$50,2)),0)","v":0},{"$f":"IF(AA35<>\"\",5,0)","v":0},{"$f":"AB35+AC35","v":0},null,null,{"$f":"IF(ISNUMBER(AF35),(VLOOKUP(AF35,$BO$6:$BP$50,2)),0)","v":0},{"$f":"IF(AF35<>\"\",5,0)","v":0},{"$f":"AG35+AH35","v":0},null,null,{"$f":"IF(ISNUMBER(AK35),(VLOOKUP(AK35,$BO$6:$BP$50,2)),0)","v":0},{"$f":"IF(AK35<>\"\",5,0)","v":0},{"$f":"AL35+AM35","v":0},null,null,{"$f":"IF(ISNUMBER(AP35),(VLOOKUP(AP35,$BO$6:$BP$50,2)),0)","v":0},{"$f":"IF(AP35<>\"\",5,0)","v":0},{"$f":"AQ35+AR35","v":0},null,11,{"$f":"IF(ISNUMBER(AU35),(VLOOKUP(AU35,$BO$6:$BP$50,2)),0)","v":24},{"$f":"IF(AU35<>\"\",5,0)","v":5},{"$f":"AV35+AW35","v":29},null,10,{"$f":"IF(ISNUMBER(AZ35),(VLOOKUP(AZ35,$BO$6:$BP$50,2)),0)","v":26},{"$f":"IF(AZ35<>\"\",5,0)","v":5},{"$f":"BA35+BB35","v":31},null,null,{"$f":"IF(ISNUMBER(BE35),(VLOOKUP(BE35,$BO$6:$BP$50,2)),0)","v":0},{"$f":"IF(BE35<>\"\",5,0)","v":0},{"$f":"BF35+BG35","v":0},null,null,{"$f":"IF(ISNUMBER(BJ35),(VLOOKUP(BJ35,$BO$6:$BP$50,2)),0)","v":0},{"$f":"IF(BJ35<>\"\",5,0)","v":0},{"$f":"BK35+BL35","v":0},null,30,1,0,{"$f":"IF($F26=7,1,0)","v":0},{"$f":"IF($F26=6,1,0)","v":0},{"$f":"IF($F26=5,1,0)","v":0},{"$f":"IF($F26=4,1,0)","v":0},{"$f":"IF($F26=3,1,0)","v":0},{"$f":"IF($F26=2,1,0)","v":0},{"$f":"IF($F26=1,1,0)","v":1}]
[{"$f":"IF(E36<E35,BO36,A35)","v":31},"Moen","Magda","Kjelsås",{"$f":"IF(F36<=4,Q36,(Q36-SUM(SMALL(R36:Y36,{1;2;3;4}))))","v":59},{"$f":"(IF(AC36=5,1,0)+IF(AH36=5,1,0)+IF(AM36=5,1,0)+IF(AR36=5,1,0)+IF(AW36=5,1,0)+IF(BB36=5,1,0)+IF(BG36=5,1,0)+IF(BL36=5,1,0))","v":4},null,{"$f":"IF(AA36=\"\",\"\",AA36)","v":""},{"$f":"IF(AF36=\"\",\"\",AF36)","v":"dsq"},{"$f":"IF(AK36=\"\",\"\",AK36)","v":16},{"$f":"IF(AP36=\"\",\"\",AP36)","v":11},{"$f":"IF(AU36=\"\",\"\",AU36)","v":""},{"$f":"IF(AZ36=\"\",\"\",AZ36)","v":""},{"$f":"IF(BE36=\"\",\"\",BE36)","v":"dsq"},{"$f":"IF(BJ36=\"\",\"\",BJ36)","v":""},null,{"$f":"AD36+AI36+AN36+AS36+AX36+BC36+BH36","v":59},{"$f":"IF($F36>=5,IF(AB36=\"\",\"\",AB36),\"\")","v":""},{"$f":"IF($F36>=5,IF(AG36=\"\",\"\",AG36),\"\")","v":""},{"$f":"IF($F36>=5,IF(AL36=\"\",\"\",AL36),\"\")","v":""},{"$f":"IF($F36>=5,IF(AQ36=\"\",\"\",AQ36),\"\")","v":""},{"$f":"IF($F36>=5,IF(AV36=\"\",\"\",AV36),\"\")","v":""},{"$f":"IF($F36>=5,IF(BA36=\"\",\"\",BA36),\"\")","v":""},{"$f":"IF($F36>=5,IF(BF36=\"\",\"\",BF36),\"\")","v":""},{"$f":"IF($F36>=5,IF(BK36=\"\",\"\",BK36),\"\")","v":""},null,null,{"$f":"IF(ISNUMBER(AA36),(VLOOKUP(AA36,$BO$6:$BP$50,2)),0)","v":0},{"$f":"IF(AA36<>\"\",5,0)","v":0},{"$f":"AB36+AC36","v":0},null,"dsq",{"$f":"IF(ISNUMBER(AF36),(VLOOKUP(AF36,$BO$6:$BP$50,2)),0)","v":0},{"$f":"IF(AF36<>\"\",5,0)","v":5},{"$f":"AG36+AH36","v":5},null,16,{"$f":"IF(ISNUMBER(AK36),(VLOOKUP(AK36,$BO$6:$BP$50,2)),0)","v":15},{"$f":"IF(AK36<>\"\",5,0)","v":5},{"$f":"AL36+AM36","v":20},null,11,{"$f":"IF(ISNUMBER(AP36),(VLOOKUP(AP36,$BO$6:$BP$50,2)),0)","v":24},{"$f":"IF(AP36<>\"\",5,0)","v":5},{"$f":"AQ36+AR36","v":29},null,null,{"$f":"IF(ISNUMBER(AU36),(VLOOKUP(AU36,$BO$6:$BP$50,2)),0)","v":0},{"$f":"IF(AU36<>\"\",5,0)","v":0},{"$f":"AV36+AW36","v":0},null,null,{"$f":"IF(ISNUMBER(AZ36),(VLOOKUP(AZ36,$BO$6:$BP$50,2)),0)","v":0},{"$f":"IF(AZ36<>\"\",5,0)","v":0},{"$f":"BA36+BB36","v":0},null,"dsq",{"$f":"IF(ISNUMBER(BE36),(VLOOKUP(BE36,$BO$6:$BP$50,2)),0)","v":0},{"$f":"IF(BE36<>\"\",5,0)","v":5},{"$f":"BF36+BG36","v":5},null,null,{"$f":"IF(ISNUMBER(BJ36),(VLOOKUP(BJ36,$BO$6:$BP$50,2)),0)","v":0},{"$f":"IF(BJ36<>\"\",5,0)","v":0},{"$f":"BK36+BL36","v":0},null,31,0,0,0,1,0,0,0,0,0]
[{"$f":"IF(E37<E36,BO37,A36)","v":32},"Bruseth","Sienna Grande","Ullensaker",{"$f":"IF(F37<=4,Q37,(Q37-SUM(SMALL(R37:Y37,{1;2;3;4}))))","v":57},{"$f":"(IF(AC37=5,1,0)+IF(AH37=5,1,0)+IF(AM37=5,1,0)+IF(AR37=5,1,0)+IF(AW37=5,1,0)+IF(BB37=5,1,0)+IF(BG37=5,1,0)+IF(BL37=5,1,0))","v":3},null,{"$f":"IF(AA37=\"\",\"\",AA37)","v":""},{"$f":"IF(AF37=\"\",\"\",AF37)","v":""},{"$f":"IF(AK37=\"\",\"\",AK37)","v":13},{"$f":"IF(AP37=\"\",\"\",AP37)","v":""},{"$f":"IF(AU37=\"\",\"\",AU37)","v":29},{"$f":"IF(AZ37=\"\",\"\",AZ37)","v":13},{"$f":"IF(BE37=\"\",\"\",BE37)","v":""},{"$f":"IF(BJ37=\"\",\"\",BJ37)","v":""},null,{"$f":"AD37+AI37+AN37+AS37+AX37+BC37+BH37","v":57},{"$f":"IF($F37>=5,IF(AB37=\"\",\"\",AB37),\"\")","v":""},{"$f":"IF($F37>=5,IF(AG37=\"\",\"\",AG37),\"\")","v":""},{"$f":"IF($F37>=5,IF(AL37=\"\",\"\",AL37),\"\")","v":""},{"$f":"IF($F37>=5,IF(AQ37=\"\",\"\",AQ37),\"\")","v":""},{"$f":"IF($F37>=5,IF(AV37=\"\",\"\",AV37),\"\")","v":""},{"$f":"IF($F37>=5,IF(BA37=\"\",\"\",BA37),\"\")","v":""},{"$f":"IF($F37>=5,IF(BF37=\"\",\"\",BF37),\"\")","v":""},{"$f":"IF($F37>=5,IF(BK37=\"\",\"\",BK37),\"\")","v":""},null,null,{"$f":"IF(ISNUMBER(AA37),(VLOOKUP(AA37,$BO$6:$BP$50,2)),0)","v":0},{"$f":"IF(AA37<>\"\",5,0)","v":0},{"$f":"AB37+AC37","v":0},null,null,{"$f":"IF(ISNUMBER(AF37),(VLOOKUP(AF37,$BO$6:$BP$50,2)),0)","v":0},{"$f":"IF(AF37<>\"\",5,0)","v":0},{"$f":"AG37+AH37","v":0},null,13,{"$f":"IF(ISNUMBER(AK37),(VLOOKUP(AK37,$BO$6:$BP$50,2)),0)","v":20},{"$f":"IF(AK37<>\"\",5,0)","v":5},{"$f":"AL37+AM37","v":25},null,null,{"$f":"IF(ISNUMBER(AP37),(VLOOKUP(AP37,$BO$6:$BP$50,2)),0)","v":0},{"$f":"IF(AP37<>\"\",5,0)","v":0},{"$f":"AQ37+AR37","v":0},null,29,{"$f":"IF(ISNUMBER(AU37),(VLOOKUP(AU37,$BO$6:$BP$50,2)),0)","v":2},{"$f":"IF(AU37<>\"\",5,0)","v":5},{"$f":"AV37+AW37","v":7},null,13,{"$f":"IF(ISNUMBER(AZ37),(VLOOKUP(AZ37,$BO$6:$BP$50,2)),0)","v":20},{"$f":"IF(AZ37<>\"\",5,0)","v":5},{"$f":"BA37+BB37","v":25},null,null,{"$f":"IF(ISNUMBER(BE37),(VLOOKUP(BE37,$BO$6:$BP$50,2)),0)","v":0},{"$f":"IF(BE37<>\"\",5,0)","v":0},{"$f":"BF37+BG37","v":0},null,null,{"$f":"IF(ISNUMBER(BJ37),(VLOOKUP(BJ37,$BO$6:$BP$50,2)),0)","v":0},{"$f":"IF(BJ37<>\"\",5,0)","v":0},{"$f":"BK37+BL37","v":0},null,32,0,0,0,0,1,0,0,0,0]
[{"$f":"IF(E38<E37,BO38,A37)","v":33},"Lunde","Fryd","Kjelsås",{"$f":"IF(F38<=4,Q38,(Q38-SUM(SMALL(R38:Y38,{1;2;3;4}))))","v":38},{"$f":"(IF(AC38=5,1,0)+IF(AH38=5,1,0)+IF(AM38=5,1,0)+IF(AR38=5,1,0)+IF(AW38=5,1,0)+IF(BB38=5,1,0)+IF(BG38=5,1,0)+IF(BL38=5,1,0))","v":2},null,{"$f":"IF(AA38=\"\",\"\",AA38)","v":""},{"$f":"IF(AF38=\"\",\"\",AF38)","v":""},{"$f":"IF(AK38=\"\",\"\",AK38)","v":""},{"$f":"IF(AP38=\"\",\"\",AP38)","v":""},{"$f":"IF(AU38=\"\",\"\",AU38)","v":""},{"$f":"IF(AZ38=\"\",\"\",AZ38)","v":15},{"$f":"IF(BE38=\"\",\"\",BE38)","v":19},{"$f":"IF(BJ38=\"\",\"\",BJ38)","v":""},null,{"$f":"AD38+AI38+AN38+AS38+AX38+BC38+BH38","v":38},{"$f":"IF($F38>=5,IF(AB38=\"\",\"\",AB38),\"\")","v":""},{"$f":"IF($F38>=5,IF(AG38=\"\",\"\",AG38),\"\")","v":""},{"$f":"IF($F38>=5,IF(AL38=\"\",\"\",AL38),\"\")","v":""},{"$f":"IF($F38>=5,IF(AQ38=\"\",\"\",AQ38),\"\")","v":""},{"$f":"IF($F38>=5,IF(AV38=\"\",\"\",AV38),\"\")","v":""},{"$f":"IF($F38>=5,IF(BA38=\"\",\"\",BA38),\"\")","v":""},{"$f":"IF($F38>=5,IF(BF38=\"\",\"\",BF38),\"\")","v":""},{"$f":"IF($F38>=5,IF(BK38=\"\",\"\",BK38),\"\")","v":""},null,null,{"$f":"IF(ISNUMBER(AA38),(VLOOKUP(AA38,$BO$6:$BP$50,2)),0)","v":0},{"$f":"IF(AA38<>\"\",5,0)","v":0},{"$f":"AB38+AC38","v":0},null,null,{"$f":"IF(ISNUMBER(AF38),(VLOOKUP(AF38,$BO$6:$BP$50,2)),0)","v":0},{"$f":"IF(AF38<>\"\",5,0)","v":0},{"$f":"AG38+AH38","v":0},null,null,{"$f":"IF(ISNUMBER(AK38),(VLOOKUP(AK38,$BO$6:$BP$50,2)),0)","v":0},{"$f":"IF(AK38<>\"\",5,0)","v":0},{"$f":"AL38+AM38","v":0},null,null,{"$f":"IF(ISNUMBER(AP38),(VLOOKUP(AP38,$BO$6:$BP$50,2)),0)","v":0},{"$f":"IF(AP38<>\"\",5,0)","v":0},{"$f":"AQ38+AR38","v":0},null,null,{"$f":"IF(ISNUMBER(AU38),(VLOOKUP(AU38,$BO$6:$BP$50,2)),0)","v":0},{"$f":"IF(AU38<>\"\",5,0)","v":0},{"$f":"AV38+AW38","v":0},null,15,{"$f":"IF(ISNUMBER(AZ38),(VLOOKUP(AZ38,$BO$6:$BP$50,2)),0)","v":16},{"$f":"IF(AZ38<>\"\",5,0)","v":5},{"$f":"BA38+BB38","v":21},null,19,{"$f":"IF(ISNUMBER(BE38),(VLOOKUP(BE38,$BO$6:$BP$50,2)),0)","v":12},{"$f":"IF(BE38<>\"\",5,0)","v":5},{"$f":"BF38+BG38","v":17},null,null,{"$f":"IF(ISNUMBER(BJ38),(VLOOKUP(BJ38,$BO$6:$BP$50,2)),0)","v":0},{"$f":"IF(BJ38<>\"\",5,0)","v":0},{"$f":"BK38+BL38","v":0},null,33,0,0,0,0,0,1,0,0,0]
[{"$f":"IF(E39<E38,BO39,A38)","v":34},"Johannessen","Selma Berg","Rælingen",{"$f":"IF(F39<=4,Q39,(Q39-SUM(SMALL(R39:Y39,{1;2;3;4}))))","v":37},{"$f":"(IF(AC39=5,1,0)+IF(AH39=5,1,0)+IF(AM39=5,1,0)+IF(AR39=5,1,0)+IF(AW39=5,1,0)+IF(BB39=5,1,0)+IF(BG39=5,1,0)+IF(BL39=5,1,0))","v":1},null,{"$f":"IF(AA39=\"\",\"\",AA39)","v":""},{"$f":"IF(AF39=\"\",\"\",AF39)","v":""},{"$f":"IF(AK39=\"\",\"\",AK39)","v":""},{"$f":"IF(AP39=\"\",\"\",AP39)","v":""},{"$f":"IF(AU39=\"\",\"\",AU39)","v":8},{"$f":"IF(AZ39=\"\",\"\",AZ39)","v":""},{"$f":"IF(BE39=\"\",\"\",BE39)","v":""},{"$f":"IF(BJ39=\"\",\"\",BJ39)","v":""},null,{"$f":"AD39+AI39+AN39+AS39+AX39+BC39+BH39","v":37},{"$f":"IF($F39>=5,IF(AB39=\"\",\"\",AB39),\"\")","v":""},{"$f":"IF($F39>=5,IF(AG39=\"\",\"\",AG39),\"\")","v":""},{"$f":"IF($F39>=5,IF(AL39=\"\",\"\",AL39),\"\")","v":""},{"$f":"IF($F39>=5,IF(AQ39=\"\",\"\",AQ39),\"\")","v":""},{"$f":"IF($F39>=5,IF(AV39=\"\",\"\",AV39),\"\")","v":""},{"$f":"IF($F39>=5,IF(BA39=\"\",\"\",BA39),\"\")","v":""},{"$f":"IF($F39>=5,IF(BF39=\"\",\"\",BF39),\"\")","v":""},{"$f":"IF($F39>=5,IF(BK39=\"\",\"\",BK39),\"\")","v":""},null,null,{"$f":"IF(ISNUMBER(AA39),(VLOOKUP(AA39,$BO$6:$BP$50,2)),0)","v":0},{"$f":"IF(AA39<>\"\",5,0)","v":0},{"$f":"AB39+AC39","v":0},null,null,{"$f":"IF(ISNUMBER(AF39),(VLOOKUP(AF39,$BO$6:$BP$50,2)),0)","v":0},{"$f":"IF(AF39<>\"\",5,0)","v":0},{"$f":"AG39+AH39","v":0},null,null,{"$f":"IF(ISNUMBER(AK39),(VLOOKUP(AK39,$BO$6:$BP$50,2)),0)","v":0},{"$f":"IF(AK39<>\"\",5,0)","v":0},{"$f":"AL39+AM39","v":0},null,null,{"$f":"IF(ISNUMBER(AP39),(VLOOKUP(AP39,$BO$6:$BP$50,2)),0)","v":0},{"$f":"IF(AP39<>\"\",5,0)","v":0},{"$f":"AQ39+AR39","v":0},null,8,{"$f":"IF(ISNUMBER(AU39),(VLOOKUP(AU39,$BO$6:$BP$50,2)),0)","v":32},{"$f":"IF(AU39<>\"\",5,0)","v":5},{"$f":"AV39+AW39","v":37},null,null,{"$f":"IF(ISNUMBER(AZ39),(VLOOKUP(AZ39,$BO$6:$BP$50,2)),0)","v":0},{"$f":"IF(AZ39<>\"\",5,0)","v":0},{"$f":"BA39+BB39","v":0},null,null,{"$f":"IF(ISNUMBER(BE39),(VLOOKUP(BE39,$BO$6:$BP$50,2)),0)","v":0},{"$f":"IF(BE39<>\"\",5,0)","v":0},{"$f":"BF39+BG39","v":0},null,null,{"$f":"IF(ISNUMBER(BJ39),(VLOOKUP(BJ39,$BO$6:$BP$50,2)),0)","v":0},{"$f":"IF(BJ39<>\"\",5,0)","v":0},{"$f":"BK39+BL39","v":0},null,34,0,0,0,0,0,0,1,0,0]
[{"$f":"IF(E40<E39,BO40,A39)","v":35},"Lundberg","Martine","Rælingen",{"$f":"IF(F40<=4,Q40,(Q40-SUM(SMALL(R40:Y40,{1;2;3;4}))))","v":31},{"$f":"(IF(AC40=5,1,0)+IF(AH40=5,1,0)+IF(AM40=5,1,0)+IF(AR40=5,1,0)+IF(AW40=5,1,0)+IF(BB40=5,1,0)+IF(BG40=5,1,0)+IF(BL40=5,1,0))","v":1},null,{"$f":"IF(AA40=\"\",\"\",AA40)","v":""},{"$f":"IF(AF40=\"\",\"\",AF40)","v":""},{"$f":"IF(AK40=\"\",\"\",AK40)","v":""},{"$f":"IF(AP40=\"\",\"\",AP40)","v":""},{"$f":"IF(AU40=\"\",\"\",AU40)","v":10},{"$f":"IF(AZ40=\"\",\"\",AZ40)","v":""},{"$f":"IF(BE40=\"\",\"\",BE40)","v":""},{"$f":"IF(BJ40=\"\",\"\",BJ40)","v":""},null,{"$f":"AD40+AI40+AN40+AS40+AX40+BC40+BH40","v":31},{"$f":"IF($F40>=5,IF(AB40=\"\",\"\",AB40),\"\")","v":""},{"$f":"IF($F40>=5,IF(AG40=\"\",\"\",AG40),\"\")","v":""},{"$f":"IF($F40>=5,IF(AL40=\"\",\"\",AL40),\"\")","v":""},{"$f":"IF($F40>=5,IF(AQ40=\"\",\"\",AQ40),\"\")","v":""},{"$f":"IF($F40>=5,IF(AV40=\"\",\"\",AV40),\"\")","v":""},{"$f":"IF($F40>=5,IF(BA40=\"\",\"\",BA40),\"\")","v":""},{"$f":"IF($F40>=5,IF(BF40=\"\",\"\",BF40),\"\")","v":""},{"$f":"IF($F40>=5,IF(BK40=\"\",\"\",BK40),\"\")","v":""},null,null,{"$f":"IF(ISNUMBER(AA40),(VLOOKUP(AA40,$BO$6:$BP$50,2)),0)","v":0},{"$f":"IF(AA40<>\"\",5,0)","v":0},{"$f":"AB40+AC40","v":0},null,null,{"$f":"IF(ISNUMBER(AF40),(VLOOKUP(AF40,$BO$6:$BP$50,2)),0)","v":0},{"$f":"IF(AF40<>\"\",5,0)","v":0},{"$f":"AG40+AH40","v":0},null,null,{"$f":"IF(ISNUMBER(AK40),(VLOOKUP(AK40,$BO$6:$BP$50,2)),0)","v":0},{"$f":"IF(AK40<>\"\",5,0)","v":0},{"$f":"AL40+AM40","v":0},null,null,{"$f":"IF(ISNUMBER(AP40),(VLOOKUP(AP40,$BO$6:$BP$50,2)),0)","v":0},{"$f":"IF(AP40<>\"\",5,0)","v":0},{"$f":"AQ40+AR40","v":0},null,10,{"$f":"IF(ISNUMBER(AU40),(VLOOKUP(AU40,$BO$6:$BP$50,2)),0)","v":26},{"$f":"IF(AU40<>\"\",5,0)","v":5},{"$f":"AV40+AW40","v":31},null,null,{"$f":"IF(ISNUMBER(AZ40),(VLOOKUP(AZ40,$BO$6:$BP$50,2)),0)","v":0},{"$f":"IF(AZ40<>\"\",5,0)","v":0},{"$f":"BA40+BB40","v":0},null,null,{"$f":"IF(ISNUMBER(BE40),(VLOOKUP(BE40,$BO$6:$BP$50,2)),0)","v":0},{"$f":"IF(BE40<>\"\",5,0)","v":0},{"$f":"BF40+BG40","v":0},null,null,{"$f":"IF(ISNUMBER(BJ40),(VLOOKUP(BJ40,$BO$6:$BP$50,2)),0)","v":0},{"$f":"IF(BJ40<>\"\",5,0)","v":0},{"$f":"BK40+BL40","v":0},null,35,0,0,0,0,1,0,0,0,0]
[{"$f":"IF(E41<E40,BO41,A40)","v":36},"Øverby","Erle Christine Nyborg","Njård",{"$f":"IF(F41<=4,Q41,(Q41-SUM(SMALL(R41:Y41,{1;2;3;4}))))","v":27},{"$f":"(IF(AC41=5,1,0)+IF(AH41=5,1,0)+IF(AM41=5,1,0)+IF(AR41=5,1,0)+IF(AW41=5,1,0)+IF(BB41=5,1,0)+IF(BG41=5,1,0)+IF(BL41=5,1,0))","v":2},null,{"$f":"IF(AA41=\"\",\"\",AA41)","v":""},{"$f":"IF(AF41=\"\",\"\",AF41)","v":""},{"$f":"IF(AK41=\"\",\"\",AK41)","v":22},{"$f":"IF(AP41=\"\",\"\",AP41)","v":23},{"$f":"IF(AU41=\"\",\"\",AU41)","v":""},{"$f":"IF(AZ41=\"\",\"\",AZ41)","v":""},{"$f":"IF(BE41=\"\",\"\",BE41)","v":""},{"$f":"IF(BJ41=\"\",\"\",BJ41)","v":""},null,{"$f":"AD41+AI41+AN41+AS41+AX41+BC41+BH41","v":27},{"$f":"IF($F41>=5,IF(AB41=\"\",\"\",AB41),\"\")","v":""},{"$f":"IF($F41>=5,IF(AG41=\"\",\"\",AG41),\"\")","v":""},{"$f":"IF($F41>=5,IF(AL41=\"\",\"\",AL41),\"\")","v":""},{"$f":"IF($F41>=5,IF(AQ41=\"\",\"\",AQ41),\"\")","v":""},{"$f":"IF($F41>=5,IF(AV41=\"\",\"\",AV41),\"\")","v":""},{"$f":"IF($F41>=5,IF(BA41=\"\",\"\",BA41),\"\")","v":""},{"$f":"IF($F41>=5,IF(BF41=\"\",\"\",BF41),\"\")","v":""},{"$f":"IF($F41>=5,IF(BK41=\"\",\"\",BK41),\"\")","v":""},null,null,{"$f":"IF(ISNUMBER(AA41),(VLOOKUP(AA41,$BO$6:$BP$50,2)),0)","v":0},{"$f":"IF(AA41<>\"\",5,0)","v":0},{"$f":"AB41+AC41","v":0},null,null,{"$f":"IF(ISNUMBER(AF41),(VLOOKUP(AF41,$BO$6:$BP$50,2)),0)","v":0},{"$f":"IF(AF41<>\"\",5,0)","v":0},{"$f":"AG41+AH41","v":0},null,22,{"$f":"IF(ISNUMBER(AK41),(VLOOKUP(AK41,$BO$6:$BP$50,2)),0)","v":9},{"$f":"IF(AK41<>\"\",5,0)","v":5},{"$f":"AL41+AM41","v":14},null,23,{"$f":"IF(ISNUMBER(AP41),(VLOOKUP(AP41,$BO$6:$BP$50,2)),0)","v":8},{"$f":"IF(AP41<>\"\",5,0)","v":5},{"$f":"AQ41+AR41","v":13},null,null,{"$f":"IF(ISNUMBER(AU41),(VLOOKUP(AU41,$BO$6:$BP$50,2)),0)","v":0},{"$f":"IF(AU41<>\"\",5,0)","v":0},{"$f":"AV41+AW41","v":0},null,null,{"$f":"IF(ISNUMBER(AZ41),(VLOOKUP(AZ41,$BO$6:$BP$50,2)),0)","v":0},{"$f":"IF(AZ41<>\"\",5,0)","v":0},{"$f":"BA41+BB41","v":0},null,null,{"$f":"IF(ISNUMBER(BE41),(VLOOKUP(BE41,$BO$6:$BP$50,2)),0)","v":0},{"$f":"IF(BE41<>\"\",5,0)","v":0},{"$f":"BF41+BG41","v":0},null,null,{"$f":"IF(ISNUMBER(BJ41),(VLOOKUP(BJ41,$BO$6:$BP$50,2)),0)","v":0},{"$f":"IF(BJ41<>\"\",5,0)","v":0},{"$f":"BK41+BL41","v":0},null,36,0,0,0,0,0,1,0,0,0]
[{"$f":"IF(E42<E41,BO42,A41)","v":37},"Håkonsen","Kristina","Kjelsås",{"$f":"IF(F42<=4,Q42,(Q42-SUM(SMALL(R42:Y42,{1;2;3;4}))))","v":23},{"$f":"(IF(AC42=5,1,0)+IF(AH42=5,1,0)+IF(AM42=5,1,0)+IF(AR42=5,1,0)+IF(AW42=5,1,0)+IF(BB42=5,1,0)+IF(BG42=5,1,0)+IF(BL42=5,1,0))","v":1},null,{"$f":"IF(AA42=\"\",\"\",AA42)","v":""},{"$f":"IF(AF42=\"\",\"\",AF42)","v":""},{"$f":"IF(AK42=\"\",\"\",AK42)","v":""},{"$f":"IF(AP42=\"\",\"\",AP42)","v":""},{"$f":"IF(AU42=\"\",\"\",AU42)","v":""},{"$f":"IF(AZ42=\"\",\"\",AZ42)","v":14},{"$f":"IF(BE42=\"\",\"\",BE42)","v":""},{"$f":"IF(BJ42=\"\",\"\",BJ42)","v":""},null,{"$f":"AD42+AI42+AN42+AS42+AX42+BC42+BH42","v":23},{"$f":"IF($F42>=5,IF(AB42=\"\",\"\",AB42),\"\")","v":""},{"$f":"IF($F42>=5,IF(AG42=\"\",\"\",AG42),\"\")","v":""},{"$f":"IF($F42>=5,IF(AL42=\"\",\"\",AL42),\"\")","v":""},{"$f":"IF($F42>=5,IF(AQ42=\"\",\"\",AQ42),\"\")","v":""},{"$f":"IF($F42>=5,IF(AV42=\"\",\"\",AV42),\"\")","v":""},{"$f":"IF($F42>=5,IF(BA42=\"\",\"\",BA42),\"\")","v":""},{"$f":"IF($F42>=5,IF(BF42=\"\",\"\",BF42),\"\")","v":""},{"$f":"IF($F42>=5,IF(BK42=\"\",\"\",BK42),\"\")","v":""},null,null,{"$f":"IF(ISNUMBER(AA42),(VLOOKUP(AA42,$BO$6:$BP$50,2)),0)","v":0},{"$f":"IF(AA42<>\"\",5,0)","v":0},{"$f":"AB42+AC42","v":0},null,null,{"$f":"IF(ISNUMBER(AF42),(VLOOKUP(AF42,$BO$6:$BP$50,2)),0)","v":0},{"$f":"IF(AF42<>\"\",5,0)","v":0},{"$f":"AG42+AH42","v":0},null,null,{"$f":"IF(ISNUMBER(AK42),(VLOOKUP(AK42,$BO$6:$BP$50,2)),0)","v":0},{"$f":"IF(AK42<>\"\",5,0)","v":0},{"$f":"AL42+AM42","v":0},null,null,{"$f":"IF(ISNUMBER(AP42),(VLOOKUP(AP42,$BO$6:$BP$50,2)),0)","v":0},{"$f":"IF(AP42<>\"\",5,0)","v":0},{"$f":"AQ42+AR42","v":0},null,null,{"$f":"IF(ISNUMBER(AU42),(VLOOKUP(AU42,$BO$6:$BP$50,2)),0)","v":0},{"$f":"IF(AU42<>\"\",5,0)","v":0},{"$f":"AV42+AW42","v":0},null,14,{"$f":"IF(ISNUMBER(AZ42),(VLOOKUP(AZ42,$BO$6:$BP$50,2)),0)","v":18},{"$f":"IF(AZ42<>\"\",5,0)","v":5},{"$f":"BA42+BB42","v":23},null,null,{"$f":"IF(ISNUMBER(BE42),(VLOOKUP(BE42,$BO$6:$BP$50,2)),0)","v":0},{"$f":"IF(BE42<>\"\",5,0)","v":0},{"$f":"BF42+BG42","v":0},null,null,{"$f":"IF(ISNUMBER(BJ42),(VLOOKUP(BJ42,$BO$6:$BP$50,2)),0)","v":0},{"$f":"IF(BJ42<>\"\",5,0)","v":0},{"$f":"BK42+BL42","v":0},null,37,0,0,0,0,0,1,0,0,0]
[{"$f":"IF(E43<E42,BO43,A42)","v":38},"Rabben","Ella","Ljan",{"$f":"IF(F43<=4,Q43,(Q43-SUM(SMALL(R43:Y43,{1;2;3;4}))))","v":21},{"$f":"(IF(AC43=5,1,0)+IF(AH43=5,1,0)+IF(AM43=5,1,0)+IF(AR43=5,1,0)+IF(AW43=5,1,0)+IF(BB43=5,1,0)+IF(BG43=5,1,0)+IF(BL43=5,1,0))","v":1},null,{"$f":"IF(AA43=\"\",\"\",AA43)","v":""},{"$f":"IF(AF43=\"\",\"\",AF43)","v":15},{"$f":"IF(AK43=\"\",\"\",AK43)","v":""},{"$f":"IF(AP43=\"\",\"\",AP43)","v":""},{"$f":"IF(AU43=\"\",\"\",AU43)","v":""},{"$f":"IF(AZ43=\"\",\"\",AZ43)","v":""},{"$f":"IF(BE43=\"\",\"\",BE43)","v":""},{"$f":"IF(BJ43=\"\",\"\",BJ43)","v":""},null,{"$f":"AD43+AI43+AN43+AS43+AX43+BC43+BH43","v":21},{"$f":"IF($F43>=5,IF(AB43=\"\",\"\",AB43),\"\")","v":""},{"$f":"IF($F43>=5,IF(AG43=\"\",\"\",AG43),\"\")","v":""},{"$f":"IF($F43>=5,IF(AL43=\"\",\"\",AL43),\"\")","v":""},{"$f":"IF($F43>=5,IF(AQ43=\"\",\"\",AQ43),\"\")","v":""},{"$f":"IF($F43>=5,IF(AV43=\"\",\"\",AV43),\"\")","v":""},{"$f":"IF($F43>=5,IF(BA43=\"\",\"\",BA43),\"\")","v":""},{"$f":"IF($F43>=5,IF(BF43=\"\",\"\",BF43),\"\")","v":""},{"$f":"IF($F43>=5,IF(BK43=\"\",\"\",BK43),\"\")","v":""},null,null,{"$f":"IF(ISNUMBER(AA43),(VLOOKUP(AA43,$BO$6:$BP$50,2)),0)","v":0},{"$f":"IF(AA43<>\"\",5,0)","v":0},{"$f":"AB43+AC43","v":0},null,15,{"$f":"IF(ISNUMBER(AF43),(VLOOKUP(AF43,$BO$6:$BP$50,2)),0)","v":16},{"$f":"IF(AF43<>\"\",5,0)","v":5},{"$f":"AG43+AH43","v":21},null,null,{"$f":"IF(ISNUMBER(AK43),(VLOOKUP(AK43,$BO$6:$BP$50,2)),0)","v":0},{"$f":"IF(AK43<>\"\",5,0)","v":0},{"$f":"AL43+AM43","v":0},null,null,{"$f":"IF(ISNUMBER(AP43),(VLOOKUP(AP43,$BO$6:$BP$50,2)),0)","v":0},{"$f":"IF(AP43<>\"\",5,0)","v":0},{"$f":"AQ43+AR43","v":0},null,null,{"$f":"IF(ISNUMBER(AU43),(VLOOKUP(AU43,$BO$6:$BP$50,2)),0)","v":0},{"$f":"IF(AU43<>\"\",5,0)","v":0},{"$f":"AV43+AW43","v":0},null,null,{"$f":"IF(ISNUMBER(AZ43),(VLOOKUP(AZ43,$BO$6:$BP$50,2)),0)","v":0},{"$f":"IF(AZ43<>\"\",5,0)","v":0},{"$f":"BA43+BB43","v":0},null,null,{"$f":"IF(ISNUMBER(BE43),(VLOOKUP(BE43,$BO$6:$BP$50,2)),0)","v":0},{"$f":"IF(BE43<>\"\",5,0)","v":0},{"$f":"BF43+BG43","v":0},null,null,{"$f":"IF(ISNUMBER(BJ43),(VLOOKUP(BJ43,$BO$6:$BP$50,2)),0)","v":0},{"$f":"IF(BJ43<>\"\",5,0)","v":0},{"$f":"BK43+BL43","v":0},null,38,0,0,0,0,0,0,1,0,0]
[{"$f":"IF(E44<E43,BO44,A43)","v":38},"Mortensen","Christina","Lommedalen",{"$f":"IF(F44<=4,Q44,(Q44-SUM(SMALL(R44:Y44,{1;2;3;4}))))","v":21},{"$f":"(IF(AC44=5,1,0)+IF(AH44=5,1,0)+IF(AM44=5,1,0)+IF(AR44=5,1,0)+IF(AW44=5,1,0)+IF(BB44=5,1,0)+IF(BG44=5,1,0)+IF(BL44=5,1,0))","v":1},null,{"$f":"IF(AA44=\"\",\"\",AA44)","v":""},{"$f":"IF(AF44=\"\",\"\",AF44)","v":""},{"$f":"IF(AK44=\"\",\"\",AK44)","v":""},{"$f":"IF(AP44=\"\",\"\",AP44)","v":""},{"$f":"IF(AU44=\"\",\"\",AU44)","v":15},{"$f":"IF(AZ44=\"\",\"\",AZ44)","v":""},{"$f":"IF(BE44=\"\",\"\",BE44)","v":""},{"$f":"IF(BJ44=\"\",\"\",BJ44)","v":""},null,{"$f":"AD44+AI44+AN44+AS44+AX44+BC44+BH44","v":21},{"$f":"IF($F44>=5,IF(AB44=\"\",\"\",AB44),\"\")","v":""},{"$f":"IF($F44>=5,IF(AG44=\"\",\"\",AG44),\"\")","v":""},{"$f":"IF($F44>=5,IF(AL44=\"\",\"\",AL44),\"\")","v":""},{"$f":"IF($F44>=5,IF(AQ44=\"\",\"\",AQ44),\"\")","v":""},{"$f":"IF($F44>=5,IF(AV44=\"\",\"\",AV44),\"\")","v":""},{"$f":"IF($F44>=5,IF(BA44=\"\",\"\",BA44),\"\")","v":""},{"$f":"IF($F44>=5,IF(BF44=\"\",\"\",BF44),\"\")","v":""},{"$f":"IF($F44>=5,IF(BK44=\"\",\"\",BK44),\"\")","v":""},null,null,{"$f":"IF(ISNUMBER(AA44),(VLOOKUP(AA44,$BO$6:$BP$50,2)),0)","v":0},{"$f":"IF(AA44<>\"\",5,0)","v":0},{"$f":"AB44+AC44","v":0},null,null,{"$f":"IF(ISNUMBER(AF44),(VLOOKUP(AF44,$BO$6:$BP$50,2)),0)","v":0},{"$f":"IF(AF44<>\"\",5,0)","v":0},{"$f":"AG44+AH44","v":0},null,null,{"$f":"IF(ISNUMBER(AK44),(VLOOKUP(AK44,$BO$6:$BP$50,2)),0)","v":0},{"$f":"IF(AK44<>\"\",5,0)","v":0},{"$f":"AL44+AM44","v":0},null,null,{"$f":"IF(ISNUMBER(AP44),(VLOOKUP(AP44,$BO$6:$BP$50,2)),0)","v":0},{"$f":"IF(AP44<>\"\",5,0)","v":0},{"$f":"AQ44+AR44","v":0},null,15,{"$f":"IF(ISNUMBER(AU44),(VLOOKUP(AU44,$BO$6:$BP$50,2)),0)","v":16},{"$f":"IF(AU44<>\"\",5,0)","v":5},{"$f":"AV44+AW44","v":21},null,null,{"$f":"IF(ISNUMBER(AZ44),(VLOOKUP(AZ44,$BO$6:$BP$50,2)),0)","v":0},{"$f":"IF(AZ44<>\"\",5,0)","v":0},{"$f":"BA44+BB44","v":0},null,null,{"$f":"IF(ISNUMBER(BE44),(VLOOKUP(BE44,$BO$6:$BP$50,2)),0)","v":0},{"$f":"IF(BE44<>\"\",5,0)","v":0},{"$f":"BF44+BG44","v":0},null,null,{"$f":"IF(ISNUMBER(BJ44),(VLOOKUP(BJ44,$BO$6:$BP$50,2)),0)","v":0},{"$f":"IF(BJ44<>\"\",5,0)","v":0},{"$f":"BK44+BL44","v":0},null,39,0,0,0,0,0,0,0,1,0]
[{"$f":"IF(E45<E44,BO45,A44)","v":40},"Navestad","Astrid","Kjelsås",{"$f":"IF(F45<=4,Q45,(Q45-SUM(SMALL(R45:Y45,{1;2;3;4}))))","v":18},{"$f":"(IF(AC45=5,1,0)+IF(AH45=5,1,0)+IF(AM45=5,1,0)+IF(AR45=5,1,0)+IF(AW45=5,1,0)+IF(BB45=5,1,0)+IF(BG45=5,1,0)+IF(BL45=5,1,0))","v":1},null,{"$f":"IF(AA45=\"\",\"\",AA45)","v":""},{"$f":"IF(AF45=\"\",\"\",AF45)","v":""},{"$f":"IF(AK45=\"\",\"\",AK45)","v":""},{"$f":"IF(AP45=\"\",\"\",AP45)","v":""},{"$f":"IF(AU45=\"\",\"\",AU45)","v":""},{"$f":"IF(AZ45=\"\",\"\",AZ45)","v":""},{"$f":"IF(BE45=\"\",\"\",BE45)","v":18},{"$f":"IF(BJ45=\"\",\"\",BJ45)","v":""},null,{"$f":"AD45+AI45+AN45+AS45+AX45+BC45+BH45","v":18},{"$f":"IF($F45>=5,IF(AB45=\"\",\"\",AB45),\"\")","v":""},{"$f":"IF($F45>=5,IF(AG45=\"\",\"\",AG45),\"\")","v":""},{"$f":"IF($F45>=5,IF(AL45=\"\",\"\",AL45),\"\")","v":""},{"$f":"IF($F45>=5,IF(AQ45=\"\",\"\",AQ45),\"\")","v":""},{"$f":"IF($F45>=5,IF(AV45=\"\",\"\",AV45),\"\")","v":""},{"$f":"IF($F45>=5,IF(BA45=\"\",\"\",BA45),\"\")","v":""},{"$f":"IF($F45>=5,IF(BF45=\"\",\"\",BF45),\"\")","v":""},{"$f":"IF($F45>=5,IF(BK45=\"\",\"\",BK45),\"\")","v":""},null,null,{"$f":"IF(ISNUMBER(AA45),(VLOOKUP(AA45,$BO$6:$BP$50,2)),0)","v":0},{"$f":"IF(AA45<>\"\",5,0)","v":0},{"$f":"AB45+AC45","v":0},null,null,{"$f":"IF(ISNUMBER(AF45),(VLOOKUP(AF45,$BO$6:$BP$50,2)),0)","v":0},{"$f":"IF(AF45<>\"\",5,0)","v":0},{"$f":"AG45+AH45","v":0},null,null,{"$f":"IF(ISNUMBER(AK45),(VLOOKUP(AK45,$BO$6:$BP$50,2)),0)","v":0},{"$f":"IF(AK45<>\"\",5,0)","v":0},{"$f":"AL45+AM45","v":0},null,null,{"$f":"IF(ISNUMBER(AP45),(VLOOKUP(AP45,$BO$6:$BP$50,2)),0)","v":0},{"$f":"IF(AP45<>\"\",5,0)","v":0},{"$f":"AQ45+AR45","v":0},null,null,{"$f":"IF(ISNUMBER(AU45),(VLOOKUP(AU45,$BO$6:$BP$50,2)),0)","v":0},{"$f":"IF(AU45<>\"\",5,0)","v":0},{"$f":"AV45+AW45","v":0},null,null,{"$f":"IF(ISNUMBER(AZ45),(VLOOKUP(AZ45,$BO$6:$BP$50,2)),0)","v":0},{"$f":"IF(AZ45<>\"\",5,0)","v":0},{"$f":"BA45+BB45","v":0},null,18,{"$f":"IF(ISNUMBER(BE45),(VLOOKUP(BE45,$BO$6:$BP$50,2)),0)","v":13},{"$f":"IF(BE45<>\"\",5,0)","v":5},{"$f":"BF45+BG45","v":18},null,null,{"$f":"IF(ISNUMBER(BJ45),(VLOOKUP(BJ45,$BO$6:$BP$50,2)),0)","v":0},{"$f":"IF(BJ45<>\"\",5,0)","v":0},{"$f":"BK45+BL45","v":0},null,40,0,0,0,0,0,1,0,0,0]
[{"$f":"IF(E46<E45,BO46,A45)","v":41},"Oustad","Mina Foronda","NERO",{"$f":"IF(F46<=4,Q46,(Q46-SUM(SMALL(R46:Y46,{1;2;3;4}))))","v":16},{"$f":"(IF(AC46=5,1,0)+IF(AH46=5,1,0)+IF(AM46=5,1,0)+IF(AR46=5,1,0)+IF(AW46=5,1,0)+IF(BB46=5,1,0)+IF(BG46=5,1,0)+IF(BL46=5,1,0))","v":1},null,{"$f":"IF(AA46=\"\",\"\",AA46)","v":""},{"$f":"IF(AF46=\"\",\"\",AF46)","v":""},{"$f":"IF(AK46=\"\",\"\",AK46)","v":20},{"$f":"IF(AP46=\"\",\"\",AP46)","v":""},{"$f":"IF(AU46=\"\",\"\",AU46)","v":""},{"$f":"IF(AZ46=\"\",\"\",AZ46)","v":""},{"$f":"IF(BE46=\"\",\"\",BE46)","v":""},{"$f":"IF(BJ46=\"\",\"\",BJ46)","v":""},null,{"$f":"AD46+AI46+AN46+AS46+AX46+BC46+BH46","v":16},{"$f":"IF($F46>=5,IF(AB46=\"\",\"\",AB46),\"\")","v":""},{"$f":"IF($F46>=5,IF(AG46=\"\",\"\",AG46),\"\")","v":""},{"$f":"IF($F46>=5,IF(AL46=\"\",\"\",AL46),\"\")","v":""},{"$f":"IF($F46>=5,IF(AQ46=\"\",\"\",AQ46),\"\")","v":""},{"$f":"IF($F46>=5,IF(AV46=\"\",\"\",AV46),\"\")","v":""},{"$f":"IF($F46>=5,IF(BA46=\"\",\"\",BA46),\"\")","v":""},{"$f":"IF($F46>=5,IF(BF46=\"\",\"\",BF46),\"\")","v":""},{"$f":"IF($F46>=5,IF(BK46=\"\",\"\",BK46),\"\")","v":""},null,null,{"$f":"IF(ISNUMBER(AA46),(VLOOKUP(AA46,$BO$6:$BP$50,2)),0)","v":0},{"$f":"IF(AA46<>\"\",5,0)","v":0},{"$f":"AB46+AC46","v":0},null,null,{"$f":"IF(ISNUMBER(AF46),(VLOOKUP(AF46,$BO$6:$BP$50,2)),0)","v":0},{"$f":"IF(AF46<>\"\",5,0)","v":0},{"$f":"AG46+AH46","v":0},null,20,{"$f":"IF(ISNUMBER(AK46),(VLOOKUP(AK46,$BO$6:$BP$50,2)),0)","v":11},{"$f":"IF(AK46<>\"\",5,0)","v":5},{"$f":"AL46+AM46","v":16},null,null,{"$f":"IF(ISNUMBER(AP46),(VLOOKUP(AP46,$BO$6:$BP$50,2)),0)","v":0},{"$f":"IF(AP46<>\"\",5,0)","v":0},{"$f":"AQ46+AR46","v":0},null,null,{"$f":"IF(ISNUMBER(AU46),(VLOOKUP(AU46,$BO$6:$BP$50,2)),0)","v":0},{"$f":"IF(AU46<>\"\",5,0)","v":0},{"$f":"AV46+AW46","v":0},null,null,{"$f":"IF(ISNUMBER(AZ46),(VLOOKUP(AZ46,$BO$6:$BP$50,2)),0)","v":0},{"$f":"IF(AZ46<>\"\",5,0)","v":0},{"$f":"BA46+BB46","v":0},null,null,{"$f":"IF(ISNUMBER(BE46),(VLOOKUP(BE46,$BO$6:$BP$50,2)),0)","v":0},{"$f":"IF(BE46<>\"\",5,0)","v":0},{"$f":"BF46+BG46","v":0},null,null,{"$f":"IF(ISNUMBER(BJ46),(VLOOKUP(BJ46,$BO$6:$BP$50,2)),0)","v":0},{"$f":"IF(BJ46<>\"\",5,0)","v":0},{"$f":"BK46+BL46","v":0},null,41,0,0,0,0,0,0,1,0,0]
[{"$f":"IF(E47<E46,BO47,A46)","v":42},"Kaas","Tora Lilly","Kjelsås",{"$f":"IF(F47<=4,Q47,(Q47-SUM(SMALL(R47:Y47,{1;2;3;4}))))","v":15},{"$f":"(IF(AC47=5,1,0)+IF(AH47=5,1,0)+IF(AM47=5,1,0)+IF(AR47=5,1,0)+IF(AW47=5,1,0)+IF(BB47=5,1,0)+IF(BG47=5,1,0)+IF(BL47=5,1,0))","v":1},null,{"$f":"IF(AA47=\"\",\"\",AA47)","v":""},{"$f":"IF(AF47=\"\",\"\",AF47)","v":""},{"$f":"IF(AK47=\"\",\"\",AK47)","v":""},{"$f":"IF(AP47=\"\",\"\",AP47)","v":""},{"$f":"IF(AU47=\"\",\"\",AU47)","v":""},{"$f":"IF(AZ47=\"\",\"\",AZ47)","v":""},{"$f":"IF(BE47=\"\",\"\",BE47)","v":21},{"$f":"IF(BJ47=\"\",\"\",BJ47)","v":""},null,{"$f":"AD47+AI47+AN47+AS47+AX47+BC47+BH47","v":15},{"$f":"IF($F38>=5,IF(AB47=\"\",\"\",AB47),\"\")","v":""},{"$f":"IF($F38>=5,IF(AG47=\"\",\"\",AG47),\"\")","v":""},{"$f":"IF($F38>=5,IF(AL47=\"\",\"\",AL47),\"\")","v":""},{"$f":"IF($F38>=5,IF(AQ47=\"\",\"\",AQ47),\"\")","v":""},{"$f":"IF($F38>=5,IF(AR47=\"\",\"\",AR47),\"\")","v":""},{"$f":"IF($F38>=5,IF(AV47=\"\",\"\",AV47),\"\")","v":""},{"$f":"IF($F38>=5,IF(BA47=\"\",\"\",BA47),\"\")","v":""},{"$f":"IF($F38>=5,IF(BF47=\"\",\"\",BF47),\"\")","v":""},null,null,{"$f":"IF(ISNUMBER(AA47),(VLOOKUP(AA47,$BO$6:$BP$50,2)),0)","v":0},{"$f":"IF(AA47<>\"\",5,0)","v":0},{"$f":"AB47+AC47","v":0},null,null,{"$f":"IF(ISNUMBER(AF47),(VLOOKUP(AF47,$BO$6:$BP$50,2)),0)","v":0},{"$f":"IF(AF47<>\"\",5,0)","v":0},{"$f":"AG47+AH47","v":0},null,null,{"$f":"IF(ISNUMBER(AK47),(VLOOKUP(AK47,$BO$6:$BP$50,2)),0)","v":0},{"$f":"IF(AK47<>\"\",5,0)","v":0},{"$f":"AL47+AM47","v":0},null,null,{"$f":"IF(ISNUMBER(AP47),(VLOOKUP(AP47,$BO$6:$BP$50,2)),0)","v":0},{"$f":"IF(AP47<>\"\",5,0)","v":0},{"$f":"AQ47+AR47","v":0},null,null,{"$f":"IF(ISNUMBER(AU47),(VLOOKUP(AU47,$BO$6:$BP$50,2)),0)","v":0},{"$f":"IF(AU47<>\"\",5,0)","v":0},{"$f":"AV47+AW47","v":0},null,null,{"$f":"IF(ISNUMBER(AZ47),(VLOOKUP(AZ47,$BO$6:$BP$50,2)),0)","v":0},{"$f":"IF(AZ47<>\"\",5,0)","v":0},{"$f":"BA47+BB47","v":0},null,21,{"$f":"IF(ISNUMBER(BE47),(VLOOKUP(BE47,$BO$6:$BP$50,2)),0)","v":10},{"$f":"IF(BE47<>\"\",5,0)","v":5},{"$f":"BF47+BG47","v":15},null,null,{"$f":"IF(ISNUMBER(BJ47),(VLOOKUP(BJ47,$BO$6:$BP$50,2)),0)","v":0},{"$f":"IF(BJ47<>\"\",5,0)","v":0},{"$f":"BK47+BL47","v":0},null,42,0,0,0,0,0,0,0,1,0]
[{"$f":"IF(E48<E47,BO48,A47)","v":43},"Krogsethagen","Sara","Kjelsås",{"$f":"IF(F48<=4,Q48,(Q48-SUM(SMALL(R48:Y48,{1;2;3;4}))))","v":14},{"$f":"(IF(AC48=5,1,0)+IF(AH48=5,1,0)+IF(AM48=5,1,0)+IF(AR48=5,1,0)+IF(AW48=5,1,0)+IF(BB48=5,1,0)+IF(BG48=5,1,0)+IF(BL48=5,1,0))","v":1},null,{"$f":"IF(AA48=\"\",\"\",AA48)","v":""},{"$f":"IF(AF48=\"\",\"\",AF48)","v":""},{"$f":"IF(AK48=\"\",\"\",AK48)","v":""},{"$f":"IF(AP48=\"\",\"\",AP48)","v":""},{"$f":"IF(AU48=\"\",\"\",AU48)","v":""},{"$f":"IF(AZ48=\"\",\"\",AZ48)","v":""},{"$f":"IF(BE48=\"\",\"\",BE48)","v":22},{"$f":"IF(BJ48=\"\",\"\",BJ48)","v":""},null,{"$f":"AD48+AI48+AN48+AS48+AX48+BC48+BH48","v":14},{"$f":"IF($F39>=5,IF(AB48=\"\",\"\",AB48),\"\")","v":""},{"$f":"IF($F39>=5,IF(AG48=\"\",\"\",AG48),\"\")","v":""},{"$f":"IF($F39>=5,IF(AL48=\"\",\"\",AL48),\"\")","v":""},{"$f":"IF($F39>=5,IF(AQ48=\"\",\"\",AQ48),\"\")","v":""},{"$f":"IF($F39>=5,IF(AR48=\"\",\"\",AR48),\"\")","v":""},{"$f":"IF($F39>=5,IF(AV48=\"\",\"\",AV48),\"\")","v":""},{"$f":"IF($F39>=5,IF(BA48=\"\",\"\",BA48),\"\")","v":""},{"$f":"IF($F39>=5,IF(BF48=\"\",\"\",BF48),\"\")","v":""},null,null,{"$f":"IF(ISNUMBER(AA48),(VLOOKUP(AA48,$BO$6:$BP$50,2)),0)","v":0},{"$f":"IF(AA48<>\"\",5,0)","v":0},{"$f":"AB48+AC48","v":0},null,null,{"$f":"IF(ISNUMBER(AF48),(VLOOKUP(AF48,$BO$6:$BP$50,2)),0)","v":0},{"$f":"IF(AF48<>\"\",5,0)","v":0},{"$f":"AG48+AH48","v":0},null,null,{"$f":"IF(ISNUMBER(AK48),(VLOOKUP(AK48,$BO$6:$BP$50,2)),0)","v":0},{"$f":"IF(AK48<>\"\",5,0)","v":0},{"$f":"AL48+AM48","v":0},null,null,{"$f":"IF(ISNUMBER(AP48),(VLOOKUP(AP48,$BO$6:$BP$50,2)),0)","v":0},{"$f":"IF(AP48<>\"\",5,0)","v":0},{"$f":"AQ48+AR48","v":0},null,null,{"$f":"IF(ISNUMBER(AU48),(VLOOKUP(AU48,$BO$6:$BP$50,2)),0)","v":0},{"$f":"IF(AU48<>\"\",5,0)","v":0},{"$f":"AV48+AW48","v":0},null,null,{"$f":"IF(ISNUMBER(AZ48),(VLOOKUP(AZ48,$BO$6:$BP$50,2)),0)","v":0},{"$f":"IF(AZ48<>\"\",5,0)","v":0},{"$f":"BA48+BB48","v":0},null,22,{"$f":"IF(ISNUMBER(BE48),(VLOOKUP(BE48,$BO$6:$BP$50,2)),0)","v":9},{"$f":"IF(BE48<>\"\",5,0)","v":5},{"$f":"BF48+BG48","v":14},null,null,{"$f":"IF(ISNUMBER(BJ48),(VLOOKUP(BJ48,$BO$6:$BP$50,2)),0)","v":0},{"$f":"IF(BJ48<>\"\",5,0)","v":0},{"$f":"BK48+BL48","v":0},null,43,0,0,0,0,0,0,0,0,1]
[{"$f":"IF(E49<E48,BO49,A48)","v":44},"Løe","Marie Furuseth","Ullensaker",{"$f":"IF(F49<=4,Q49,(Q49-SUM(SMALL(R49:Y49,{1;2;3;4}))))","v":13},{"$f":"(IF(AC49=5,1,0)+IF(AH49=5,1,0)+IF(AM49=5,1,0)+IF(AR49=5,1,0)+IF(AW49=5,1,0)+IF(BB49=5,1,0)+IF(BG49=5,1,0)+IF(BL49=5,1,0))","v":1},null,{"$f":"IF(AA49=\"\",\"\",AA49)","v":""},{"$f":"IF(AF49=\"\",\"\",AF49)","v":""},{"$f":"IF(AK49=\"\",\"\",AK49)","v":""},{"$f":"IF(AP49=\"\",\"\",AP49)","v":""},{"$f":"IF(AU49=\"\",\"\",AU49)","v":""},{"$f":"IF(AZ49=\"\",\"\",AZ49)","v":""},{"$f":"IF(BE49=\"\",\"\",BE49)","v":23},{"$f":"IF(BJ49=\"\",\"\",BJ49)","v":""},null,{"$f":"AD49+AI49+AN49+AS49+AX49+BC49+BH49","v":13},null,null,null,null,null,null,null,null,null,null,{"$f":"IF(ISNUMBER(AA49),(VLOOKUP(AA49,$BO$6:$BP$50,2)),0)","v":0},{"$f":"IF(AA49<>\"\",5,0)","v":0},{"$f":"AB49+AC49","v":0},null,null,{"$f":"IF(ISNUMBER(AF49),(VLOOKUP(AF49,$BO$6:$BP$50,2)),0)","v":0},{"$f":"IF(AF49<>\"\",5,0)","v":0},{"$f":"AG49+AH49","v":0},null,null,{"$f":"IF(ISNUMBER(AK49),(VLOOKUP(AK49,$BO$6:$BP$50,2)),0)","v":0},{"$f":"IF(AK49<>\"\",5,0)","v":0},{"$f":"AL49+AM49","v":0},null,null,{"$f":"IF(ISNUMBER(AP49),(VLOOKUP(AP49,$BO$6:$BP$50,2)),0)","v":0},{"$f":"IF(AP49<>\"\",5,0)","v":0},{"$f":"AQ49+AR49","v":0},null,null,{"$f":"IF(ISNUMBER(AU49),(VLOOKUP(AU49,$BO$6:$BP$50,2)),0)","v":0},{"$f":"IF(AU49<>\"\",5,0)","v":0},{"$f":"AV49+AW49","v":0},null,null,{"$f":"IF(ISNUMBER(AZ49),(VLOOKUP(AZ49,$BO$6:$BP$50,2)),0)","v":0},{"$f":"IF(AZ49<>\"\",5,0)","v":0},{"$f":"BA49+BB49","v":0},null,23,{"$f":"IF(ISNUMBER(BE49),(VLOOKUP(BE49,$BO$6:$BP$50,2)),0)","v":8},{"$f":"IF(BE49<>\"\",5,0)","v":5},{"$f":"BF49+BG49","v":13},null,null,{"$f":"IF(ISNUMBER(BJ49),(VLOOKUP(BJ49,$BO$6:$BP$50,2)),0)","v":0},{"$f":"IF(BJ49<>\"\",5,0)","v":0},{"$f":"BK49+BL49","v":0},null,44,0,0,0,0,0,0,0,0,1]
[{"$f":"IF(E50<E49,BO50,A49)","v":45},"Rastad","Julie Christine Høisæter","Njård",{"$f":"IF(F50<=4,Q50,(Q50-SUM(SMALL(R50:Y50,{1;2;3;4}))))","v":11},{"$f":"(IF(AC50=5,1,0)+IF(AH50=5,1,0)+IF(AM50=5,1,0)+IF(AR50=5,1,0)+IF(AW50=5,1,0)+IF(BB50=5,1,0)+IF(BG50=5,1,0)+IF(BL50=5,1,0))","v":1},null,{"$f":"IF(AA50=\"\",\"\",AA50)","v":""},{"$f":"IF(AF50=\"\",\"\",AF50)","v":""},{"$f":"IF(AK50=\"\",\"\",AK50)","v":25},{"$f":"IF(AP50=\"\",\"\",AP50)","v":""},{"$f":"IF(AU50=\"\",\"\",AU50)","v":""},{"$f":"IF(AZ50=\"\",\"\",AZ50)","v":""},{"$f":"IF(BE50=\"\",\"\",BE50)","v":""},{"$f":"IF(BJ50=\"\",\"\",BJ50)","v":""},null,{"$f":"AD50+AI50+AN50+AS50+AX50+BC50+BH50","v":11},{"$f":"IF($F50>=5,IF(AB50=\"\",\"\",AB50),\"\")","v":""},{"$f":"IF($F50>=5,IF(AG50=\"\",\"\",AG50),\"\")","v":""},{"$f":"IF($F50>=5,IF(AL50=\"\",\"\",AL50),\"\")","v":""},{"$f":"IF($F50>=5,IF(AQ50=\"\",\"\",AQ50),\"\")","v":""},{"$f":"IF($F50>=5,IF(AV50=\"\",\"\",AV50),\"\")","v":""},{"$f":"IF($F50>=5,IF(BA50=\"\",\"\",BA50),\"\")","v":""},{"$f":"IF($F50>=5,IF(BF50=\"\",\"\",BF50),\"\")","v":""},{"$f":"IF($F50>=5,IF(BK50=\"\",\"\",BK50),\"\")","v":""},null,null,{"$f":"IF(ISNUMBER(AA50),(VLOOKUP(AA50,$BO$6:$BP$50,2)),0)","v":0},{"$f":"IF(AA50<>\"\",5,0)","v":0},{"$f":"AB50+AC50","v":0},null,null,{"$f":"IF(ISNUMBER(AF50),(VLOOKUP(AF50,$BO$6:$BP$50,2)),0)","v":0},{"$f":"IF(AF50<>\"\",5,0)","v":0},{"$f":"AG50+AH50","v":0},null,25,{"$f":"IF(ISNUMBER(AK50),(VLOOKUP(AK50,$BO$6:$BP$50,2)),0)","v":6},{"$f":"IF(AK50<>\"\",5,0)","v":5},{"$f":"AL50+AM50","v":11},null,null,{"$f":"IF(ISNUMBER(AP50),(VLOOKUP(AP50,$BO$6:$BP$50,2)),0)","v":0},{"$f":"IF(AP50<>\"\",5,0)","v":0},{"$f":"AQ50+AR50","v":0},null,null,{"$f":"IF(ISNUMBER(AU50),(VLOOKUP(AU50,$BO$6:$BP$50,2)),0)","v":0},{"$f":"IF(AU50<>\"\",5,0)","v":0},{"$f":"AV50+AW50","v":0},null,null,{"$f":"IF(ISNUMBER(AZ50),(VLOOKUP(AZ50,$BO$6:$BP$50,2)),0)","v":0},{"$f":"IF(AZ50<>\"\",5,0)","v":0},{"$f":"BA50+BB50","v":0},null,null,{"$f":"IF(ISNUMBER(BE50),(VLOOKUP(BE50,$BO$6:$BP$50,2)),0)","v":0},{"$f":"IF(BE50<>\"\",5,0)","v":0},{"$f":"BF50+BG50","v":0},null,null,{"$f":"IF(ISNUMBER(BJ50),(VLOOKUP(BJ50,$BO$6:$BP$50,2)),0)","v":0},{"$f":"IF(BJ50<>\"\",5,0)","v":0},{"$f":"BK50+BL50","v":0},null,45,0,0,0,0,0,0,0,1,0]
[{"$f":"IF(E51<E50,BO51,A50)","v":46},"Brodtkorp","Ulla Amalie","Heming",{"$f":"IF(F51<=4,Q51,(Q51-SUM(SMALL(R51:Y51,{1;2;3;4}))))","v":9},{"$f":"(IF(AC51=5,1,0)+IF(AH51=5,1,0)+IF(AM51=5,1,0)+IF(AR51=5,1,0)+IF(AW51=5,1,0)+IF(BB51=5,1,0)+IF(BG51=5,1,0)+IF(BL51=5,1,0))","v":1},null,{"$f":"IF(AA51=\"\",\"\",AA51)","v":""},{"$f":"IF(AF51=\"\",\"\",AF51)","v":""},{"$f":"IF(AK51=\"\",\"\",AK51)","v":""},{"$f":"IF(AP51=\"\",\"\",AP51)","v":""},{"$f":"IF(AU51=\"\",\"\",AU51)","v":27},{"$f":"IF(AZ51=\"\",\"\",AZ51)","v":""},{"$f":"IF(BE51=\"\",\"\",BE51)","v":""},{"$f":"IF(BJ51=\"\",\"\",BJ51)","v":""},null,{"$f":"AD51+AI51+AN51+AS51+AX51+BC51+BH51","v":9},{"$f":"IF($F51>=5,IF(AB51=\"\",\"\",AB51),\"\")","v":""},{"$f":"IF($F51>=5,IF(AG51=\"\",\"\",AG51),\"\")","v":""},{"$f":"IF($F51>=5,IF(AL51=\"\",\"\",AL51),\"\")","v":""},{"$f":"IF($F51>=5,IF(AQ51=\"\",\"\",AQ51),\"\")","v":""},{"$f":"IF($F51>=5,IF(AV51=\"\",\"\",AV51),\"\")","v":""},{"$f":"IF($F51>=5,IF(BA51=\"\",\"\",BA51),\"\")","v":""},{"$f":"IF($F51>=5,IF(BF51=\"\",\"\",BF51),\"\")","v":""},{"$f":"IF($F51>=5,IF(BK51=\"\",\"\",BK51),\"\")","v":""},null,null,{"$f":"IF(ISNUMBER(AA51),(VLOOKUP(AA51,$BO$6:$BP$50,2)),0)","v":0},{"$f":"IF(AA51<>\"\",5,0)","v":0},{"$f":"AB51+AC51","v":0},null,null,{"$f":"IF(ISNUMBER(AF51),(VLOOKUP(AF51,$BO$6:$BP$50,2)),0)","v":0},{"$f":"IF(AF51<>\"\",5,0)","v":0},{"$f":"AG51+AH51","v":0},null,null,{"$f":"IF(ISNUMBER(AK51),(VLOOKUP(AK51,$BO$6:$BP$50,2)),0)","v":0},{"$f":"IF(AK51<>\"\",5,0)","v":0},{"$f":"AL51+AM51","v":0},null,null,{"$f":"IF(ISNUMBER(AP51),(VLOOKUP(AP51,$BO$6:$BP$50,2)),0)","v":0},{"$f":"IF(AP51<>\"\",5,0)","v":0},{"$f":"AQ51+AR51","v":0},null,27,{"$f":"IF(ISNUMBER(AU51),(VLOOKUP(AU51,$BO$6:$BP$50,2)),0)","v":4},{"$f":"IF(AU51<>\"\",5,0)","v":5},{"$f":"AV51+AW51","v":9},null,null,{"$f":"IF(ISNUMBER(AZ51),(VLOOKUP(AZ51,$BO$6:$BP$50,2)),0)","v":0},{"$f":"IF(AZ51<>\"\",5,0)","v":0},{"$f":"BA51+BB51","v":0},null,null,{"$f":"IF(ISNUMBER(BE51),(VLOOKUP(BE51,$BO$6:$BP$50,2)),0)","v":0},{"$f":"IF(BE51<>\"\",5,0)","v":0},{"$f":"BF51+BG51","v":0},null,null,{"$f":"IF(ISNUMBER(BJ51),(VLOOKUP(BJ51,$BO$6:$BP$50,2)),0)","v":0},{"$f":"IF(BJ51<>\"\",5,0)","v":0},{"$f":"BK51+BL51","v":0},null,46,0,0,{"$f":"IF($F42=7,1,0)","v":0},0,0,0,0,0,1]
[{"$f":"IF(E52<E51,BO52,A51)","v":47},"Beck","Mari","Ullensaker",{"$f":"IF(F52<=4,Q52,(Q52-SUM(SMALL(R52:Y52,{1;2;3;4}))))","v":5},{"$f":"(IF(AC52=5,1,0)+IF(AH52=5,1,0)+IF(AM52=5,1,0)+IF(AR52=5,1,0)+IF(AW52=5,1,0)+IF(BB52=5,1,0)+IF(BG52=5,1,0)+IF(BL52=5,1,0))","v":1},null,{"$f":"IF(AA52=\"\",\"\",AA52)","v":"dnf"},{"$f":"IF(AF52=\"\",\"\",AF52)","v":""},{"$f":"IF(AK52=\"\",\"\",AK52)","v":""},{"$f":"IF(AP52=\"\",\"\",AP52)","v":""},{"$f":"IF(AU52=\"\",\"\",AU52)","v":""},{"$f":"IF(AZ52=\"\",\"\",AZ52)","v":""},{"$f":"IF(BE52=\"\",\"\",BE52)","v":""},{"$f":"IF(BJ52=\"\",\"\",BJ52)","v":""},null,{"$f":"AD52+AI52+AN52+AS52+AX52+BC52+BH52","v":5},{"$f":"IF($F52>=5,IF(AB52=\"\",\"\",AB52),\"\")","v":""},{"$f":"IF($F52>=5,IF(AG52=\"\",\"\",AG52),\"\")","v":""},{"$f":"IF($F52>=5,IF(AL52=\"\",\"\",AL52),\"\")","v":""},{"$f":"IF($F52>=5,IF(AQ52=\"\",\"\",AQ52),\"\")","v":""},{"$f":"IF($F52>=5,IF(AV52=\"\",\"\",AV52),\"\")","v":""},{"$f":"IF($F52>=5,IF(BA52=\"\",\"\",BA52),\"\")","v":""},{"$f":"IF($F52>=5,IF(BF52=\"\",\"\",BF52),\"\")","v":""},{"$f":"IF($F52>=5,IF(BK52=\"\",\"\",BK52),\"\")","v":""},null,"dnf",{"$f":"IF(ISNUMBER(AA52),(VLOOKUP(AA52,$BO$6:$BP$50,2)),0)","v":0},{"$f":"IF(AA52<>\"\",5,0)","v":5},{"$f":"AB52+AC52","v":5},null,null,{"$f":"IF(ISNUMBER(AF52),(VLOOKUP(AF52,$BO$6:$BP$50,2)),0)","v":0},{"$f":"IF(AF52<>\"\",5,0)","v":0},{"$f":"AG52+AH52","v":0},null,null,{"$f":"IF(ISNUMBER(AK52),(VLOOKUP(AK52,$BO$6:$BP$50,2)),0)","v":0},{"$f":"IF(AK52<>\"\",5,0)","v":0},{"$f":"AL52+AM52","v":0},null,null,{"$f":"IF(ISNUMBER(AP52),(VLOOKUP(AP52,$BO$6:$BP$50,2)),0)","v":0},{"$f":"IF(AP52<>\"\",5,0)","v":0},{"$f":"AQ52+AR52","v":0},null,null,{"$f":"IF(ISNUMBER(AU52),(VLOOKUP(AU52,$BO$6:$BP$50,2)),0)","v":0},{"$f":"IF(AU52<>\"\",5,0)","v":0},{"$f":"AV52+AW52","v":0},null,null,{"$f":"IF(ISNUMBER(AZ52),(VLOOKUP(AZ52,$BO$6:$BP$50,2)),0)","v":0},{"$f":"IF(AZ52<>\"\",5,0)","v":0},{"$f":"BA52+BB52","v":0},null,null,{"$f":"IF(ISNUMBER(BE52),(VLOOKUP(BE52,$BO$6:$BP$50,2)),0)","v":0},{"$f":"IF(BE52<>\"\",5,0)","v":0},{"$f":"BF52+BG52","v":0},null,null,{"$f":"IF(ISNUMBER(BJ52),(VLOOKUP(BJ52,$BO$6:$BP$50,2)),0)","v":0},{"$f":"IF(BJ52<>\"\",5,0)","v":0},{"$f":"BK52+BL52","v":0},null,47,0,0,0,0,0,0,0,0,1]
[{"$f":"IF(E53<E52,BO53,A52)","v":47},"Roos","Elisabeth","Try",{"$f":"IF(F53<=4,Q53,(Q53-SUM(SMALL(R53:Y53,{1;2;3;4}))))","v":5},{"$f":"(IF(AC53=5,1,0)+IF(AH53=5,1,0)+IF(AM53=5,1,0)+IF(AR53=5,1,0)+IF(AW53=5,1,0)+IF(BB53=5,1,0)+IF(BG53=5,1,0)+IF(BL53=5,1,0))","v":1},null,{"$f":"IF(AA53=\"\",\"\",AA53)","v":""},{"$f":"IF(AF53=\"\",\"\",AF53)","v":""},{"$f":"IF(AK53=\"\",\"\",AK53)","v":""},{"$f":"IF(AP53=\"\",\"\",AP53)","v":""},{"$f":"IF(AU53=\"\",\"\",AU53)","v":31},{"$f":"IF(AZ53=\"\",\"\",AZ53)","v":""},{"$f":"IF(BE53=\"\",\"\",BE53)","v":""},{"$f":"IF(BJ53=\"\",\"\",BJ53)","v":""},null,{"$f":"AD53+AI53+AN53+AS53+AX53+BC53+BH53","v":5},{"$f":"IF($F44>=5,IF(AB53=\"\",\"\",AB53),\"\")","v":""},{"$f":"IF($F44>=5,IF(AG53=\"\",\"\",AG53),\"\")","v":""},{"$f":"IF($F44>=5,IF(AL53=\"\",\"\",AL53),\"\")","v":""},{"$f":"IF($F44>=5,IF(AQ53=\"\",\"\",AQ53),\"\")","v":""},{"$f":"IF($F44>=5,IF(AR53=\"\",\"\",AR53),\"\")","v":""},{"$f":"IF($F44>=5,IF(AV53=\"\",\"\",AV53),\"\")","v":""},{"$f":"IF($F44>=5,IF(BA53=\"\",\"\",BA53),\"\")","v":""},{"$f":"IF($F44>=5,IF(BF53=\"\",\"\",BF53),\"\")","v":""},null,null,{"$f":"IF(ISNUMBER(AA53),(VLOOKUP(AA53,$BO$6:$BP$50,2)),0)","v":0},{"$f":"IF(AA53<>\"\",5,0)","v":0},{"$f":"AB53+AC53","v":0},null,null,{"$f":"IF(ISNUMBER(AF53),(VLOOKUP(AF53,$BO$6:$BP$50,2)),0)","v":0},{"$f":"IF(AF53<>\"\",5,0)","v":0},{"$f":"AG53+AH53","v":0},null,null,{"$f":"IF(ISNUMBER(AK53),(VLOOKUP(AK53,$BO$6:$BP$50,2)),0)","v":0},{"$f":"IF(AK53<>\"\",5,0)","v":0},{"$f":"AL53+AM53","v":0},null,null,{"$f":"IF(ISNUMBER(AP53),(VLOOKUP(AP53,$BO$6:$BP$50,2)),0)","v":0},{"$f":"IF(AP53<>\"\",5,0)","v":0},{"$f":"AQ53+AR53","v":0},null,31,{"$f":"IF(ISNUMBER(AU53),(VLOOKUP(AU53,$BO$6:$BP$50,2)),0)","v":0},{"$f":"IF(AU53<>\"\",5,0)","v":5},{"$f":"AV53+AW53","v":5},null,null,{"$f":"IF(ISNUMBER(AZ53),(VLOOKUP(AZ53,$BO$6:$BP$50,2)),0)","v":0},{"$f":"IF(AZ53<>\"\",5,0)","v":0},{"$f":"BA53+BB53","v":0},null,null,{"$f":"IF(ISNUMBER(BE53),(VLOOKUP(BE53,$BO$6:$BP$50,2)),0)","v":0},{"$f":"IF(BE53<>\"\",5,0)","v":0},{"$f":"BF53+BG53","v":0},null,null,{"$f":"IF(ISNUMBER(BJ53),(VLOOKUP(BJ53,$BO$6:$BP$50,2)),0)","v":0},{"$f":"IF(BJ53<>\"\",5,0)","v":0},{"$f":"BK53+BL53","v":0},null,48,0,0,0,0,0,0,0,0,1]
[{"$f":"IF(E54<E53,BO54,A53)","v":47},"Kjønigsen","Elvira","Kjelsås",{"$f":"IF(F54<=4,Q54,(Q54-SUM(SMALL(R54:Y54,{1;2;3;4}))))","v":5},{"$f":"(IF(AC54=5,1,0)+IF(AH54=5,1,0)+IF(AM54=5,1,0)+IF(AR54=5,1,0)+IF(AW54=5,1,0)+IF(BB54=5,1,0)+IF(BG54=5,1,0)+IF(BL54=5,1,0))","v":1},null,{"$f":"IF(AA54=\"\",\"\",AA54)","v":""},{"$f":"IF(AF54=\"\",\"\",AF54)","v":""},{"$f":"IF(AK54=\"\",\"\",AK54)","v":""},{"$f":"IF(AP54=\"\",\"\",AP54)","v":""},{"$f":"IF(AU54=\"\",\"\",AU54)","v":""},{"$f":"IF(AZ54=\"\",\"\",AZ54)","v":""},{"$f":"IF(BE54=\"\",\"\",BE54)","v":"dsq"},{"$f":"IF(BJ54=\"\",\"\",BJ54)","v":""},null,{"$f":"AD54+AI54+AN54+AS54+AX54+BC54+BH54","v":5},null,null,null,null,null,null,null,null,null,null,{"$f":"IF(ISNUMBER(AA54),(VLOOKUP(AA54,$BO$6:$BP$50,2)),0)","v":0},{"$f":"IF(AA54<>\"\",5,0)","v":0},{"$f":"AB54+AC54","v":0},null,null,{"$f":"IF(ISNUMBER(AF54),(VLOOKUP(AF54,$BO$6:$BP$50,2)),0)","v":0},{"$f":"IF(AF54<>\"\",5,0)","v":0},{"$f":"AG54+AH54","v":0},null,null,{"$f":"IF(ISNUMBER(AK54),(VLOOKUP(AK54,$BO$6:$BP$50,2)),0)","v":0},{"$f":"IF(AK54<>\"\",5,0)","v":0},{"$f":"AL54+AM54","v":0},null,null,{"$f":"IF(ISNUMBER(AP54),(VLOOKUP(AP54,$BO$6:$BP$50,2)),0)","v":0},{"$f":"IF(AP54<>\"\",5,0)","v":0},{"$f":"AQ54+AR54","v":0},null,null,{"$f":"IF(ISNUMBER(AU54),(VLOOKUP(AU54,$BO$6:$BP$50,2)),0)","v":0},{"$f":"IF(AU54<>\"\",5,0)","v":0},{"$f":"AV54+AW54","v":0},null,null,{"$f":"IF(ISNUMBER(AZ54),(VLOOKUP(AZ54,$BO$6:$BP$50,2)),0)","v":0},{"$f":"IF(AZ54<>\"\",5,0)","v":0},{"$f":"BA54+BB54","v":0},null,"dsq",{"$f":"IF(ISNUMBER(BE54),(VLOOKUP(BE54,$BO$6:$BP$50,2)),0)","v":0},{"$f":"IF(BE54<>\"\",5,0)","v":5},{"$f":"BF54+BG54","v":5},null,null,{"$f":"IF(ISNUMBER(BJ54),(VLOOKUP(BJ54,$BO$6:$BP$50,2)),0)","v":0},{"$f":"IF(BJ54<>\"\",5,0)","v":0},{"$f":"BK54+BL54","v":0},null,48,0,0,0,0,0,0,0,0,1]
[null,null,null,null,null,null,null,{"$f":"IF(AA55=\"\",\"\",AA55)","v":""},{"$f":"IF(AF55=\"\",\"\",AF55)","v":""},{"$f":"IF(AK55=\"\",\"\",AK55)","v":""},{"$f":"IF(AP55=\"\",\"\",AP55)","v":""},{"$f":"IF(AU55=\"\",\"\",AU55)","v":""},{"$f":"IF(AZ55=\"\",\"\",AZ55)","v":""},{"$f":"IF(BE55=\"\",\"\",BE55)","v":""},{"$f":"IF(BJ55=\"\",\"\",BJ55)","v":""}]
[null,null,null,null,null,null,null,"","","","","","","",""]
[null,null,null,null,null,null,null,"","","","","","","",""]
[null,null,null,null,null,null,null,"","","","","","","",""]
[null,null,null,null,null,null,null,"","","","","","","",""]
[null,null,null,null,null,null,null,"","","","","","","",""]
[null,null,null,null,null,null,null,"","","","","","","",""]
[null,null,null,null,null,null,null,"","","","","","","",""]
[null,null,null,null,null,null,null,"","","","","","","",""]
[null,null,null,null,null,null,null,"","","","","","","",""]
[null,null,null,null,null,null,null,"","","","","","","",""]
[null,null,null,null,null,null,null,"","","","","","","",""]
[null,null,null,null,null,null,null,"","","","","","","",""]
[null,null,null,null,null,null,null,"","","","","","","",""]
[null,null,null,null,null,null,null,"","","","","","","",""]
[null,null,null,null,null,null,null,"","","","","","","",""]
[null,null,null,null,null,null,null,"","","","","","","",""]
[null,null,null,null,null,null,null,"","","","","","","",""]

{"sheet":"G12 2018","index":4,"n_rows":72,"n_cols":76,"rows_kept":72,"cut":false,"hidden":false,"merged":[[0,42,0,45],[2,26,2,29],[2,31,2,34],[2,36,2,39],[2,41,2,44],[3,62,3,64],[4,7,4,14],[4,17,4,24],[2,51,2,54],[2,56,2,59],[2,61,2,64],[3,27,3,29],[3,32,3,34],[3,37,3,39],[3,42,3,44],[3,47,3,49],[3,52,3,54],[3,57,3,59],[2,46,2,49]]}
["Resultatliste Oslo Cup 2018 - Gutter 12 år"]
[{"$f":"'Forside 2018'!A2","v":"Etter 7 av 8 renn"}]
[null,null,null,null,null,null,null,"IRS Rennet","Ljan Rennet","Njård Rennet","Ready Rennet","Telenor Arena Cup","Euro-tecfarten","Oslo Alpinfestival SL","Oslo Alpinfestival SSL",null,null,"IRS Rennet","Ljan Rennet","Njård Rennet","Ready Rennet","Telenor Arena Cup","Euro-tecfarten","Oslo Alpinfestival SL","Oslo Alpinfestival SSL",null,"--------IRS Rennet----------",null,null,null,null,"----------Ljan Rennet---------",null,null,null,null,"--------Njård Rennet----------",null,null,null,null,"--------Ready Rennet---------",null,null,null,null,"-----Telenor Arena Cup----",null,null,null,null,"------Euro-tecfarten--------",null,null,null,null,"---Oslo Alpinfestival SL---",null,null,null,null,"---Oslo Alpinfestival SSL---"]
[null,null,null,null,null,"Antall",null,"2018-02-03","2018-02-04","2018-02-10","2018-02-11","2018-02-14","2018-02-28","2018-03-03","2018-03-04",null,"Poeng","2018-02-03","2018-02-04","2018-02-10","2018-02-11","2018-02-14","2018-02-28","2018-03-03","2018-03-04",null,null,"--------Poeng--------",null,null,null,null,"--------Poeng--------",null,null,null,null,"-------Poeng---------",null,null,null,null,"-------Poeng---------",null,null,null,null,"-------Poeng---------",null,null,null,null,"-------Poeng---------",null,null,null,null,"-------Poeng---------",null,null,null,null,"-------Poeng---------",null,null,null,null,null,"Løpere med ","Løpere med ","Løpere med ","Løpere med ","Løpere med ","Løpere med ","Løpere med ","Løpere med "]
["Plass","Etternavn","Fornavn","Klubb","Poeng","renn",null,"------------------------------Plassering i rennene---------------------------------",null,null,null,null,null,null,null,null,"brutto","----------------Resultatpoeng hvis mer enn 4 renn----------------",null,null,null,null,null,null,null,null,"Plass","Res.","Del.","Tot.",null,"Plass","Res.","Del.","Tot.",null,"Plass","Res.","Del.","Tot.",null,"Plass","Res.","Del.","Tot.",null,"Plass","Res.","Del.","Tot.",null,"Plass","Res.","Del.","Tot.",null,"Plass","Res.","Del.","Tot.",null,"Plass","Res.","Del.","Tot.",null,"Plass","Poeng","8 renn","7 renn","6 renn","5 renn","4 renn","3 renn","2 renn","kun 1 renn"]
[{"$f":"IF(E6<E5,BO6,A5)","v":1},"Polmar","Ola Skaar","Heming",{"$f":"IF(F6<=4,Q6,(Q6-SUM(SMALL(R6:Y6,{1;2;3;4}))))","v":415},{"$f":"(IF(AC6=5,1,0)+IF(AH6=5,1,0)+IF(AM6=5,1,0)+IF(AR6=5,1,0)+IF(AW6=5,1,0)+IF(BB6=5,1,0)+IF(BG6=5,1,0)+IF(BL6=5,1,0))","v":7},null,{"$f":"IF(AA6=\"\",\"\",AA6)","v":1},{"$f":"IF(AF6=\"\",\"\",AF6)","v":9},{"$f":"IF(AK6=\"\",\"\",AK6)","v":3},{"$f":"IF(AP6=\"\",\"\",AP6)","v":1},{"$f":"IF(AU6=\"\",\"\",AU6)","v":2},{"$f":"IF(AZ6=\"\",\"\",AZ6)","v":4},{"$f":"IF(BE6=\"\",\"\",BE6)","v":1},{"$f":"IF(BJ6=\"\",\"\",BJ6)","v":""},null,{"$f":"AD6+AI6+AN6+AS6+AX6+BC6+BH6","v":554},{"$f":"IF($F6>=5,IF(AB6=\"\",\"\",AB6),\"\")","v":100},{"$f":"IF($F6>=5,IF(AG6=\"\",\"\",AG6),\"\")","v":29},{"$f":"IF($F6>=5,IF(AL6=\"\",\"\",AL6),\"\")","v":60},{"$f":"IF($F6>=5,IF(AQ6=\"\",\"\",AQ6),\"\")","v":100},{"$f":"IF($F6>=5,IF(AV6=\"\",\"\",AV6),\"\")","v":80},{"$f":"IF($F6>=5,IF(BA6=\"\",\"\",BA6),\"\")","v":50},{"$f":"IF($F6>=5,IF(BF6=\"\",\"\",BF6),\"\")","v":100},{"$f":"IF($F6>=5,IF(BK6=\"\",\"\",BK6),\"\")","v":0},null,1,{"$f":"IF(ISNUMBER(AA6),(VLOOKUP(AA6,$BO$6:$BP$50,2)),0)","v":100},{"$f":"IF(AA6<>\"\",5,0)","v":5},{"$f":"AB6+AC6","v":105},null,9,{"$f":"IF(ISNUMBER(AF6),(VLOOKUP(AF6,$BO$6:$BP$50,2)),0)","v":29},{"$f":"IF(AF6<>\"\",5,0)","v":5},{"$f":"AG6+AH6","v":34},null,3,{"$f":"IF(ISNUMBER(AK6),(VLOOKUP(AK6,$BO$6:$BP$50,2)),0)","v":60},{"$f":"IF(AK6<>\"\",5,0)","v":5},{"$f":"AL6+AM6","v":65},null,1,{"$f":"IF(ISNUMBER(AP6),(VLOOKUP(AP6,$BO$6:$BP$50,2)),0)","v":100},{"$f":"IF(AP6<>\"\",5,0)","v":5},{"$f":"AQ6+AR6","v":105},null,2,{"$f":"IF(ISNUMBER(AU6),(VLOOKUP(AU6,$BO$6:$BP$50,2)),0)","v":80},{"$f":"IF(AU6<>\"\",5,0)","v":5},{"$f":"AV6+AW6","v":85},null,4,{"$f":"IF(ISNUMBER(AZ6),(VLOOKUP(AZ6,$BO$6:$BP$50,2)),0)","v":50},{"$f":"IF(AZ6<>\"\",5,0)","v":5},{"$f":"BA6+BB6","v":55},null,1,{"$f":"IF(ISNUMBER(BE6),(VLOOKUP(BE6,$BO$6:$BP$50,2)),0)","v":100},{"$f":"IF(BE6<>\"\",5,0)","v":5},{"$f":"BF6+BG6","v":105},null,null,{"$f":"IF(ISNUMBER(BJ6),(VLOOKUP(BJ6,$BO$6:$BP$50,2)),0)","v":0},{"$f":"IF(BJ6<>\"\",5,0)","v":0},{"$f":"BK6+BL6","v":0},null,1,100,{"$f":"IF($F6=8,1,0)","v":0},{"$f":"IF($F6=7,1,0)","v":1},{"$f":"IF($F6=6,1,0)","v":0},{"$f":"IF($F6=5,1,0)","v":0},{"$f":"IF($F6=4,1,0)","v":0},{"$f":"IF($F6=3,1,0)","v":0},{"$f":"IF($F6=2,1,0)","v":0},{"$f":"IF($F6=1,1,0)","v":0}]
[{"$f":"IF(E7<E6,BO7,A6)","v":2},"Sundborn","William Alexander","Heming",{"$f":"IF(F7<=4,Q7,(Q7-SUM(SMALL(R7:Y7,{1;2;3;4}))))","v":295},{"$f":"(IF(AC7=5,1,0)+IF(AH7=5,1,0)+IF(AM7=5,1,0)+IF(AR7=5,1,0)+IF(AW7=5,1,0)+IF(BB7=5,1,0)+IF(BG7=5,1,0)+IF(BL7=5,1,0))","v":7},null,{"$f":"IF(AA7=\"\",\"\",AA7)","v":2},{"$f":"IF(AF7=\"\",\"\",AF7)","v":"dsq"},{"$f":"IF(AK7=\"\",\"\",AK7)","v":5},{"$f":"IF(AP7=\"\",\"\",AP7)","v":2},{"$f":"IF(AU7=\"\",\"\",AU7)","v":4},{"$f":"IF(AZ7=\"\",\"\",AZ7)","v":8},{"$f":"IF(BE7=\"\",\"\",BE7)","v":4},{"$f":"IF(BJ7=\"\",\"\",BJ7)","v":""},null,{"$f":"AD7+AI7+AN7+AS7+AX7+BC7+BH7","v":372},{"$f":"IF($F7>=5,IF(AB7=\"\",\"\",AB7),\"\")","v":80},{"$f":"IF($F7>=5,IF(AG7=\"\",\"\",AG7),\"\")","v":0},{"$f":"IF($F7>=5,IF(AL7=\"\",\"\",AL7),\"\")","v":45},{"$f":"IF($F7>=5,IF(AQ7=\"\",\"\",AQ7),\"\")","v":80},{"$f":"IF($F7>=5,IF(AV7=\"\",\"\",AV7),\"\")","v":50},{"$f":"IF($F7>=5,IF(BA7=\"\",\"\",BA7),\"\")","v":32},{"$f":"IF($F7>=5,IF(BF7=\"\",\"\",BF7),\"\")","v":50},{"$f":"IF($F7>=5,IF(BK7=\"\",\"\",BK7),\"\")","v":0},null,2,{"$f":"IF(ISNUMBER(AA7),(VLOOKUP(AA7,$BO$6:$BP$50,2)),0)","v":80},{"$f":"IF(AA7<>\"\",5,0)","v":5},{"$f":"AB7+AC7","v":85},null,"dsq",{"$f":"IF(ISNUMBER(AF7),(VLOOKUP(AF7,$BO$6:$BP$50,2)),0)","v":0},{"$f":"IF(AF7<>\"\",5,0)","v":5},{"$f":"AG7+AH7","v":5},null,5,{"$f":"IF(ISNUMBER(AK7),(VLOOKUP(AK7,$BO$6:$BP$50,2)),0)","v":45},{"$f":"IF(AK7<>\"\",5,0)","v":5},{"$f":"AL7+AM7","v":50},null,2,{"$f":"IF(ISNUMBER(AP7),(VLOOKUP(AP7,$BO$6:$BP$50,2)),0)","v":80},{"$f":"IF(AP7<>\"\",5,0)","v":5},{"$f":"AQ7+AR7","v":85},null,4,{"$f":"IF(ISNUMBER(AU7),(VLOOKUP(AU7,$BO$6:$BP$50,2)),0)","v":50},{"$f":"IF(AU7<>\"\",5,0)","v":5},{"$f":"AV7+AW7","v":55},null,8,{"$f":"IF(ISNUMBER(AZ7),(VLOOKUP(AZ7,$BO$6:$BP$50,2)),0)","v":32},{"$f":"IF(AZ7<>\"\",5,0)","v":5},{"$f":"BA7+BB7","v":37},null,4,{"$f":"IF(ISNUMBER(BE7),(VLOOKUP(BE7,$BO$6:$BP$50,2)),0)","v":50},{"$f":"IF(BE7<>\"\",5,0)","v":5},{"$f":"BF7+BG7","v":55},null,null,{"$f":"IF(ISNUMBER(BJ7),(VLOOKUP(BJ7,$BO$6:$BP$50,2)),0)","v":0},{"$f":"IF(BJ7<>\"\",5,0)","v":0},{"$f":"BK7+BL7","v":0},null,2,80,{"$f":"IF($F7=8,1,0)","v":0},1,0,0,0,0,0,0]
[{"$f":"IF(E8<E7,BO8,A7)","v":3},"Andersen","Fredrik","NERO",{"$f":"IF(F8<=4,Q8,(Q8-SUM(SMALL(R8:Y8,{1;2;3;4}))))","v":280},{"$f":"(IF(AC8=5,1,0)+IF(AH8=5,1,0)+IF(AM8=5,1,0)+IF(AR8=5,1,0)+IF(AW8=5,1,0)+IF(BB8=5,1,0)+IF(BG8=5,1,0)+IF(BL8=5,1,0))","v":4},null,{"$f":"IF(AA8=\"\",\"\",AA8)","v":""},{"$f":"IF(AF8=\"\",\"\",AF8)","v":""},{"$f":"IF(AK8=\"\",\"\",AK8)","v":2},{"$f":"IF(AP8=\"\",\"\",AP8)","v":""},{"$f":"IF(AU8=\"\",\"\",AU8)","v":3},{"$f":"IF(AZ8=\"\",\"\",AZ8)","v":3},{"$f":"IF(BE8=\"\",\"\",BE8)","v":3},{"$f":"IF(BJ8=\"\",\"\",BJ8)","v":""},null,{"$f":"AD8+AI8+AN8+AS8+AX8+BC8+BH8","v":280},{"$f":"IF($F8>=5,IF(AB8=\"\",\"\",AB8),\"\")","v":""},{"$f":"IF($F8>=5,IF(AG8=\"\",\"\",AG8),\"\")","v":""},{"$f":"IF($F8>=5,IF(AL8=\"\",\"\",AL8),\"\")","v":""},{"$f":"IF($F8>=5,IF(AQ8=\"\",\"\",AQ8),\"\")","v":""},{"$f":"IF($F8>=5,IF(AV8=\"\",\"\",AV8),\"\")","v":""},{"$f":"IF($F8>=5,IF(BA8=\"\",\"\",BA8),\"\")","v":""},{"$f":"IF($F8>=5,IF(BF8=\"\",\"\",BF8),\"\")","v":""},{"$f":"IF($F8>=5,IF(BK8=\"\",\"\",BK8),\"\")","v":""},null,null,{"$f":"IF(ISNUMBER(AA8),(VLOOKUP(AA8,$BO$6:$BP$50,2)),0)","v":0},{"$f":"IF(AA8<>\"\",5,0)","v":0},{"$f":"AB8+AC8","v":0},null,null,{"$f":"IF(ISNUMBER(AF8),(VLOOKUP(AF8,$BO$6:$BP$50,2)),0)","v":0},{"$f":"IF(AF8<>\"\",5,0)","v":0},{"$f":"AG8+AH8","v":0},null,2,{"$f":"IF(ISNUMBER(AK8),(VLOOKUP(AK8,$BO$6:$BP$50,2)),0)","v":80},{"$f":"IF(AK8<>\"\",5,0)","v":5},{"$f":"AL8+AM8","v":85},null,null,{"$f":"IF(ISNUMBER(AP8),(VLOOKUP(AP8,$BO$6:$BP$50,2)),0)","v":0},{"$f":"IF(AP8<>\"\",5,0)","v":0},{"$f":"AQ8+AR8","v":0},null,3,{"$f":"IF(ISNUMBER(AU8),(VLOOKUP(AU8,$BO$6:$BP$50,2)),0)","v":60},{"$f":"IF(AU8<>\"\",5,0)","v":5},{"$f":"AV8+AW8","v":65},null,3,{"$f":"IF(ISNUMBER(AZ8),(VLOOKUP(AZ8,$BO$6:$BP$50,2)),0)","v":60},{"$f":"IF(AZ8<>\"\",5,0)","v":5},{"$f":"BA8+BB8","v":65},null,3,{"$f":"IF(ISNUMBER(BE8),(VLOOKUP(BE8,$BO$6:$BP$50,2)),0)","v":60},{"$f":"IF(BE8<>\"\",5,0)","v":5},{"$f":"BF8+BG8","v":65},null,null,{"$f":"IF(ISNUMBER(BJ8),(VLOOKUP(BJ8,$BO$6:$BP$50,2)),0)","v":0},{"$f":"IF(BJ8<>\"\",5,0)","v":0},{"$f":"BK8+BL8","v":0},null,3,60,0,0,0,0,1,0,0,0]
[{"$f":"IF(E9<E8,BO9,A8)","v":4},"Rølles","Axel Friis","Ready",{"$f":"IF(F9<=4,Q9,(Q9-SUM(SMALL(R9:Y9,{1;2;3;4}))))","v":275},{"$f":"(IF(AC9=5,1,0)+IF(AH9=5,1,0)+IF(AM9=5,1,0)+IF(AR9=5,1,0)+IF(AW9=5,1,0)+IF(BB9=5,1,0)+IF(BG9=5,1,0)+IF(BL9=5,1,0))","v":7},null,{"$f":"IF(AA9=\"\",\"\",AA9)","v":13},{"$f":"IF(AF9=\"\",\"\",AF9)","v":4},{"$f":"IF(AK9=\"\",\"\",AK9)","v":4},{"$f":"IF(AP9=\"\",\"\",AP9)","v":3},{"$f":"IF(AU9=\"\",\"\",AU9)","v":5},{"$f":"IF(AZ9=\"\",\"\",AZ9)","v":2},{"$f":"IF(BE9=\"\",\"\",BE9)","v":8},{"$f":"IF(BJ9=\"\",\"\",BJ9)","v":""},null,{"$f":"AD9+AI9+AN9+AS9+AX9+BC9+BH9","v":372},{"$f":"IF($F9>=5,IF(AB9=\"\",\"\",AB9),\"\")","v":20},{"$f":"IF($F9>=5,IF(AG9=\"\",\"\",AG9),\"\")","v":50},{"$f":"IF($F9>=5,IF(AL9=\"\",\"\",AL9),\"\")","v":50},{"$f":"IF($F9>=5,IF(AQ9=\"\",\"\",AQ9),\"\")","v":60},{"$f":"IF($F9>=5,IF(AV9=\"\",\"\",AV9),\"\")","v":45},{"$f":"IF($F9>=5,IF(BA9=\"\",\"\",BA9),\"\")","v":80},{"$f":"IF($F9>=5,IF(BF9=\"\",\"\",BF9),\"\")","v":32},{"$f":"IF($F9>=5,IF(BK9=\"\",\"\",BK9),\"\")","v":0},null,13,{"$f":"IF(ISNUMBER(AA9),(VLOOKUP(AA9,$BO$6:$BP$50,2)),0)","v":20},{"$f":"IF(AA9<>\"\",5,0)","v":5},{"$f":"AB9+AC9","v":25},null,4,{"$f":"IF(ISNUMBER(AF9),(VLOOKUP(AF9,$BO$6:$BP$50,2)),0)","v":50},{"$f":"IF(AF9<>\"\",5,0)","v":5},{"$f":"AG9+AH9","v":55},null,4,{"$f":"IF(ISNUMBER(AK9),(VLOOKUP(AK9,$BO$6:$BP$50,2)),0)","v":50},{"$f":"IF(AK9<>\"\",5,0)","v":5},{"$f":"AL9+AM9","v":55},null,3,{"$f":"IF(ISNUMBER(AP9),(VLOOKUP(AP9,$BO$6:$BP$50,2)),0)","v":60},{"$f":"IF(AP9<>\"\",5,0)","v":5},{"$f":"AQ9+AR9","v":65},null,5,{"$f":"IF(ISNUMBER(AU9),(VLOOKUP(AU9,$BO$6:$BP$50,2)),0)","v":45},{"$f":"IF(AU9<>\"\",5,0)","v":5},{"$f":"AV9+AW9","v":50},null,2,{"$f":"IF(ISNUMBER(AZ9),(VLOOKUP(AZ9,$BO$6:$BP$50,2)),0)","v":80},{"$f":"IF(AZ9<>\"\",5,0)","v":5},{"$f":"BA9+BB9","v":85},null,8,{"$f":"IF(ISNUMBER(BE9),(VLOOKUP(BE9,$BO$6:$BP$50,2)),0)","v":32},{"$f":"IF(BE9<>\"\",5,0)","v":5},{"$f":"BF9+BG9","v":37},null,null,{"$f":"IF(ISNUMBER(BJ9),(VLOOKUP(BJ9,$BO$6:$BP$50,2)),0)","v":0},{"$f":"IF(BJ9<>\"\",5,0)","v":0},{"$f":"BK9+BL9","v":0},null,4,50,0,1,0,0,0,0,0,0]
[{"$f":"IF(E10<E9,BO10,A9)","v":5},"Wroll-Evensen","Mikkel","Heming",{"$f":"IF(F10<=4,Q10,(Q10-SUM(SMALL(R10:Y10,{1;2;3;4}))))","v":265},{"$f":"(IF(AC10=5,1,0)+IF(AH10=5,1,0)+IF(AM10=5,1,0)+IF(AR10=5,1,0)+IF(AW10=5,1,0)+IF(BB10=5,1,0)+IF(BG10=5,1,0)+IF(BL10=5,1,0))","v":7},null,{"$f":"IF(AA10=\"\",\"\",AA10)","v":4},{"$f":"IF(AF10=\"\",\"\",AF10)","v":1},{"$f":"IF(AK10=\"\",\"\",AK10)","v":7},{"$f":"IF(AP10=\"\",\"\",AP10)","v":6},{"$f":"IF(AU10=\"\",\"\",AU10)","v":9},{"$f":"IF(AZ10=\"\",\"\",AZ10)","v":20},{"$f":"IF(BE10=\"\",\"\",BE10)","v":6},{"$f":"IF(BJ10=\"\",\"\",BJ10)","v":""},null,{"$f":"AD10+AI10+AN10+AS10+AX10+BC10+BH10","v":341},{"$f":"IF($F10>=5,IF(AB10=\"\",\"\",AB10),\"\")","v":50},{"$f":"IF($F10>=5,IF(AG10=\"\",\"\",AG10),\"\")","v":100},{"$f":"IF($F10>=5,IF(AL10=\"\",\"\",AL10),\"\")","v":36},{"$f":"IF($F10>=5,IF(AQ10=\"\",\"\",AQ10),\"\")","v":40},{"$f":"IF($F10>=5,IF(AV10=\"\",\"\",AV10),\"\")","v":29},{"$f":"IF($F10>=5,IF(BA10=\"\",\"\",BA10),\"\")","v":11},{"$f":"IF($F10>=5,IF(BF10=\"\",\"\",BF10),\"\")","v":40},{"$f":"IF($F10>=5,IF(BK10=\"\",\"\",BK10),\"\")","v":0},null,4,{"$f":"IF(ISNUMBER(AA10),(VLOOKUP(AA10,$BO$6:$BP$50,2)),0)","v":50},{"$f":"IF(AA10<>\"\",5,0)","v":5},{"$f":"AB10+AC10","v":55},null,1,{"$f":"IF(ISNUMBER(AF10),(VLOOKUP(AF10,$BO$6:$BP$50,2)),0)","v":100},{"$f":"IF(AF10<>\"\",5,0)","v":5},{"$f":"AG10+AH10","v":105},null,7,{"$f":"IF(ISNUMBER(AK10),(VLOOKUP(AK10,$BO$6:$BP$50,2)),0)","v":36},{"$f":"IF(AK10<>\"\",5,0)","v":5},{"$f":"AL10+AM10","v":41},null,6,{"$f":"IF(ISNUMBER(AP10),(VLOOKUP(AP10,$BO$6:$BP$50,2)),0)","v":40},{"$f":"IF(AP10<>\"\",5,0)","v":5},{"$f":"AQ10+AR10","v":45},null,9,{"$f":"IF(ISNUMBER(AU10),(VLOOKUP(AU10,$BO$6:$BP$50,2)),0)","v":29},{"$f":"IF(AU10<>\"\",5,0)","v":5},{"$f":"AV10+AW10","v":34},null,20,{"$f":"IF(ISNUMBER(AZ10),(VLOOKUP(AZ10,$BO$6:$BP$50,2)),0)","v":11},{"$f":"IF(AZ10<>\"\",5,0)","v":5},{"$f":"BA10+BB10","v":16},null,6,{"$f":"IF(ISNUMBER(BE10),(VLOOKUP(BE10,$BO$6:$BP$50,2)),0)","v":40},{"$f":"IF(BE10<>\"\",5,0)","v":5},{"$f":"BF10+BG10","v":45},null,null,{"$f":"IF(ISNUMBER(BJ10),(VLOOKUP(BJ10,$BO$6:$BP$50,2)),0)","v":0},{"$f":"IF(BJ10<>\"\",5,0)","v":0},{"$f":"BK10+BL10","v":0},null,5,45,0,1,0,0,0,0,0,0]
[{"$f":"IF(E11<E10,BO11,A10)","v":6},"Brevik","Magnus","Ljan",{"$f":"IF(F11<=4,Q11,(Q11-SUM(SMALL(R11:Y11,{1;2;3;4}))))","v":264},{"$f":"(IF(AC11=5,1,0)+IF(AH11=5,1,0)+IF(AM11=5,1,0)+IF(AR11=5,1,0)+IF(AW11=5,1,0)+IF(BB11=5,1,0)+IF(BG11=5,1,0)+IF(BL11=5,1,0))","v":7},null,{"$f":"IF(AA11=\"\",\"\",AA11)","v":5},{"$f":"IF(AF11=\"\",\"\",AF11)","v":3},{"$f":"IF(AK11=\"\",\"\",AK11)","v":12},{"$f":"IF(AP11=\"\",\"\",AP11)","v":11},{"$f":"IF(AU11=\"\",\"\",AU11)","v":14},{"$f":"IF(AZ11=\"\",\"\",AZ11)","v":1},{"$f":"IF(BE11=\"\",\"\",BE11)","v":"dsq"},{"$f":"IF(BJ11=\"\",\"\",BJ11)","v":""},null,{"$f":"AD11+AI11+AN11+AS11+AX11+BC11+BH11","v":304},{"$f":"IF($F11>=5,IF(AB11=\"\",\"\",AB11),\"\")","v":45},{"$f":"IF($F11>=5,IF(AG11=\"\",\"\",AG11),\"\")","v":60},{"$f":"IF($F11>=5,IF(AL11=\"\",\"\",AL11),\"\")","v":22},{"$f":"IF($F11>=5,IF(AQ11=\"\",\"\",AQ11),\"\")","v":24},{"$f":"IF($F11>=5,IF(AV11=\"\",\"\",AV11),\"\")","v":18},{"$f":"IF($F11>=5,IF(BA11=\"\",\"\",BA11),\"\")","v":100},{"$f":"IF($F11>=5,IF(BF11=\"\",\"\",BF11),\"\")","v":0},{"$f":"IF($F11>=5,IF(BK11=\"\",\"\",BK11),\"\")","v":0},null,5,{"$f":"IF(ISNUMBER(AA11),(VLOOKUP(AA11,$BO$6:$BP$50,2)),0)","v":45},{"$f":"IF(AA11<>\"\",5,0)","v":5},{"$f":"AB11+AC11","v":50},null,3,{"$f":"IF(ISNUMBER(AF11),(VLOOKUP(AF11,$BO$6:$BP$50,2)),0)","v":60},{"$f":"IF(AF11<>\"\",5,0)","v":5},{"$f":"AG11+AH11","v":65},null,12,{"$f":"IF(ISNUMBER(AK11),(VLOOKUP(AK11,$BO$6:$BP$50,2)),0)","v":22},{"$f":"IF(AK11<>\"\",5,0)","v":5},{"$f":"AL11+AM11","v":27},null,11,{"$f":"IF(ISNUMBER(AP11),(VLOOKUP(AP11,$BO$6:$BP$50,2)),0)","v":24},{"$f":"IF(AP11<>\"\",5,0)","v":5},{"$f":"AQ11+AR11","v":29},null,14,{"$f":"IF(ISNUMBER(AU11),(VLOOKUP(AU11,$BO$6:$BP$50,2)),0)","v":18},{"$f":"IF(AU11<>\"\",5,0)","v":5},{"$f":"AV11+AW11","v":23},null,1,{"$f":"IF(ISNUMBER(AZ11),(VLOOKUP(AZ11,$BO$6:$BP$50,2)),0)","v":100},{"$f":"IF(AZ11<>\"\",5,0)","v":5},{"$f":"BA11+BB11","v":105},null,"dsq",{"$f":"IF(ISNUMBER(BE11),(VLOOKUP(BE11,$BO$6:$BP$50,2)),0)","v":0},{"$f":"IF(BE11<>\"\",5,0)","v":5},{"$f":"BF11+BG11","v":5},null,null,{"$f":"IF(ISNUMBER(BJ11),(VLOOKUP(BJ11,$BO$6:$BP$50,2)),0)","v":0},{"$f":"IF(BJ11<>\"\",5,0)","v":0},{"$f":"BK11+BL11","v":0},null,6,40,0,1,0,0,0,0,0,0]
[{"$f":"IF(E12<E11,BO12,A11)","v":7},"Hiorth","Felix","Heming",{"$f":"IF(F12<=4,Q12,(Q12-SUM(SMALL(R12:Y12,{1;2;3;4}))))","v":250},{"$f":"(IF(AC12=5,1,0)+IF(AH12=5,1,0)+IF(AM12=5,1,0)+IF(AR12=5,1,0)+IF(AW12=5,1,0)+IF(BB12=5,1,0)+IF(BG12=5,1,0)+IF(BL12=5,1,0))","v":7},null,{"$f":"IF(AA12=\"\",\"\",AA12)","v":"dsq"},{"$f":"IF(AF12=\"\",\"\",AF12)","v":2},{"$f":"IF(AK12=\"\",\"\",AK12)","v":6},{"$f":"IF(AP12=\"\",\"\",AP12)","v":4},{"$f":"IF(AU12=\"\",\"\",AU12)","v":"dsq"},{"$f":"IF(AZ12=\"\",\"\",AZ12)","v":6},{"$f":"IF(BE12=\"\",\"\",BE12)","v":5},{"$f":"IF(BJ12=\"\",\"\",BJ12)","v":""},null,{"$f":"AD12+AI12+AN12+AS12+AX12+BC12+BH12","v":290},{"$f":"IF($F12>=5,IF(AB12=\"\",\"\",AB12),\"\")","v":0},{"$f":"IF($F12>=5,IF(AG12=\"\",\"\",AG12),\"\")","v":80},{"$f":"IF($F12>=5,IF(AL12=\"\",\"\",AL12),\"\")","v":40},{"$f":"IF($F12>=5,IF(AQ12=\"\",\"\",AQ12),\"\")","v":50},{"$f":"IF($F12>=5,IF(AV12=\"\",\"\",AV12),\"\")","v":0},{"$f":"IF($F12>=5,IF(BA12=\"\",\"\",BA12),\"\")","v":40},{"$f":"IF($F12>=5,IF(BF12=\"\",\"\",BF12),\"\")","v":45},{"$f":"IF($F12>=5,IF(BK12=\"\",\"\",BK12),\"\")","v":0},null,"dsq",{"$f":"IF(ISNUMBER(AA12),(VLOOKUP(AA12,$BO$6:$BP$50,2)),0)","v":0},{"$f":"IF(AA12<>\"\",5,0)","v":5},{"$f":"AB12+AC12","v":5},null,2,{"$f":"IF(ISNUMBER(AF12),(VLOOKUP(AF12,$BO$6:$BP$50,2)),0)","v":80},{"$f":"IF(AF12<>\"\",5,0)","v":5},{"$f":"AG12+AH12","v":85},null,6,{"$f":"IF(ISNUMBER(AK12),(VLOOKUP(AK12,$BO$6:$BP$50,2)),0)","v":40},{"$f":"IF(AK12<>\"\",5,0)","v":5},{"$f":"AL12+AM12","v":45},null,4,{"$f":"IF(ISNUMBER(AP12),(VLOOKUP(AP12,$BO$6:$BP$50,2)),0)","v":50},{"$f":"IF(AP12<>\"\",5,0)","v":5},{"$f":"AQ12+AR12","v":55},null,"dsq",{"$f":"IF(ISNUMBER(AU12),(VLOOKUP(AU12,$BO$6:$BP$50,2)),0)","v":0},{"$f":"IF(AU12<>\"\",5,0)","v":5},{"$f":"AV12+AW12","v":5},null,6,{"$f":"IF(ISNUMBER(AZ12),(VLOOKUP(AZ12,$BO$6:$BP$50,2)),0)","v":40},{"$f":"IF(AZ12<>\"\",5,0)","v":5},{"$f":"BA12+BB12","v":45},null,5,{"$f":"IF(ISNUMBER(BE12),(VLOOKUP(BE12,$BO$6:$BP$50,2)),0)","v":45},{"$f":"IF(BE12<>\"\",5,0)","v":5},{"$f":"BF12+BG12","v":50},null,null,{"$f":"IF(ISNUMBER(BJ12),(VLOOKUP(BJ12,$BO$6:$BP$50,2)),0)","v":0},{"$f":"IF(BJ12<>\"\",5,0)","v":0},{"$f":"BK12+BL12","v":0},null,7,36,0,1,0,0,0,0,0,0]
[{"$f":"IF(E13<E12,BO13,A12)","v":8},"Spone","Fabian","Heming",{"$f":"IF(F13<=4,Q13,(Q13-SUM(SMALL(R13:Y13,{1;2;3;4}))))","v":245},{"$f":"(IF(AC13=5,1,0)+IF(AH13=5,1,0)+IF(AM13=5,1,0)+IF(AR13=5,1,0)+IF(AW13=5,1,0)+IF(BB13=5,1,0)+IF(BG13=5,1,0)+IF(BL13=5,1,0))","v":7},null,{"$f":"IF(AA13=\"\",\"\",AA13)","v":6},{"$f":"IF(AF13=\"\",\"\",AF13)","v":5},{"$f":"IF(AK13=\"\",\"\",AK13)","v":10},{"$f":"IF(AP13=\"\",\"\",AP13)","v":7},{"$f":"IF(AU13=\"\",\"\",AU13)","v":16},{"$f":"IF(AZ13=\"\",\"\",AZ13)","v":5},{"$f":"IF(BE13=\"\",\"\",BE13)","v":2},{"$f":"IF(BJ13=\"\",\"\",BJ13)","v":""},null,{"$f":"AD13+AI13+AN13+AS13+AX13+BC13+BH13","v":322},{"$f":"IF($F13>=5,IF(AB13=\"\",\"\",AB13),\"\")","v":40},{"$f":"IF($F13>=5,IF(AG13=\"\",\"\",AG13),\"\")","v":45},{"$f":"IF($F13>=5,IF(AL13=\"\",\"\",AL13),\"\")","v":26},{"$f":"IF($F13>=5,IF(AQ13=\"\",\"\",AQ13),\"\")","v":36},{"$f":"IF($F13>=5,IF(AV13=\"\",\"\",AV13),\"\")","v":15},{"$f":"IF($F13>=5,IF(BA13=\"\",\"\",BA13),\"\")","v":45},{"$f":"IF($F13>=5,IF(BF13=\"\",\"\",BF13),\"\")","v":80},{"$f":"IF($F13>=5,IF(BK13=\"\",\"\",BK13),\"\")","v":0},null,6,{"$f":"IF(ISNUMBER(AA13),(VLOOKUP(AA13,$BO$6:$BP$50,2)),0)","v":40},{"$f":"IF(AA13<>\"\",5,0)","v":5},{"$f":"AB13+AC13","v":45},null,5,{"$f":"IF(ISNUMBER(AF13),(VLOOKUP(AF13,$BO$6:$BP$50,2)),0)","v":45},{"$f":"IF(AF13<>\"\",5,0)","v":5},{"$f":"AG13+AH13","v":50},null,10,{"$f":"IF(ISNUMBER(AK13),(VLOOKUP(AK13,$BO$6:$BP$50,2)),0)","v":26},{"$f":"IF(AK13<>\"\",5,0)","v":5},{"$f":"AL13+AM13","v":31},null,7,{"$f":"IF(ISNUMBER(AP13),(VLOOKUP(AP13,$BO$6:$BP$50,2)),0)","v":36},{"$f":"IF(AP13<>\"\",5,0)","v":5},{"$f":"AQ13+AR13","v":41},null,16,{"$f":"IF(ISNUMBER(AU13),(VLOOKUP(AU13,$BO$6:$BP$50,2)),0)","v":15},{"$f":"IF(AU13<>\"\",5,0)","v":5},{"$f":"AV13+AW13","v":20},null,5,{"$f":"IF(ISNUMBER(AZ13),(VLOOKUP(AZ13,$BO$6:$BP$50,2)),0)","v":45},{"$f":"IF(AZ13<>\"\",5,0)","v":5},{"$f":"BA13+BB13","v":50},null,2,{"$f":"IF(ISNUMBER(BE13),(VLOOKUP(BE13,$BO$6:$BP$50,2)),0)","v":80},{"$f":"IF(BE13<>\"\",5,0)","v":5},{"$f":"BF13+BG13","v":85},null,null,{"$f":"IF(ISNUMBER(BJ13),(VLOOKUP(BJ13,$BO$6:$BP$50,2)),0)","v":0},{"$f":"IF(BJ13<>\"\",5,0)","v":0},{"$f":"BK13+BL13","v":0},null,8,32,0,1,0,0,0,0,0,0]
[{"$f":"IF(E14<E13,BO14,A13)","v":9},"Torpe","Aleksander Berg","Stabæk",{"$f":"IF(F14<=4,Q14,(Q14-SUM(SMALL(R14:Y14,{1;2;3;4}))))","v":210},{"$f":"(IF(AC14=5,1,0)+IF(AH14=5,1,0)+IF(AM14=5,1,0)+IF(AR14=5,1,0)+IF(AW14=5,1,0)+IF(BB14=5,1,0)+IF(BG14=5,1,0)+IF(BL14=5,1,0))","v":2},null,{"$f":"IF(AA14=\"\",\"\",AA14)","v":""},{"$f":"IF(AF14=\"\",\"\",AF14)","v":""},{"$f":"IF(AK14=\"\",\"\",AK14)","v":1},{"$f":"IF(AP14=\"\",\"\",AP14)","v":""},{"$f":"IF(AU14=\"\",\"\",AU14)","v":1},{"$f":"IF(AZ14=\"\",\"\",AZ14)","v":""},{"$f":"IF(BE14=\"\",\"\",BE14)","v":""},{"$f":"IF(BJ14=\"\",\"\",BJ14)","v":""},null,{"$f":"AD14+AI14+AN14+AS14+AX14+BC14+BH14","v":210},{"$f":"IF($F14>=5,IF(AB14=\"\",\"\",AB14),\"\")","v":""},{"$f":"IF($F14>=5,IF(AG14=\"\",\"\",AG14),\"\")","v":""},{"$f":"IF($F14>=5,IF(AL14=\"\",\"\",AL14),\"\")","v":""},{"$f":"IF($F14>=5,IF(AQ14=\"\",\"\",AQ14),\"\")","v":""},{"$f":"IF($F14>=5,IF(AV14=\"\",\"\",AV14),\"\")","v":""},{"$f":"IF($F14>=5,IF(BA14=\"\",\"\",BA14),\"\")","v":""},{"$f":"IF($F14>=5,IF(BF14=\"\",\"\",BF14),\"\")","v":""},{"$f":"IF($F14>=5,IF(BK14=\"\",\"\",BK14),\"\")","v":""},null,null,{"$f":"IF(ISNUMBER(AA14),(VLOOKUP(AA14,$BO$6:$BP$50,2)),0)","v":0},{"$f":"IF(AA14<>\"\",5,0)","v":0},{"$f":"AB14+AC14","v":0},null,null,{"$f":"IF(ISNUMBER(AF14),(VLOOKUP(AF14,$BO$6:$BP$50,2)),0)","v":0},{"$f":"IF(AF14<>\"\",5,0)","v":0},{"$f":"AG14+AH14","v":0},null,1,{"$f":"IF(ISNUMBER(AK14),(VLOOKUP(AK14,$BO$6:$BP$50,2)),0)","v":100},{"$f":"IF(AK14<>\"\",5,0)","v":5},{"$f":"AL14+AM14","v":105},null,null,{"$f":"IF(ISNUMBER(AP14),(VLOOKUP(AP14,$BO$6:$BP$50,2)),0)","v":0},{"$f":"IF(AP14<>\"\",5,0)","v":0},{"$f":"AQ14+AR14","v":0},null,1,{"$f":"IF(ISNUMBER(AU14),(VLOOKUP(AU14,$BO$6:$BP$50,2)),0)","v":100},{"$f":"IF(AU14<>\"\",5,0)","v":5},{"$f":"AV14+AW14","v":105},null,null,{"$f":"IF(ISNUMBER(AZ14),(VLOOKUP(AZ14,$BO$6:$BP$50,2)),0)","v":0},{"$f":"IF(AZ14<>\"\",5,0)","v":0},{"$f":"BA14+BB14","v":0},null,null,{"$f":"IF(ISNUMBER(BE14),(VLOOKUP(BE14,$BO$6:$BP$50,2)),0)","v":0},{"$f":"IF(BE14<>\"\",5,0)","v":0},{"$f":"BF14+BG14","v":0},null,null,{"$f":"IF(ISNUMBER(BJ14),(VLOOKUP(BJ14,$BO$6:$BP$50,2)),0)","v":0},{"$f":"IF(BJ14<>\"\",5,0)","v":0},{"$f":"BK14+BL14","v":0},null,9,29,0,0,0,0,0,0,1,0]
[{"$f":"IF(E15<E14,BO15,A14)","v":10},"Halvorsen","Mathias Nyhus","Heming",{"$f":"IF(F15<=4,Q15,(Q15-SUM(SMALL(R15:Y15,{1;2;3;4}))))","v":182},{"$f":"(IF(AC15=5,1,0)+IF(AH15=5,1,0)+IF(AM15=5,1,0)+IF(AR15=5,1,0)+IF(AW15=5,1,0)+IF(BB15=5,1,0)+IF(BG15=5,1,0)+IF(BL15=5,1,0))","v":5},null,{"$f":"IF(AA15=\"\",\"\",AA15)","v":14},{"$f":"IF(AF15=\"\",\"\",AF15)","v":6},{"$f":"IF(AK15=\"\",\"\",AK15)","v":8},{"$f":"IF(AP15=\"\",\"\",AP15)","v":5},{"$f":"IF(AU15=\"\",\"\",AU15)","v":6},{"$f":"IF(AZ15=\"\",\"\",AZ15)","v":""},{"$f":"IF(BE15=\"\",\"\",BE15)","v":""},{"$f":"IF(BJ15=\"\",\"\",BJ15)","v":""},null,{"$f":"AD15+AI15+AN15+AS15+AX15+BC15+BH15","v":200},{"$f":"IF($F15>=5,IF(AB15=\"\",\"\",AB15),\"\")","v":18},{"$f":"IF($F15>=5,IF(AG15=\"\",\"\",AG15),\"\")","v":40},{"$f":"IF($F15>=5,IF(AL15=\"\",\"\",AL15),\"\")","v":32},{"$f":"IF($F15>=5,IF(AQ15=\"\",\"\",AQ15),\"\")","v":45},{"$f":"IF($F15>=5,IF(AV15=\"\",\"\",AV15),\"\")","v":40},{"$f":"IF($F15>=5,IF(BA15=\"\",\"\",BA15),\"\")","v":0},{"$f":"IF($F15>=5,IF(BF15=\"\",\"\",BF15),\"\")","v":0},{"$f":"IF($F15>=5,IF(BK15=\"\",\"\",BK15),\"\")","v":0},null,14,{"$f":"IF(ISNUMBER(AA15),(VLOOKUP(AA15,$BO$6:$BP$50,2)),0)","v":18},{"$f":"IF(AA15<>\"\",5,0)","v":5},{"$f":"AB15+AC15","v":23},null,6,{"$f":"IF(ISNUMBER(AF15),(VLOOKUP(AF15,$BO$6:$BP$50,2)),0)","v":40},{"$f":"IF(AF15<>\"\",5,0)","v":5},{"$f":"AG15+AH15","v":45},null,8,{"$f":"IF(ISNUMBER(AK15),(VLOOKUP(AK15,$BO$6:$BP$50,2)),0)","v":32},{"$f":"IF(AK15<>\"\",5,0)","v":5},{"$f":"AL15+AM15","v":37},null,5,{"$f":"IF(ISNUMBER(AP15),(VLOOKUP(AP15,$BO$6:$BP$50,2)),0)","v":45},{"$f":"IF(AP15<>\"\",5,0)","v":5},{"$f":"AQ15+AR15","v":50},null,6,{"$f":"IF(ISNUMBER(AU15),(VLOOKUP(AU15,$BO$6:$BP$50,2)),0)","v":40},{"$f":"IF(AU15<>\"\",5,0)","v":5},{"$f":"AV15+AW15","v":45},null,null,{"$f":"IF(ISNUMBER(AZ15),(VLOOKUP(AZ15,$BO$6:$BP$50,2)),0)","v":0},{"$f":"IF(AZ15<>\"\",5,0)","v":0},{"$f":"BA15+BB15","v":0},null,null,{"$f":"IF(ISNUMBER(BE15),(VLOOKUP(BE15,$BO$6:$BP$50,2)),0)","v":0},{"$f":"IF(BE15<>\"\",5,0)","v":0},{"$f":"BF15+BG15","v":0},null,null,{"$f":"IF(ISNUMBER(BJ15),(VLOOKUP(BJ15,$BO$6:$BP$50,2)),0)","v":0},{"$f":"IF(BJ15<>\"\",5,0)","v":0},{"$f":"BK15+BL15","v":0},null,10,26,0,0,0,1,0,0,0,0]
[{"$f":"IF(E16<E15,BO17,A15)","v":12},"Engell","Martin","Kjelsås",{"$f":"IF(F16<=4,Q16,(Q16-SUM(SMALL(R16:Y16,{1;2;3;4}))))","v":130},{"$f":"(IF(AC16=5,1,0)+IF(AH16=5,1,0)+IF(AM16=5,1,0)+IF(AR16=5,1,0)+IF(AW16=5,1,0)+IF(BB16=5,1,0)+IF(BG16=5,1,0)+IF(BL16=5,1,0))","v":6},null,{"$f":"IF(AA16=\"\",\"\",AA16)","v":""},{"$f":"IF(AF16=\"\",\"\",AF16)","v":"dsq"},{"$f":"IF(AK16=\"\",\"\",AK16)","v":39},{"$f":"IF(AP16=\"\",\"\",AP16)","v":18},{"$f":"IF(AU16=\"\",\"\",AU16)","v":12},{"$f":"IF(AZ16=\"\",\"\",AZ16)","v":9},{"$f":"IF(BE16=\"\",\"\",BE16)","v":7},{"$f":"IF(BJ16=\"\",\"\",BJ16)","v":""},null,{"$f":"AD16+AI16+AN16+AS16+AX16+BC16+BH16","v":130},{"$f":"IF($F16>=5,IF(AB16=\"\",\"\",AB16),\"\")","v":0},{"$f":"IF($F16>=5,IF(AG16=\"\",\"\",AG16),\"\")","v":0},{"$f":"IF($F16>=5,IF(AL16=\"\",\"\",AL16),\"\")","v":0},{"$f":"IF($F16>=5,IF(AQ16=\"\",\"\",AQ16),\"\")","v":13},{"$f":"IF($F16>=5,IF(AV16=\"\",\"\",AV16),\"\")","v":22},{"$f":"IF($F16>=5,IF(BA16=\"\",\"\",BA16),\"\")","v":29},{"$f":"IF($F16>=5,IF(BF16=\"\",\"\",BF16),\"\")","v":36},{"$f":"IF($F16>=5,IF(BK16=\"\",\"\",BK16),\"\")","v":0},null,null,{"$f":"IF(ISNUMBER(AA16),(VLOOKUP(AA16,$BO$6:$BP$50,2)),0)","v":0},{"$f":"IF(AA16<>\"\",5,0)","v":0},{"$f":"AB16+AC16","v":0},null,"dsq",{"$f":"IF(ISNUMBER(AF16),(VLOOKUP(AF16,$BO$6:$BP$50,2)),0)","v":0},{"$f":"IF(AF16<>\"\",5,0)","v":5},{"$f":"AG16+AH16","v":5},null,39,{"$f":"IF(ISNUMBER(AK16),(VLOOKUP(AK16,$BO$6:$BP$50,2)),0)","v":0},{"$f":"IF(AK16<>\"\",5,0)","v":5},{"$f":"AL16+AM16","v":5},null,18,{"$f":"IF(ISNUMBER(AP16),(VLOOKUP(AP16,$BO$6:$BP$50,2)),0)","v":13},{"$f":"IF(AP16<>\"\",5,0)","v":5},{"$f":"AQ16+AR16","v":18},null,12,{"$f":"IF(ISNUMBER(AU16),(VLOOKUP(AU16,$BO$6:$BP$50,2)),0)","v":22},{"$f":"IF(AU16<>\"\",5,0)","v":5},{"$f":"AV16+AW16","v":27},null,9,{"$f":"IF(ISNUMBER(AZ16),(VLOOKUP(AZ16,$BO$6:$BP$50,2)),0)","v":29},{"$f":"IF(AZ16<>\"\",5,0)","v":5},{"$f":"BA16+BB16","v":34},null,7,{"$f":"IF(ISNUMBER(BE16),(VLOOKUP(BE16,$BO$6:$BP$50,2)),0)","v":36},{"$f":"IF(BE16<>\"\",5,0)","v":5},{"$f":"BF16+BG16","v":41},null,null,{"$f":"IF(ISNUMBER(BJ16),(VLOOKUP(BJ16,$BO$6:$BP$50,2)),0)","v":0},{"$f":"IF(BJ16<>\"\",5,0)","v":0},{"$f":"BK16+BL16","v":0},null,11,24,0,0,1,0,0,0,0,0]
[{"$f":"IF(E17<E16,BO17,A16)","v":12},"Lødemel","Espen Alexander","Heming",{"$f":"IF(F17<=4,Q17,(Q17-SUM(SMALL(R17:Y17,{1;2;3;4}))))","v":126},{"$f":"(IF(AC17=5,1,0)+IF(AH17=5,1,0)+IF(AM17=5,1,0)+IF(AR17=5,1,0)+IF(AW17=5,1,0)+IF(BB17=5,1,0)+IF(BG17=5,1,0)+IF(BL17=5,1,0))","v":4},null,{"$f":"IF(AA17=\"\",\"\",AA17)","v":""},{"$f":"IF(AF17=\"\",\"\",AF17)","v":""},{"$f":"IF(AK17=\"\",\"\",AK17)","v":9},{"$f":"IF(AP17=\"\",\"\",AP17)","v":9},{"$f":"IF(AU17=\"\",\"\",AU17)","v":10},{"$f":"IF(AZ17=\"\",\"\",AZ17)","v":""},{"$f":"IF(BE17=\"\",\"\",BE17)","v":12},{"$f":"IF(BJ17=\"\",\"\",BJ17)","v":""},null,{"$f":"AD17+AI17+AN17+AS17+AX17+BC17+BH17","v":126},{"$f":"IF($F17>=5,IF(AB17=\"\",\"\",AB17),\"\")","v":""},{"$f":"IF($F17>=5,IF(AG17=\"\",\"\",AG17),\"\")","v":""},{"$f":"IF($F17>=5,IF(AL17=\"\",\"\",AL17),\"\")","v":""},{"$f":"IF($F17>=5,IF(AQ17=\"\",\"\",AQ17),\"\")","v":""},{"$f":"IF($F17>=5,IF(AV17=\"\",\"\",AV17),\"\")","v":""},{"$f":"IF($F17>=5,IF(BA17=\"\",\"\",BA17),\"\")","v":""},{"$f":"IF($F17>=5,IF(BF17=\"\",\"\",BF17),\"\")","v":""},{"$f":"IF($F17>=5,IF(BK17=\"\",\"\",BK17),\"\")","v":""},null,null,{"$f":"IF(ISNUMBER(AA17),(VLOOKUP(AA17,$BO$6:$BP$50,2)),0)","v":0},{"$f":"IF(AA17<>\"\",5,0)","v":0},{"$f":"AB17+AC17","v":0},null,null,{"$f":"IF(ISNUMBER(AF17),(VLOOKUP(AF17,$BO$6:$BP$50,2)),0)","v":0},{"$f":"IF(AF17<>\"\",5,0)","v":0},{"$f":"AG17+AH17","v":0},null,9,{"$f":"IF(ISNUMBER(AK17),(VLOOKUP(AK17,$BO$6:$BP$50,2)),0)","v":29},{"$f":"IF(AK17<>\"\",5,0)","v":5},{"$f":"AL17+AM17","v":34},null,9,{"$f":"IF(ISNUMBER(AP17),(VLOOKUP(AP17,$BO$6:$BP$50,2)),0)","v":29},{"$f":"IF(AP17<>\"\",5,0)","v":5},{"$f":"AQ17+AR17","v":34},null,10,{"$f":"IF(ISNUMBER(AU17),(VLOOKUP(AU17,$BO$6:$BP$50,2)),0)","v":26},{"$f":"IF(AU17<>\"\",5,0)","v":5},{"$f":"AV17+AW17","v":31},null,null,{"$f":"IF(ISNUMBER(AZ17),(VLOOKUP(AZ17,$BO$6:$BP$50,2)),0)","v":0},{"$f":"IF(AZ17<>\"\",5,0)","v":0},{"$f":"BA17+BB17","v":0},null,12,{"$f":"IF(ISNUMBER(BE17),(VLOOKUP(BE17,$BO$6:$BP$50,2)),0)","v":22},{"$f":"IF(BE17<>\"\",5,0)","v":5},{"$f":"BF17+BG17","v":27},null,null,{"$f":"IF(ISNUMBER(BJ17),(VLOOKUP(BJ17,$BO$6:$BP$50,2)),0)","v":0},{"$f":"IF(BJ17<>\"\",5,0)","v":0},{"$f":"BK17+BL17","v":0},null,12,22,0,0,0,0,1,0,0,0]
[{"$f":"IF(E18<E17,BO18,A17)","v":13},"Strauss","Mikkel Bro","Ready",{"$f":"IF(F18<=4,Q18,(Q18-SUM(SMALL(R18:Y18,{1;2;3;4}))))","v":125},{"$f":"(IF(AC18=5,1,0)+IF(AH18=5,1,0)+IF(AM18=5,1,0)+IF(AR18=5,1,0)+IF(AW18=5,1,0)+IF(BB18=5,1,0)+IF(BG18=5,1,0)+IF(BL18=5,1,0))","v":6},null,{"$f":"IF(AA18=\"\",\"\",AA18)","v":10},{"$f":"IF(AF18=\"\",\"\",AF18)","v":""},{"$f":"IF(AK18=\"\",\"\",AK18)","v":16},{"$f":"IF(AP18=\"\",\"\",AP18)","v":14},{"$f":"IF(AU18=\"\",\"\",AU18)","v":18},{"$f":"IF(AZ18=\"\",\"\",AZ18)","v":7},{"$f":"IF(BE18=\"\",\"\",BE18)","v":"dsq"},{"$f":"IF(BJ18=\"\",\"\",BJ18)","v":""},null,{"$f":"AD18+AI18+AN18+AS18+AX18+BC18+BH18","v":138},{"$f":"IF($F18>=5,IF(AB18=\"\",\"\",AB18),\"\")","v":26},{"$f":"IF($F18>=5,IF(AG18=\"\",\"\",AG18),\"\")","v":0},{"$f":"IF($F18>=5,IF(AL18=\"\",\"\",AL18),\"\")","v":15},{"$f":"IF($F18>=5,IF(AQ18=\"\",\"\",AQ18),\"\")","v":18},{"$f":"IF($F18>=5,IF(AV18=\"\",\"\",AV18),\"\")","v":13},{"$f":"IF($F18>=5,IF(BA18=\"\",\"\",BA18),\"\")","v":36},{"$f":"IF($F18>=5,IF(BF18=\"\",\"\",BF18),\"\")","v":0},{"$f":"IF($F18>=5,IF(BK18=\"\",\"\",BK18),\"\")","v":0},null,10,{"$f":"IF(ISNUMBER(AA18),(VLOOKUP(AA18,$BO$6:$BP$50,2)),0)","v":26},{"$f":"IF(AA18<>\"\",5,0)","v":5},{"$f":"AB18+AC18","v":31},null,null,{"$f":"IF(ISNUMBER(AF18),(VLOOKUP(AF18,$BO$6:$BP$50,2)),0)","v":0},{"$f":"IF(AF18<>\"\",5,0)","v":0},{"$f":"AG18+AH18","v":0},null,16,{"$f":"IF(ISNUMBER(AK18),(VLOOKUP(AK18,$BO$6:$BP$50,2)),0)","v":15},{"$f":"IF(AK18<>\"\",5,0)","v":5},{"$f":"AL18+AM18","v":20},null,14,{"$f":"IF(ISNUMBER(AP18),(VLOOKUP(AP18,$BO$6:$BP$50,2)),0)","v":18},{"$f":"IF(AP18<>\"\",5,0)","v":5},{"$f":"AQ18+AR18","v":23},null,18,{"$f":"IF(ISNUMBER(AU18),(VLOOKUP(AU18,$BO$6:$BP$50,2)),0)","v":13},{"$f":"IF(AU18<>\"\",5,0)","v":5},{"$f":"AV18+AW18","v":18},null,7,{"$f":"IF(ISNUMBER(AZ18),(VLOOKUP(AZ18,$BO$6:$BP$50,2)),0)","v":36},{"$f":"IF(AZ18<>\"\",5,0)","v":5},{"$f":"BA18+BB18","v":41},null,"dsq",{"$f":"IF(ISNUMBER(BE18),(VLOOKUP(BE18,$BO$6:$BP$50,2)),0)","v":0},{"$f":"IF(BE18<>\"\",5,0)","v":5},{"$f":"BF18+BG18","v":5},null,null,{"$f":"IF(ISNUMBER(BJ18),(VLOOKUP(BJ18,$BO$6:$BP$50,2)),0)","v":0},{"$f":"IF(BJ18<>\"\",5,0)","v":0},{"$f":"BK18+BL18","v":0},null,13,20,0,{"$f":"IF($F17=7,1,0)","v":0},{"$f":"IF($F17=6,1,0)","v":0},{"$f":"IF($F17=5,1,0)","v":0},{"$f":"IF($F17=4,1,0)","v":1},{"$f":"IF($F17=3,1,0)","v":0},{"$f":"IF($F17=2,1,0)","v":0},{"$f":"IF($F17=1,1,0)","v":0}]
[{"$f":"IF(E19<E18,BO20,A18)","v":15},"Oksvik","Sander August Lein","IRS",{"$f":"IF(F19<=4,Q19,(Q19-SUM(SMALL(R19:Y19,{1;2;3;4}))))","v":120},{"$f":"(IF(AC19=5,1,0)+IF(AH19=5,1,0)+IF(AM19=5,1,0)+IF(AR19=5,1,0)+IF(AW19=5,1,0)+IF(BB19=5,1,0)+IF(BG19=5,1,0)+IF(BL19=5,1,0))","v":4},null,{"$f":"IF(AA19=\"\",\"\",AA19)","v":3},{"$f":"IF(AF19=\"\",\"\",AF19)","v":"dsq"},{"$f":"IF(AK19=\"\",\"\",AK19)","v":""},{"$f":"IF(AP19=\"\",\"\",AP19)","v":""},{"$f":"IF(AU19=\"\",\"\",AU19)","v":20},{"$f":"IF(AZ19=\"\",\"\",AZ19)","v":""},{"$f":"IF(BE19=\"\",\"\",BE19)","v":9},{"$f":"IF(BJ19=\"\",\"\",BJ19)","v":""},null,{"$f":"AD19+AI19+AN19+AS19+AX19+BC19+BH19","v":120},{"$f":"IF($F19>=5,IF(AB19=\"\",\"\",AB19),\"\")","v":""},{"$f":"IF($F19>=5,IF(AG19=\"\",\"\",AG19),\"\")","v":""},{"$f":"IF($F19>=5,IF(AL19=\"\",\"\",AL19),\"\")","v":""},{"$f":"IF($F19>=5,IF(AQ19=\"\",\"\",AQ19),\"\")","v":""},{"$f":"IF($F19>=5,IF(AV19=\"\",\"\",AV19),\"\")","v":""},{"$f":"IF($F19>=5,IF(BA19=\"\",\"\",BA19),\"\")","v":""},{"$f":"IF($F19>=5,IF(BF19=\"\",\"\",BF19),\"\")","v":""},{"$f":"IF($F19>=5,IF(BK19=\"\",\"\",BK19),\"\")","v":""},null,3,{"$f":"IF(ISNUMBER(AA19),(VLOOKUP(AA19,$BO$6:$BP$50,2)),0)","v":60},{"$f":"IF(AA19<>\"\",5,0)","v":5},{"$f":"AB19+AC19","v":65},null,"dsq",{"$f":"IF(ISNUMBER(AF19),(VLOOKUP(AF19,$BO$6:$BP$50,2)),0)","v":0},{"$f":"IF(AF19<>\"\",5,0)","v":5},{"$f":"AG19+AH19","v":5},null,null,{"$f":"IF(ISNUMBER(AK19),(VLOOKUP(AK19,$BO$6:$BP$50,2)),0)","v":0},{"$f":"IF(AK19<>\"\",5,0)","v":0},{"$f":"AL19+AM19","v":0},null,null,{"$f":"IF(ISNUMBER(AP19),(VLOOKUP(AP19,$BO$6:$BP$50,2)),0)","v":0},{"$f":"IF(AP19<>\"\",5,0)","v":0},{"$f":"AQ19+AR19","v":0},null,20,{"$f":"IF(ISNUMBER(AU19),(VLOOKUP(AU19,$BO$6:$BP$50,2)),0)","v":11},{"$f":"IF(AU19<>\"\",5,0)","v":5},{"$f":"AV19+AW19","v":16},null,null,{"$f":"IF(ISNUMBER(AZ19),(VLOOKUP(AZ19,$BO$6:$BP$50,2)),0)","v":0},{"$f":"IF(AZ19<>\"\",5,0)","v":0},{"$f":"BA19+BB19","v":0},null,9,{"$f":"IF(ISNUMBER(BE19),(VLOOKUP(BE19,$BO$6:$BP$50,2)),0)","v":29},{"$f":"IF(BE19<>\"\",5,0)","v":5},{"$f":"BF19+BG19","v":34},null,null,{"$f":"IF(ISNUMBER(BJ19),(VLOOKUP(BJ19,$BO$6:$BP$50,2)),0)","v":0},{"$f":"IF(BJ19<>\"\",5,0)","v":0},{"$f":"BK19+BL19","v":0},null,14,18,0,{"$f":"IF($F18=7,1,0)","v":0},{"$f":"IF($F18=6,1,0)","v":1},{"$f":"IF($F18=5,1,0)","v":0},{"$f":"IF($F18=4,1,0)","v":0},{"$f":"IF($F18=3,1,0)","v":0},{"$f":"IF($F18=2,1,0)","v":0},{"$f":"IF($F18=1,1,0)","v":0}]
[{"$f":"IF(E20<E19,BO21,A19)","v":16},"Kihle","Jacob","Kjelsås",{"$f":"IF(F20<=4,Q20,(Q20-SUM(SMALL(R20:Y20,{1;2;3;4}))))","v":114},{"$f":"(IF(AC20=5,1,0)+IF(AH20=5,1,0)+IF(AM20=5,1,0)+IF(AR20=5,1,0)+IF(AW20=5,1,0)+IF(BB20=5,1,0)+IF(BG20=5,1,0)+IF(BL20=5,1,0))","v":6},null,{"$f":"IF(AA20=\"\",\"\",AA20)","v":""},{"$f":"IF(AF20=\"\",\"\",AF20)","v":7},{"$f":"IF(AK20=\"\",\"\",AK20)","v":18},{"$f":"IF(AP20=\"\",\"\",AP20)","v":23},{"$f":"IF(AU20=\"\",\"\",AU20)","v":38},{"$f":"IF(AZ20=\"\",\"\",AZ20)","v":22},{"$f":"IF(BE20=\"\",\"\",BE20)","v":10},{"$f":"IF(BJ20=\"\",\"\",BJ20)","v":""},null,{"$f":"AD20+AI20+AN20+AS20+AX20+BC20+BH20","v":122},{"$f":"IF($F20>=5,IF(AB20=\"\",\"\",AB20),\"\")","v":0},{"$f":"IF($F20>=5,IF(AG20=\"\",\"\",AG20),\"\")","v":36},{"$f":"IF($F20>=5,IF(AL20=\"\",\"\",AL20),\"\")","v":13},{"$f":"IF($F20>=5,IF(AQ20=\"\",\"\",AQ20),\"\")","v":8},{"$f":"IF($F20>=5,IF(AV20=\"\",\"\",AV20),\"\")","v":0},{"$f":"IF($F20>=5,IF(BA20=\"\",\"\",BA20),\"\")","v":9},{"$f":"IF($F20>=5,IF(BF20=\"\",\"\",BF20),\"\")","v":26},{"$f":"IF($F20>=5,IF(BK20=\"\",\"\",BK20),\"\")","v":0},null,null,{"$f":"IF(ISNUMBER(AA20),(VLOOKUP(AA20,$BO$6:$BP$50,2)),0)","v":0},{"$f":"IF(AA20<>\"\",5,0)","v":0},{"$f":"AB20+AC20","v":0},null,7,{"$f":"IF(ISNUMBER(AF20),(VLOOKUP(AF20,$BO$6:$BP$50,2)),0)","v":36},{"$f":"IF(AF20<>\"\",5,0)","v":5},{"$f":"AG20+AH20","v":41},null,18,{"$f":"IF(ISNUMBER(AK20),(VLOOKUP(AK20,$BO$6:$BP$50,2)),0)","v":13},{"$f":"IF(AK20<>\"\",5,0)","v":5},{"$f":"AL20+AM20","v":18},null,23,{"$f":"IF(ISNUMBER(AP20),(VLOOKUP(AP20,$BO$6:$BP$50,2)),0)","v":8},{"$f":"IF(AP20<>\"\",5,0)","v":5},{"$f":"AQ20+AR20","v":13},null,38,{"$f":"IF(ISNUMBER(AU20),(VLOOKUP(AU20,$BO$6:$BP$50,2)),0)","v":0},{"$f":"IF(AU20<>\"\",5,0)","v":5},{"$f":"AV20+AW20","v":5},null,22,{"$f":"IF(ISNUMBER(AZ20),(VLOOKUP(AZ20,$BO$6:$BP$50,2)),0)","v":9},{"$f":"IF(AZ20<>\"\",5,0)","v":5},{"$f":"BA20+BB20","v":14},null,10,{"$f":"IF(ISNUMBER(BE20),(VLOOKUP(BE20,$BO$6:$BP$50,2)),0)","v":26},{"$f":"IF(BE20<>\"\",5,0)","v":5},{"$f":"BF20+BG20","v":31},null,null,{"$f":"IF(ISNUMBER(BJ20),(VLOOKUP(BJ20,$BO$6:$BP$50,2)),0)","v":0},{"$f":"IF(BJ20<>\"\",5,0)","v":0},{"$f":"BK20+BL20","v":0},null,15,16,0,{"$f":"IF($F19=7,1,0)","v":0},{"$f":"IF($F19=6,1,0)","v":0},{"$f":"IF($F19=5,1,0)","v":0},{"$f":"IF($F19=4,1,0)","v":1},{"$f":"IF($F19=3,1,0)","v":0},{"$f":"IF($F19=2,1,0)","v":0},{"$f":"IF($F19=1,1,0)","v":0}]
[{"$f":"IF(E21<E20,BO22,A20)","v":17},"Reiersen","Fredrik Sannes","Ready",{"$f":"IF(F21<=4,Q21,(Q21-SUM(SMALL(R21:Y21,{1;2;3;4}))))","v":110},{"$f":"(IF(AC21=5,1,0)+IF(AH21=5,1,0)+IF(AM21=5,1,0)+IF(AR21=5,1,0)+IF(AW21=5,1,0)+IF(BB21=5,1,0)+IF(BG21=5,1,0)+IF(BL21=5,1,0))","v":7},null,{"$f":"IF(AA21=\"\",\"\",AA21)","v":11},{"$f":"IF(AF21=\"\",\"\",AF21)","v":14},{"$f":"IF(AK21=\"\",\"\",AK21)","v":37},{"$f":"IF(AP21=\"\",\"\",AP21)","v":20},{"$f":"IF(AU21=\"\",\"\",AU21)","v":21},{"$f":"IF(AZ21=\"\",\"\",AZ21)","v":16},{"$f":"IF(BE21=\"\",\"\",BE21)","v":14},{"$f":"IF(BJ21=\"\",\"\",BJ21)","v":""},null,{"$f":"AD21+AI21+AN21+AS21+AX21+BC21+BH21","v":131},{"$f":"IF($F21>=5,IF(AB21=\"\",\"\",AB21),\"\")","v":24},{"$f":"IF($F21>=5,IF(AG21=\"\",\"\",AG21),\"\")","v":18},{"$f":"IF($F21>=5,IF(AL21=\"\",\"\",AL21),\"\")","v":0},{"$f":"IF($F21>=5,IF(AQ21=\"\",\"\",AQ21),\"\")","v":11},{"$f":"IF($F21>=5,IF(AV21=\"\",\"\",AV21),\"\")","v":10},{"$f":"IF($F21>=5,IF(BA21=\"\",\"\",BA21),\"\")","v":15},{"$f":"IF($F21>=5,IF(BF21=\"\",\"\",BF21),\"\")","v":18},{"$f":"IF($F21>=5,IF(BK21=\"\",\"\",BK21),\"\")","v":0},null,11,{"$f":"IF(ISNUMBER(AA21),(VLOOKUP(AA21,$BO$6:$BP$50,2)),0)","v":24},{"$f":"IF(AA21<>\"\",5,0)","v":5},{"$f":"AB21+AC21","v":29},null,14,{"$f":"IF(ISNUMBER(AF21),(VLOOKUP(AF21,$BO$6:$BP$50,2)),0)","v":18},{"$f":"IF(AF21<>\"\",5,0)","v":5},{"$f":"AG21+AH21","v":23},null,37,{"$f":"IF(ISNUMBER(AK21),(VLOOKUP(AK21,$BO$6:$BP$50,2)),0)","v":0},{"$f":"IF(AK21<>\"\",5,0)","v":5},{"$f":"AL21+AM21","v":5},null,20,{"$f":"IF(ISNUMBER(AP21),(VLOOKUP(AP21,$BO$6:$BP$50,2)),0)","v":11},{"$f":"IF(AP21<>\"\",5,0)","v":5},{"$f":"AQ21+AR21","v":16},null,21,{"$f":"IF(ISNUMBER(AU21),(VLOOKUP(AU21,$BO$6:$BP$50,2)),0)","v":10},{"$f":"IF(AU21<>\"\",5,0)","v":5},{"$f":"AV21+AW21","v":15},null,16,{"$f":"IF(ISNUMBER(AZ21),(VLOOKUP(AZ21,$BO$6:$BP$50,2)),0)","v":15},{"$f":"IF(AZ21<>\"\",5,0)","v":5},{"$f":"BA21+BB21","v":20},null,14,{"$f":"IF(ISNUMBER(BE21),(VLOOKUP(BE21,$BO$6:$BP$50,2)),0)","v":18},{"$f":"IF(BE21<>\"\",5,0)","v":5},{"$f":"BF21+BG21","v":23},null,null,{"$f":"IF(ISNUMBER(BJ21),(VLOOKUP(BJ21,$BO$6:$BP$50,2)),0)","v":0},{"$f":"IF(BJ21<>\"\",5,0)","v":0},{"$f":"BK21+BL21","v":0},null,16,15,0,{"$f":"IF($F19=7,1,0)","v":0},{"$f":"IF($F19=6,1,0)","v":0},{"$f":"IF($F19=5,1,0)","v":0},{"$f":"IF($F19=4,1,0)","v":1},{"$f":"IF($F19=3,1,0)","v":0},{"$f":"IF($F19=2,1,0)","v":0},{"$f":"IF($F19=1,1,0)","v":0}]
[{"$f":"IF(E22<E21,BO23,A21)","v":17},"Lødemel","Nikolai","Heming",{"$f":"IF(F22<=4,Q22,(Q22-SUM(SMALL(R22:Y22,{1;2;3;4}))))","v":110},{"$f":"(IF(AC22=5,1,0)+IF(AH22=5,1,0)+IF(AM22=5,1,0)+IF(AR22=5,1,0)+IF(AW22=5,1,0)+IF(BB22=5,1,0)+IF(BG22=5,1,0)+IF(BL22=5,1,0))","v":4},null,{"$f":"IF(AA22=\"\",\"\",AA22)","v":""},{"$f":"IF(AF22=\"\",\"\",AF22)","v":""},{"$f":"IF(AK22=\"\",\"\",AK22)","v":13},{"$f":"IF(AP22=\"\",\"\",AP22)","v":10},{"$f":"IF(AU22=\"\",\"\",AU22)","v":13},{"$f":"IF(AZ22=\"\",\"\",AZ22)","v":""},{"$f":"IF(BE22=\"\",\"\",BE22)","v":11},{"$f":"IF(BJ22=\"\",\"\",BJ22)","v":""},null,{"$f":"AD22+AI22+AN22+AS22+AX22+BC22+BH22","v":110},{"$f":"IF($F22>=5,IF(AB22=\"\",\"\",AB22),\"\")","v":""},{"$f":"IF($F22>=5,IF(AG22=\"\",\"\",AG22),\"\")","v":""},{"$f":"IF($F22>=5,IF(AL22=\"\",\"\",AL22),\"\")","v":""},{"$f":"IF($F22>=5,IF(AQ22=\"\",\"\",AQ22),\"\")","v":""},{"$f":"IF($F22>=5,IF(AV22=\"\",\"\",AV22),\"\")","v":""},{"$f":"IF($F22>=5,IF(BA22=\"\",\"\",BA22),\"\")","v":""},{"$f":"IF($F22>=5,IF(BF22=\"\",\"\",BF22),\"\")","v":""},{"$f":"IF($F22>=5,IF(BK22=\"\",\"\",BK22),\"\")","v":""},null,null,{"$f":"IF(ISNUMBER(AA22),(VLOOKUP(AA22,$BO$6:$BP$50,2)),0)","v":0},{"$f":"IF(AA22<>\"\",5,0)","v":0},{"$f":"AB22+AC22","v":0},null,null,{"$f":"IF(ISNUMBER(AF22),(VLOOKUP(AF22,$BO$6:$BP$50,2)),0)","v":0},{"$f":"IF(AF22<>\"\",5,0)","v":0},{"$f":"AG22+AH22","v":0},null,13,{"$f":"IF(ISNUMBER(AK22),(VLOOKUP(AK22,$BO$6:$BP$50,2)),0)","v":20},{"$f":"IF(AK22<>\"\",5,0)","v":5},{"$f":"AL22+AM22","v":25},null,10,{"$f":"IF(ISNUMBER(AP22),(VLOOKUP(AP22,$BO$6:$BP$50,2)),0)","v":26},{"$f":"IF(AP22<>\"\",5,0)","v":5},{"$f":"AQ22+AR22","v":31},null,13,{"$f":"IF(ISNUMBER(AU22),(VLOOKUP(AU22,$BO$6:$BP$50,2)),0)","v":20},{"$f":"IF(AU22<>\"\",5,0)","v":5},{"$f":"AV22+AW22","v":25},null,null,{"$f":"IF(ISNUMBER(AZ22),(VLOOKUP(AZ22,$BO$6:$BP$50,2)),0)","v":0},{"$f":"IF(AZ22<>\"\",5,0)","v":0},{"$f":"BA22+BB22","v":0},null,11,{"$f":"IF(ISNUMBER(BE22),(VLOOKUP(BE22,$BO$6:$BP$50,2)),0)","v":24},{"$f":"IF(BE22<>\"\",5,0)","v":5},{"$f":"BF22+BG22","v":29},null,null,{"$f":"IF(ISNUMBER(BJ22),(VLOOKUP(BJ22,$BO$6:$BP$50,2)),0)","v":0},{"$f":"IF(BJ22<>\"\",5,0)","v":0},{"$f":"BK22+BL22","v":0},null,17,14,0,0,1,0,0,0,0,0]
[{"$f":"IF(E23<E22,BO24,A22)","v":19},"Dannevig","Torbjørn","Ready",{"$f":"IF(F23<=4,Q23,(Q23-SUM(SMALL(R23:Y23,{1;2;3;4}))))","v":108},{"$f":"(IF(AC23=5,1,0)+IF(AH23=5,1,0)+IF(AM23=5,1,0)+IF(AR23=5,1,0)+IF(AW23=5,1,0)+IF(BB23=5,1,0)+IF(BG23=5,1,0)+IF(BL23=5,1,0))","v":5},null,{"$f":"IF(AA23=\"\",\"\",AA23)","v":9},{"$f":"IF(AF23=\"\",\"\",AF23)","v":"dsq"},{"$f":"IF(AK23=\"\",\"\",AK23)","v":""},{"$f":"IF(AP23=\"\",\"\",AP23)","v":13},{"$f":"IF(AU23=\"\",\"\",AU23)","v":""},{"$f":"IF(AZ23=\"\",\"\",AZ23)","v":13},{"$f":"IF(BE23=\"\",\"\",BE23)","v":17},{"$f":"IF(BJ23=\"\",\"\",BJ23)","v":""},null,{"$f":"AD23+AI23+AN23+AS23+AX23+BC23+BH23","v":108},{"$f":"IF($F23>=5,IF(AB23=\"\",\"\",AB23),\"\")","v":29},{"$f":"IF($F23>=5,IF(AG23=\"\",\"\",AG23),\"\")","v":0},{"$f":"IF($F23>=5,IF(AL23=\"\",\"\",AL23),\"\")","v":0},{"$f":"IF($F23>=5,IF(AQ23=\"\",\"\",AQ23),\"\")","v":20},{"$f":"IF($F23>=5,IF(AV23=\"\",\"\",AV23),\"\")","v":0},{"$f":"IF($F23>=5,IF(BA23=\"\",\"\",BA23),\"\")","v":20},{"$f":"IF($F23>=5,IF(BF23=\"\",\"\",BF23),\"\")","v":14},{"$f":"IF($F23>=5,IF(BK23=\"\",\"\",BK23),\"\")","v":0},null,9,{"$f":"IF(ISNUMBER(AA23),(VLOOKUP(AA23,$BO$6:$BP$50,2)),0)","v":29},{"$f":"IF(AA23<>\"\",5,0)","v":5},{"$f":"AB23+AC23","v":34},null,"dsq",{"$f":"IF(ISNUMBER(AF23),(VLOOKUP(AF23,$BO$6:$BP$50,2)),0)","v":0},{"$f":"IF(AF23<>\"\",5,0)","v":5},{"$f":"AG23+AH23","v":5},null,null,{"$f":"IF(ISNUMBER(AK23),(VLOOKUP(AK23,$BO$6:$BP$50,2)),0)","v":0},{"$f":"IF(AK23<>\"\",5,0)","v":0},{"$f":"AL23+AM23","v":0},null,13,{"$f":"IF(ISNUMBER(AP23),(VLOOKUP(AP23,$BO$6:$BP$50,2)),0)","v":20},{"$f":"IF(AP23<>\"\",5,0)","v":5},{"$f":"AQ23+AR23","v":25},null,null,{"$f":"IF(ISNUMBER(AU23),(VLOOKUP(AU23,$BO$6:$BP$50,2)),0)","v":0},{"$f":"IF(AU23<>\"\",5,0)","v":0},{"$f":"AV23+AW23","v":0},null,13,{"$f":"IF(ISNUMBER(AZ23),(VLOOKUP(AZ23,$BO$6:$BP$50,2)),0)","v":20},{"$f":"IF(AZ23<>\"\",5,0)","v":5},{"$f":"BA23+BB23","v":25},null,17,{"$f":"IF(ISNUMBER(BE23),(VLOOKUP(BE23,$BO$6:$BP$50,2)),0)","v":14},{"$f":"IF(BE23<>\"\",5,0)","v":5},{"$f":"BF23+BG23","v":19},null,null,{"$f":"IF(ISNUMBER(BJ23),(VLOOKUP(BJ23,$BO$6:$BP$50,2)),0)","v":0},{"$f":"IF(BJ23<>\"\",5,0)","v":0},{"$f":"BK23+BL23","v":0},null,18,13,0,1,0,0,0,0,0,0]
[{"$f":"IF(E24<E23,BO24,A23)","v":19},"Cock","William","Heming",{"$f":"IF(F24<=4,Q24,(Q24-SUM(SMALL(R24:Y24,{1;2;3;4}))))","v":107},{"$f":"(IF(AC24=5,1,0)+IF(AH24=5,1,0)+IF(AM24=5,1,0)+IF(AR24=5,1,0)+IF(AW24=5,1,0)+IF(BB24=5,1,0)+IF(BG24=5,1,0)+IF(BL24=5,1,0))","v":5},null,{"$f":"IF(AA24=\"\",\"\",AA24)","v":12},{"$f":"IF(AF24=\"\",\"\",AF24)","v":""},{"$f":"IF(AK24=\"\",\"\",AK24)","v":14},{"$f":"IF(AP24=\"\",\"\",AP24)","v":12},{"$f":"IF(AU24=\"\",\"\",AU24)","v":19},{"$f":"IF(AZ24=\"\",\"\",AZ24)","v":""},{"$f":"IF(BE24=\"\",\"\",BE24)","v":13},{"$f":"IF(BJ24=\"\",\"\",BJ24)","v":""},null,{"$f":"AD24+AI24+AN24+AS24+AX24+BC24+BH24","v":119},{"$f":"IF($F24>=5,IF(AB24=\"\",\"\",AB24),\"\")","v":22},{"$f":"IF($F24>=5,IF(AG24=\"\",\"\",AG24),\"\")","v":0},{"$f":"IF($F24>=5,IF(AL24=\"\",\"\",AL24),\"\")","v":18},{"$f":"IF($F24>=5,IF(AQ24=\"\",\"\",AQ24),\"\")","v":22},{"$f":"IF($F24>=5,IF(AV24=\"\",\"\",AV24),\"\")","v":12},{"$f":"IF($F24>=5,IF(BA24=\"\",\"\",BA24),\"\")","v":0},{"$f":"IF($F24>=5,IF(BF24=\"\",\"\",BF24),\"\")","v":20},{"$f":"IF($F24>=5,IF(BK24=\"\",\"\",BK24),\"\")","v":0},null,12,{"$f":"IF(ISNUMBER(AA24),(VLOOKUP(AA24,$BO$6:$BP$50,2)),0)","v":22},{"$f":"IF(AA24<>\"\",5,0)","v":5},{"$f":"AB24+AC24","v":27},null,null,{"$f":"IF(ISNUMBER(AF24),(VLOOKUP(AF24,$BO$6:$BP$50,2)),0)","v":0},{"$f":"IF(AF24<>\"\",5,0)","v":0},{"$f":"AG24+AH24","v":0},null,14,{"$f":"IF(ISNUMBER(AK24),(VLOOKUP(AK24,$BO$6:$BP$50,2)),0)","v":18},{"$f":"IF(AK24<>\"\",5,0)","v":5},{"$f":"AL24+AM24","v":23},null,12,{"$f":"IF(ISNUMBER(AP24),(VLOOKUP(AP24,$BO$6:$BP$50,2)),0)","v":22},{"$f":"IF(AP24<>\"\",5,0)","v":5},{"$f":"AQ24+AR24","v":27},null,19,{"$f":"IF(ISNUMBER(AU24),(VLOOKUP(AU24,$BO$6:$BP$50,2)),0)","v":12},{"$f":"IF(AU24<>\"\",5,0)","v":5},{"$f":"AV24+AW24","v":17},null,null,{"$f":"IF(ISNUMBER(AZ24),(VLOOKUP(AZ24,$BO$6:$BP$50,2)),0)","v":0},{"$f":"IF(AZ24<>\"\",5,0)","v":0},{"$f":"BA24+BB24","v":0},null,13,{"$f":"IF(ISNUMBER(BE24),(VLOOKUP(BE24,$BO$6:$BP$50,2)),0)","v":20},{"$f":"IF(BE24<>\"\",5,0)","v":5},{"$f":"BF24+BG24","v":25},null,null,{"$f":"IF(ISNUMBER(BJ24),(VLOOKUP(BJ24,$BO$6:$BP$50,2)),0)","v":0},{"$f":"IF(BJ24<>\"\",5,0)","v":0},{"$f":"BK24+BL24","v":0},null,19,12,0,0,0,0,1,0,0,0]
[{"$f":"IF(E25<E24,BO26,A24)","v":21},"Rygh","Ole Marius","Ready",{"$f":"IF(F25<=4,Q25,(Q25-SUM(SMALL(R25:Y25,{1;2;3;4}))))","v":100},{"$f":"(IF(AC25=5,1,0)+IF(AH25=5,1,0)+IF(AM25=5,1,0)+IF(AR25=5,1,0)+IF(AW25=5,1,0)+IF(BB25=5,1,0)+IF(BG25=5,1,0)+IF(BL25=5,1,0))","v":4},null,{"$f":"IF(AA25=\"\",\"\",AA25)","v":8},{"$f":"IF(AF25=\"\",\"\",AF25)","v":""},{"$f":"IF(AK25=\"\",\"\",AK25)","v":""},{"$f":"IF(AP25=\"\",\"\",AP25)","v":""},{"$f":"IF(AU25=\"\",\"\",AU25)","v":11},{"$f":"IF(AZ25=\"\",\"\",AZ25)","v":11},{"$f":"IF(BE25=\"\",\"\",BE25)","v":"dsq"},{"$f":"IF(BJ25=\"\",\"\",BJ25)","v":""},null,{"$f":"AD25+AI25+AN25+AS25+AX25+BC25+BH25","v":100},{"$f":"IF($F25>=5,IF(AB25=\"\",\"\",AB25),\"\")","v":""},{"$f":"IF($F25>=5,IF(AG25=\"\",\"\",AG25),\"\")","v":""},{"$f":"IF($F25>=5,IF(AL25=\"\",\"\",AL25),\"\")","v":""},{"$f":"IF($F25>=5,IF(AQ25=\"\",\"\",AQ25),\"\")","v":""},{"$f":"IF($F25>=5,IF(AV25=\"\",\"\",AV25),\"\")","v":""},{"$f":"IF($F25>=5,IF(BA25=\"\",\"\",BA25),\"\")","v":""},{"$f":"IF($F25>=5,IF(BF25=\"\",\"\",BF25),\"\")","v":""},{"$f":"IF($F25>=5,IF(BK25=\"\",\"\",BK25),\"\")","v":""},null,8,{"$f":"IF(ISNUMBER(AA25),(VLOOKUP(AA25,$BO$6:$BP$50,2)),0)","v":32},{"$f":"IF(AA25<>\"\",5,0)","v":5},{"$f":"AB25+AC25","v":37},null,null,{"$f":"IF(ISNUMBER(AF25),(VLOOKUP(AF25,$BO$6:$BP$50,2)),0)","v":0},{"$f":"IF(AF25<>\"\",5,0)","v":0},{"$f":"AG25+AH25","v":0},null,null,{"$f":"IF(ISNUMBER(AK25),(VLOOKUP(AK25,$BO$6:$BP$50,2)),0)","v":0},{"$f":"IF(AK25<>\"\",5,0)","v":0},{"$f":"AL25+AM25","v":0},null,null,{"$f":"IF(ISNUMBER(AP25),(VLOOKUP(AP25,$BO$6:$BP$50,2)),0)","v":0},{"$f":"IF(AP25<>\"\",5,0)","v":0},{"$f":"AQ25+AR25","v":0},null,11,{"$f":"IF(ISNUMBER(AU25),(VLOOKUP(AU25,$BO$6:$BP$50,2)),0)","v":24},{"$f":"IF(AU25<>\"\",5,0)","v":5},{"$f":"AV25+AW25","v":29},null,11,{"$f":"IF(ISNUMBER(AZ25),(VLOOKUP(AZ25,$BO$6:$BP$50,2)),0)","v":24},{"$f":"IF(AZ25<>\"\",5,0)","v":5},{"$f":"BA25+BB25","v":29},null,"dsq",{"$f":"IF(ISNUMBER(BE25),(VLOOKUP(BE25,$BO$6:$BP$50,2)),0)","v":0},{"$f":"IF(BE25<>\"\",5,0)","v":5},{"$f":"BF25+BG25","v":5},null,null,{"$f":"IF(ISNUMBER(BJ25),(VLOOKUP(BJ25,$BO$6:$BP$50,2)),0)","v":0},{"$f":"IF(BJ25<>\"\",5,0)","v":0},{"$f":"BK25+BL25","v":0},null,20,11,0,0,0,1,0,0,0,0]
[{"$f":"IF(E26<E25,BO26,A25)","v":21},"Graff-Sponheim","Felix Leonard","Heming",{"$f":"IF(F26<=4,Q26,(Q26-SUM(SMALL(R26:Y26,{1;2;3;4}))))","v":99},{"$f":"(IF(AC26=5,1,0)+IF(AH26=5,1,0)+IF(AM26=5,1,0)+IF(AR26=5,1,0)+IF(AW26=5,1,0)+IF(BB26=5,1,0)+IF(BG26=5,1,0)+IF(BL26=5,1,0))","v":5},null,{"$f":"IF(AA26=\"\",\"\",AA26)","v":7},{"$f":"IF(AF26=\"\",\"\",AF26)","v":""},{"$f":"IF(AK26=\"\",\"\",AK26)","v":17},{"$f":"IF(AP26=\"\",\"\",AP26)","v":28},{"$f":"IF(AU26=\"\",\"\",AU26)","v":15},{"$f":"IF(AZ26=\"\",\"\",AZ26)","v":""},{"$f":"IF(BE26=\"\",\"\",BE26)","v":23},{"$f":"IF(BJ26=\"\",\"\",BJ26)","v":""},null,{"$f":"AD26+AI26+AN26+AS26+AX26+BC26+BH26","v":102},{"$f":"IF($F26>=5,IF(AB26=\"\",\"\",AB26),\"\")","v":36},{"$f":"IF($F26>=5,IF(AG26=\"\",\"\",AG26),\"\")","v":0},{"$f":"IF($F26>=5,IF(AL26=\"\",\"\",AL26),\"\")","v":14},{"$f":"IF($F26>=5,IF(AQ26=\"\",\"\",AQ26),\"\")","v":3},{"$f":"IF($F26>=5,IF(AV26=\"\",\"\",AV26),\"\")","v":16},{"$f":"IF($F26>=5,IF(BA26=\"\",\"\",BA26),\"\")","v":0},{"$f":"IF($F26>=5,IF(BF26=\"\",\"\",BF26),\"\")","v":8},{"$f":"IF($F26>=5,IF(BK26=\"\",\"\",BK26),\"\")","v":0},null,7,{"$f":"IF(ISNUMBER(AA26),(VLOOKUP(AA26,$BO$6:$BP$50,2)),0)","v":36},{"$f":"IF(AA26<>\"\",5,0)","v":5},{"$f":"AB26+AC26","v":41},null,null,{"$f":"IF(ISNUMBER(AF26),(VLOOKUP(AF26,$BO$6:$BP$50,2)),0)","v":0},{"$f":"IF(AF26<>\"\",5,0)","v":0},{"$f":"AG26+AH26","v":0},null,17,{"$f":"IF(ISNUMBER(AK26),(VLOOKUP(AK26,$BO$6:$BP$50,2)),0)","v":14},{"$f":"IF(AK26<>\"\",5,0)","v":5},{"$f":"AL26+AM26","v":19},null,28,{"$f":"IF(ISNUMBER(AP26),(VLOOKUP(AP26,$BO$6:$BP$50,2)),0)","v":3},{"$f":"IF(AP26<>\"\",5,0)","v":5},{"$f":"AQ26+AR26","v":8},null,15,{"$f":"IF(ISNUMBER(AU26),(VLOOKUP(AU26,$BO$6:$BP$50,2)),0)","v":16},{"$f":"IF(AU26<>\"\",5,0)","v":5},{"$f":"AV26+AW26","v":21},null,null,{"$f":"IF(ISNUMBER(AZ26),(VLOOKUP(AZ26,$BO$6:$BP$50,2)),0)","v":0},{"$f":"IF(AZ26<>\"\",5,0)","v":0},{"$f":"BA26+BB26","v":0},null,23,{"$f":"IF(ISNUMBER(BE26),(VLOOKUP(BE26,$BO$6:$BP$50,2)),0)","v":8},{"$f":"IF(BE26<>\"\",5,0)","v":5},{"$f":"BF26+BG26","v":13},null,null,{"$f":"IF(ISNUMBER(BJ26),(VLOOKUP(BJ26,$BO$6:$BP$50,2)),0)","v":0},{"$f":"IF(BJ26<>\"\",5,0)","v":0},{"$f":"BK26+BL26","v":0},null,21,10,0,0,0,1,0,0,0,0]
[{"$f":"IF(E27<E26,BO28,A26)","v":23},"Svensen","Felix Granum","Ljan",{"$f":"IF(F27<=4,Q27,(Q27-SUM(SMALL(R27:Y27,{1;2;3;4}))))","v":87},{"$f":"(IF(AC27=5,1,0)+IF(AH27=5,1,0)+IF(AM27=5,1,0)+IF(AR27=5,1,0)+IF(AW27=5,1,0)+IF(BB27=5,1,0)+IF(BG27=5,1,0)+IF(BL27=5,1,0))","v":7},null,{"$f":"IF(AA27=\"\",\"\",AA27)","v":"dsq"},{"$f":"IF(AF27=\"\",\"\",AF27)","v":13},{"$f":"IF(AK27=\"\",\"\",AK27)","v":23},{"$f":"IF(AP27=\"\",\"\",AP27)","v":17},{"$f":"IF(AU27=\"\",\"\",AU27)","v":27},{"$f":"IF(AZ27=\"\",\"\",AZ27)","v":21},{"$f":"IF(BE27=\"\",\"\",BE27)","v":"dsq"},{"$f":"IF(BJ27=\"\",\"\",BJ27)","v":""},null,{"$f":"AD27+AI27+AN27+AS27+AX27+BC27+BH27","v":91},{"$f":"IF($F27>=5,IF(AB27=\"\",\"\",AB27),\"\")","v":0},{"$f":"IF($F27>=5,IF(AG27=\"\",\"\",AG27),\"\")","v":20},{"$f":"IF($F27>=5,IF(AL27=\"\",\"\",AL27),\"\")","v":8},{"$f":"IF($F27>=5,IF(AQ27=\"\",\"\",AQ27),\"\")","v":14},{"$f":"IF($F27>=5,IF(AV27=\"\",\"\",AV27),\"\")","v":4},{"$f":"IF($F27>=5,IF(BA27=\"\",\"\",BA27),\"\")","v":10},{"$f":"IF($F27>=5,IF(BF27=\"\",\"\",BF27),\"\")","v":0},{"$f":"IF($F27>=5,IF(BK27=\"\",\"\",BK27),\"\")","v":0},null,"dsq",{"$f":"IF(ISNUMBER(AA27),(VLOOKUP(AA27,$BO$6:$BP$50,2)),0)","v":0},{"$f":"IF(AA27<>\"\",5,0)","v":5},{"$f":"AB27+AC27","v":5},null,13,{"$f":"IF(ISNUMBER(AF27),(VLOOKUP(AF27,$BO$6:$BP$50,2)),0)","v":20},{"$f":"IF(AF27<>\"\",5,0)","v":5},{"$f":"AG27+AH27","v":25},null,23,{"$f":"IF(ISNUMBER(AK27),(VLOOKUP(AK27,$BO$6:$BP$50,2)),0)","v":8},{"$f":"IF(AK27<>\"\",5,0)","v":5},{"$f":"AL27+AM27","v":13},null,17,{"$f":"IF(ISNUMBER(AP27),(VLOOKUP(AP27,$BO$6:$BP$50,2)),0)","v":14},{"$f":"IF(AP27<>\"\",5,0)","v":5},{"$f":"AQ27+AR27","v":19},null,27,{"$f":"IF(ISNUMBER(AU27),(VLOOKUP(AU27,$BO$6:$BP$50,2)),0)","v":4},{"$f":"IF(AU27<>\"\",5,0)","v":5},{"$f":"AV27+AW27","v":9},null,21,{"$f":"IF(ISNUMBER(AZ27),(VLOOKUP(AZ27,$BO$6:$BP$50,2)),0)","v":10},{"$f":"IF(AZ27<>\"\",5,0)","v":5},{"$f":"BA27+BB27","v":15},null,"dsq",{"$f":"IF(ISNUMBER(BE27),(VLOOKUP(BE27,$BO$6:$BP$50,2)),0)","v":0},{"$f":"IF(BE27<>\"\",5,0)","v":5},{"$f":"BF27+BG27","v":5},null,null,{"$f":"IF(ISNUMBER(BJ27),(VLOOKUP(BJ27,$BO$6:$BP$50,2)),0)","v":0},{"$f":"IF(BJ27<>\"\",5,0)","v":0},{"$f":"BK27+BL27","v":0},null,22,9,0,0,0,0,1,0,0,0]
[{"$f":"IF(E28<E27,BO29,A27)","v":24},"Lacoste","Felix Trudeng","Ready",{"$f":"IF(F28<=4,Q28,(Q28-SUM(SMALL(R28:Y28,{1;2;3;4}))))","v":78},{"$f":"(IF(AC28=5,1,0)+IF(AH28=5,1,0)+IF(AM28=5,1,0)+IF(AR28=5,1,0)+IF(AW28=5,1,0)+IF(BB28=5,1,0)+IF(BG28=5,1,0)+IF(BL28=5,1,0))","v":7},null,{"$f":"IF(AA28=\"\",\"\",AA28)","v":17},{"$f":"IF(AF28=\"\",\"\",AF28)","v":"dsq"},{"$f":"IF(AK28=\"\",\"\",AK28)","v":26},{"$f":"IF(AP28=\"\",\"\",AP28)","v":19},{"$f":"IF(AU28=\"\",\"\",AU28)","v":26},{"$f":"IF(AZ28=\"\",\"\",AZ28)","v":19},{"$f":"IF(BE28=\"\",\"\",BE28)","v":"dsq"},{"$f":"IF(BJ28=\"\",\"\",BJ28)","v":""},null,{"$f":"AD28+AI28+AN28+AS28+AX28+BC28+BH28","v":83},{"$f":"IF($F28>=5,IF(AB28=\"\",\"\",AB28),\"\")","v":14},{"$f":"IF($F28>=5,IF(AG28=\"\",\"\",AG28),\"\")","v":0},{"$f":"IF($F28>=5,IF(AL28=\"\",\"\",AL28),\"\")","v":5},{"$f":"IF($F28>=5,IF(AQ28=\"\",\"\",AQ28),\"\")","v":12},{"$f":"IF($F28>=5,IF(AV28=\"\",\"\",AV28),\"\")","v":5},{"$f":"IF($F28>=5,IF(BA28=\"\",\"\",BA28),\"\")","v":12},{"$f":"IF($F28>=5,IF(BF28=\"\",\"\",BF28),\"\")","v":0},{"$f":"IF($F28>=5,IF(BK28=\"\",\"\",BK28),\"\")","v":0},null,17,{"$f":"IF(ISNUMBER(AA28),(VLOOKUP(AA28,$BO$6:$BP$50,2)),0)","v":14},{"$f":"IF(AA28<>\"\",5,0)","v":5},{"$f":"AB28+AC28","v":19},null,"dsq",{"$f":"IF(ISNUMBER(AF28),(VLOOKUP(AF28,$BO$6:$BP$50,2)),0)","v":0},{"$f":"IF(AF28<>\"\",5,0)","v":5},{"$f":"AG28+AH28","v":5},null,26,{"$f":"IF(ISNUMBER(AK28),(VLOOKUP(AK28,$BO$6:$BP$50,2)),0)","v":5},{"$f":"IF(AK28<>\"\",5,0)","v":5},{"$f":"AL28+AM28","v":10},null,19,{"$f":"IF(ISNUMBER(AP28),(VLOOKUP(AP28,$BO$6:$BP$50,2)),0)","v":12},{"$f":"IF(AP28<>\"\",5,0)","v":5},{"$f":"AQ28+AR28","v":17},null,26,{"$f":"IF(ISNUMBER(AU28),(VLOOKUP(AU28,$BO$6:$BP$50,2)),0)","v":5},{"$f":"IF(AU28<>\"\",5,0)","v":5},{"$f":"AV28+AW28","v":10},null,19,{"$f":"IF(ISNUMBER(AZ28),(VLOOKUP(AZ28,$BO$6:$BP$50,2)),0)","v":12},{"$f":"IF(AZ28<>\"\",5,0)","v":5},{"$f":"BA28+BB28","v":17},null,"dsq",{"$f":"IF(ISNUMBER(BE28),(VLOOKUP(BE28,$BO$6:$BP$50,2)),0)","v":0},{"$f":"IF(BE28<>\"\",5,0)","v":5},{"$f":"BF28+BG28","v":5},null,null,{"$f":"IF(ISNUMBER(BJ28),(VLOOKUP(BJ28,$BO$6:$BP$50,2)),0)","v":0},{"$f":"IF(BJ28<>\"\",5,0)","v":0},{"$f":"BK28+BL28","v":0},null,23,8,0,{"$f":"IF($F23=7,1,0)","v":0},{"$f":"IF($F23=6,1,0)","v":0},{"$f":"IF($F23=5,1,0)","v":1},{"$f":"IF($F23=4,1,0)","v":0},{"$f":"IF($F23=3,1,0)","v":0},{"$f":"IF($F23=2,1,0)","v":0},{"$f":"IF($F23=1,1,0)","v":0}]
[{"$f":"IF(E29<E28,BO30,A28)","v":25},"Arnesen","Lukas","Heming",{"$f":"IF(F29<=4,Q29,(Q29-SUM(SMALL(R29:Y29,{1;2;3;4}))))","v":76},{"$f":"(IF(AC29=5,1,0)+IF(AH29=5,1,0)+IF(AM29=5,1,0)+IF(AR29=5,1,0)+IF(AW29=5,1,0)+IF(BB29=5,1,0)+IF(BG29=5,1,0)+IF(BL29=5,1,0))","v":5},null,{"$f":"IF(AA29=\"\",\"\",AA29)","v":""},{"$f":"IF(AF29=\"\",\"\",AF29)","v":12},{"$f":"IF(AK29=\"\",\"\",AK29)","v":33},{"$f":"IF(AP29=\"\",\"\",AP29)","v":16},{"$f":"IF(AU29=\"\",\"\",AU29)","v":"dsq"},{"$f":"IF(AZ29=\"\",\"\",AZ29)","v":17},{"$f":"IF(BE29=\"\",\"\",BE29)","v":""},{"$f":"IF(BJ29=\"\",\"\",BJ29)","v":""},null,{"$f":"AD29+AI29+AN29+AS29+AX29+BC29+BH29","v":76},{"$f":"IF($F29>=5,IF(AB29=\"\",\"\",AB29),\"\")","v":0},{"$f":"IF($F29>=5,IF(AG29=\"\",\"\",AG29),\"\")","v":22},{"$f":"IF($F29>=5,IF(AL29=\"\",\"\",AL29),\"\")","v":0},{"$f":"IF($F29>=5,IF(AQ29=\"\",\"\",AQ29),\"\")","v":15},{"$f":"IF($F29>=5,IF(AV29=\"\",\"\",AV29),\"\")","v":0},{"$f":"IF($F29>=5,IF(BA29=\"\",\"\",BA29),\"\")","v":14},{"$f":"IF($F29>=5,IF(BF29=\"\",\"\",BF29),\"\")","v":0},{"$f":"IF($F29>=5,IF(BK29=\"\",\"\",BK29),\"\")","v":0},null,null,{"$f":"IF(ISNUMBER(AA29),(VLOOKUP(AA29,$BO$6:$BP$50,2)),0)","v":0},{"$f":"IF(AA29<>\"\",5,0)","v":0},{"$f":"AB29+AC29","v":0},null,12,{"$f":"IF(ISNUMBER(AF29),(VLOOKUP(AF29,$BO$6:$BP$50,2)),0)","v":22},{"$f":"IF(AF29<>\"\",5,0)","v":5},{"$f":"AG29+AH29","v":27},null,33,{"$f":"IF(ISNUMBER(AK29),(VLOOKUP(AK29,$BO$6:$BP$50,2)),0)","v":0},{"$f":"IF(AK29<>\"\",5,0)","v":5},{"$f":"AL29+AM29","v":5},null,16,{"$f":"IF(ISNUMBER(AP29),(VLOOKUP(AP29,$BO$6:$BP$50,2)),0)","v":15},{"$f":"IF(AP29<>\"\",5,0)","v":5},{"$f":"AQ29+AR29","v":20},null,"dsq",{"$f":"IF(ISNUMBER(AU29),(VLOOKUP(AU29,$BO$6:$BP$50,2)),0)","v":0},{"$f":"IF(AU29<>\"\",5,0)","v":5},{"$f":"AV29+AW29","v":5},null,17,{"$f":"IF(ISNUMBER(AZ29),(VLOOKUP(AZ29,$BO$6:$BP$50,2)),0)","v":14},{"$f":"IF(AZ29<>\"\",5,0)","v":5},{"$f":"BA29+BB29","v":19},null,null,{"$f":"IF(ISNUMBER(BE29),(VLOOKUP(BE29,$BO$6:$BP$50,2)),0)","v":0},{"$f":"IF(BE29<>\"\",5,0)","v":0},{"$f":"BF29+BG29","v":0},null,null,{"$f":"IF(ISNUMBER(BJ29),(VLOOKUP(BJ29,$BO$6:$BP$50,2)),0)","v":0},{"$f":"IF(BJ29<>\"\",5,0)","v":0},{"$f":"BK29+BL29","v":0},null,24,7,0,{"$f":"IF($F24=7,1,0)","v":0},{"$f":"IF($F24=6,1,0)","v":0},{"$f":"IF($F24=5,1,0)","v":1},{"$f":"IF($F24=4,1,0)","v":0},{"$f":"IF($F24=3,1,0)","v":0},{"$f":"IF($F24=2,1,0)","v":0},{"$f":"IF($F24=1,1,0)","v":0}]
[{"$f":"IF(E30<E29,BO31,A29)","v":26},"Hovind","Adrian R. Nuila","Ljan",{"$f":"IF(F30<=4,Q30,(Q30-SUM(SMALL(R30:Y30,{1;2;3;4}))))","v":75},{"$f":"(IF(AC30=5,1,0)+IF(AH30=5,1,0)+IF(AM30=5,1,0)+IF(AR30=5,1,0)+IF(AW30=5,1,0)+IF(BB30=5,1,0)+IF(BG30=5,1,0)+IF(BL30=5,1,0))","v":5},null,{"$f":"IF(AA30=\"\",\"\",AA30)","v":16},{"$f":"IF(AF30=\"\",\"\",AF30)","v":11},{"$f":"IF(AK30=\"\",\"\",AK30)","v":30},{"$f":"IF(AP30=\"\",\"\",AP30)","v":""},{"$f":"IF(AU30=\"\",\"\",AU30)","v":"dsq"},{"$f":"IF(AZ30=\"\",\"\",AZ30)","v":""},{"$f":"IF(BE30=\"\",\"\",BE30)","v":21},{"$f":"IF(BJ30=\"\",\"\",BJ30)","v":""},null,{"$f":"AD30+AI30+AN30+AS30+AX30+BC30+BH30","v":75},{"$f":"IF($F30>=5,IF(AB30=\"\",\"\",AB30),\"\")","v":15},{"$f":"IF($F30>=5,IF(AG30=\"\",\"\",AG30),\"\")","v":24},{"$f":"IF($F30>=5,IF(AL30=\"\",\"\",AL30),\"\")","v":1},{"$f":"IF($F30>=5,IF(AQ30=\"\",\"\",AQ30),\"\")","v":0},{"$f":"IF($F30>=5,IF(AV30=\"\",\"\",AV30),\"\")","v":0},{"$f":"IF($F30>=5,IF(BA30=\"\",\"\",BA30),\"\")","v":0},{"$f":"IF($F30>=5,IF(BF30=\"\",\"\",BF30),\"\")","v":10},{"$f":"IF($F30>=5,IF(BK30=\"\",\"\",BK30),\"\")","v":0},null,16,{"$f":"IF(ISNUMBER(AA30),(VLOOKUP(AA30,$BO$6:$BP$50,2)),0)","v":15},{"$f":"IF(AA30<>\"\",5,0)","v":5},{"$f":"AB30+AC30","v":20},null,11,{"$f":"IF(ISNUMBER(AF30),(VLOOKUP(AF30,$BO$6:$BP$50,2)),0)","v":24},{"$f":"IF(AF30<>\"\",5,0)","v":5},{"$f":"AG30+AH30","v":29},null,30,{"$f":"IF(ISNUMBER(AK30),(VLOOKUP(AK30,$BO$6:$BP$50,2)),0)","v":1},{"$f":"IF(AK30<>\"\",5,0)","v":5},{"$f":"AL30+AM30","v":6},null,null,{"$f":"IF(ISNUMBER(AP30),(VLOOKUP(AP30,$BO$6:$BP$50,2)),0)","v":0},{"$f":"IF(AP30<>\"\",5,0)","v":0},{"$f":"AQ30+AR30","v":0},null,"dsq",{"$f":"IF(ISNUMBER(AU30),(VLOOKUP(AU30,$BO$6:$BP$50,2)),0)","v":0},{"$f":"IF(AU30<>\"\",5,0)","v":5},{"$f":"AV30+AW30","v":5},null,null,{"$f":"IF(ISNUMBER(AZ30),(VLOOKUP(AZ30,$BO$6:$BP$50,2)),0)","v":0},{"$f":"IF(AZ30<>\"\",5,0)","v":0},{"$f":"BA30+BB30","v":0},null,21,{"$f":"IF(ISNUMBER(BE30),(VLOOKUP(BE30,$BO$6:$BP$50,2)),0)","v":10},{"$f":"IF(BE30<>\"\",5,0)","v":5},{"$f":"BF30+BG30","v":15},null,null,{"$f":"IF(ISNUMBER(BJ30),(VLOOKUP(BJ30,$BO$6:$BP$50,2)),0)","v":0},{"$f":"IF(BJ30<>\"\",5,0)","v":0},{"$f":"BK30+BL30","v":0},null,25,6,0,{"$f":"IF($F25=7,1,0)","v":0},{"$f":"IF($F25=6,1,0)","v":0},{"$f":"IF($F25=5,1,0)","v":0},{"$f":"IF($F25=4,1,0)","v":1},{"$f":"IF($F25=3,1,0)","v":0},{"$f":"IF($F25=2,1,0)","v":0},{"$f":"IF($F25=1,1,0)","v":0}]
[{"$f":"IF(E31<E30,BO32,A30)","v":27},"Ekjord","Oskar Gedde-Dahl","Heming",{"$f":"IF(F31<=4,Q31,(Q31-SUM(SMALL(R31:Y31,{1;2;3;4}))))","v":71},{"$f":"(IF(AC31=5,1,0)+IF(AH31=5,1,0)+IF(AM31=5,1,0)+IF(AR31=5,1,0)+IF(AW31=5,1,0)+IF(BB31=5,1,0)+IF(BG31=5,1,0)+IF(BL31=5,1,0))","v":3},null,{"$f":"IF(AA31=\"\",\"\",AA31)","v":""},{"$f":"IF(AF31=\"\",\"\",AF31)","v":""},{"$f":"IF(AK31=\"\",\"\",AK31)","v":11},{"$f":"IF(AP31=\"\",\"\",AP31)","v":8},{"$f":"IF(AU31=\"\",\"\",AU31)","v":"dnf"},{"$f":"IF(AZ31=\"\",\"\",AZ31)","v":""},{"$f":"IF(BE31=\"\",\"\",BE31)","v":""},{"$f":"IF(BJ31=\"\",\"\",BJ31)","v":""},null,{"$f":"AD31+AI31+AN31+AS31+AX31+BC31+BH31","v":71},{"$f":"IF($F31>=5,IF(AB31=\"\",\"\",AB31),\"\")","v":""},{"$f":"IF($F31>=5,IF(AG31=\"\",\"\",AG31),\"\")","v":""},{"$f":"IF($F31>=5,IF(AL31=\"\",\"\",AL31),\"\")","v":""},{"$f":"IF($F31>=5,IF(AQ31=\"\",\"\",AQ31),\"\")","v":""},{"$f":"IF($F31>=5,IF(AV31=\"\",\"\",AV31),\"\")","v":""},{"$f":"IF($F31>=5,IF(BA31=\"\",\"\",BA31),\"\")","v":""},{"$f":"IF($F31>=5,IF(BF31=\"\",\"\",BF31),\"\")","v":""},{"$f":"IF($F31>=5,IF(BK31=\"\",\"\",BK31),\"\")","v":""},null,null,{"$f":"IF(ISNUMBER(AA31),(VLOOKUP(AA31,$BO$6:$BP$50,2)),0)","v":0},{"$f":"IF(AA31<>\"\",5,0)","v":0},{"$f":"AB31+AC31","v":0},null,null,{"$f":"IF(ISNUMBER(AF31),(VLOOKUP(AF31,$BO$6:$BP$50,2)),0)","v":0},{"$f":"IF(AF31<>\"\",5,0)","v":0},{"$f":"AG31+AH31","v":0},null,11,{"$f":"IF(ISNUMBER(AK31),(VLOOKUP(AK31,$BO$6:$BP$50,2)),0)","v":24},{"$f":"IF(AK31<>\"\",5,0)","v":5},{"$f":"AL31+AM31","v":29},null,8,{"$f":"IF(ISNUMBER(AP31),(VLOOKUP(AP31,$BO$6:$BP$50,2)),0)","v":32},{"$f":"IF(AP31<>\"\",5,0)","v":5},{"$f":"AQ31+AR31","v":37},null,"dnf",{"$f":"IF(ISNUMBER(AU31),(VLOOKUP(AU31,$BO$6:$BP$50,2)),0)","v":0},{"$f":"IF(AU31<>\"\",5,0)","v":5},{"$f":"AV31+AW31","v":5},null,null,{"$f":"IF(ISNUMBER(AZ31),(VLOOKUP(AZ31,$BO$6:$BP$50,2)),0)","v":0},{"$f":"IF(AZ31<>\"\",5,0)","v":0},{"$f":"BA31+BB31","v":0},null,null,{"$f":"IF(ISNUMBER(BE31),(VLOOKUP(BE31,$BO$6:$BP$50,2)),0)","v":0},{"$f":"IF(BE31<>\"\",5,0)","v":0},{"$f":"BF31+BG31","v":0},null,null,{"$f":"IF(ISNUMBER(BJ31),(VLOOKUP(BJ31,$BO$6:$BP$50,2)),0)","v":0},{"$f":"IF(BJ31<>\"\",5,0)","v":0},{"$f":"BK31+BL31","v":0},null,26,5,0,{"$f":"IF($F25=7,1,0)","v":0},{"$f":"IF($F25=6,1,0)","v":0},{"$f":"IF($F25=5,1,0)","v":0},{"$f":"IF($F25=4,1,0)","v":1},{"$f":"IF($F25=3,1,0)","v":0},{"$f":"IF($F25=2,1,0)","v":0},{"$f":"IF($F25=1,1,0)","v":0}]
[{"$f":"IF(E32<E31,BO33,A31)","v":27},"Larsen","Bendik Stangebye","Njård",{"$f":"IF(F32<=4,Q32,(Q32-SUM(SMALL(R32:Y32,{1;2;3;4}))))","v":71},{"$f":"(IF(AC32=5,1,0)+IF(AH32=5,1,0)+IF(AM32=5,1,0)+IF(AR32=5,1,0)+IF(AW32=5,1,0)+IF(BB32=5,1,0)+IF(BG32=5,1,0)+IF(BL32=5,1,0))","v":6},null,{"$f":"IF(AA32=\"\",\"\",AA32)","v":19},{"$f":"IF(AF32=\"\",\"\",AF32)","v":15},{"$f":"IF(AK32=\"\",\"\",AK32)","v":27},{"$f":"IF(AP32=\"\",\"\",AP32)","v":24},{"$f":"IF(AU32=\"\",\"\",AU32)","v":35},{"$f":"IF(AZ32=\"\",\"\",AZ32)","v":25},{"$f":"IF(BE32=\"\",\"\",BE32)","v":""},{"$f":"IF(BJ32=\"\",\"\",BJ32)","v":""},null,{"$f":"AD32+AI32+AN32+AS32+AX32+BC32+BH32","v":75},{"$f":"IF($F32>=5,IF(AB32=\"\",\"\",AB32),\"\")","v":12},{"$f":"IF($F32>=5,IF(AG32=\"\",\"\",AG32),\"\")","v":16},{"$f":"IF($F32>=5,IF(AL32=\"\",\"\",AL32),\"\")","v":4},{"$f":"IF($F32>=5,IF(AQ32=\"\",\"\",AQ32),\"\")","v":7},{"$f":"IF($F32>=5,IF(AV32=\"\",\"\",AV32),\"\")","v":0},{"$f":"IF($F32>=5,IF(BA32=\"\",\"\",BA32),\"\")","v":6},{"$f":"IF($F32>=5,IF(BF32=\"\",\"\",BF32),\"\")","v":0},{"$f":"IF($F32>=5,IF(BK32=\"\",\"\",BK32),\"\")","v":0},null,19,{"$f":"IF(ISNUMBER(AA32),(VLOOKUP(AA32,$BO$6:$BP$50,2)),0)","v":12},{"$f":"IF(AA32<>\"\",5,0)","v":5},{"$f":"AB32+AC32","v":17},null,15,{"$f":"IF(ISNUMBER(AF32),(VLOOKUP(AF32,$BO$6:$BP$50,2)),0)","v":16},{"$f":"IF(AF32<>\"\",5,0)","v":5},{"$f":"AG32+AH32","v":21},null,27,{"$f":"IF(ISNUMBER(AK32),(VLOOKUP(AK32,$BO$6:$BP$50,2)),0)","v":4},{"$f":"IF(AK32<>\"\",5,0)","v":5},{"$f":"AL32+AM32","v":9},null,24,{"$f":"IF(ISNUMBER(AP32),(VLOOKUP(AP32,$BO$6:$BP$50,2)),0)","v":7},{"$f":"IF(AP32<>\"\",5,0)","v":5},{"$f":"AQ32+AR32","v":12},null,35,{"$f":"IF(ISNUMBER(AU32),(VLOOKUP(AU32,$BO$6:$BP$50,2)),0)","v":0},{"$f":"IF(AU32<>\"\",5,0)","v":5},{"$f":"AV32+AW32","v":5},null,25,{"$f":"IF(ISNUMBER(AZ32),(VLOOKUP(AZ32,$BO$6:$BP$50,2)),0)","v":6},{"$f":"IF(AZ32<>\"\",5,0)","v":5},{"$f":"BA32+BB32","v":11},null,null,{"$f":"IF(ISNUMBER(BE32),(VLOOKUP(BE32,$BO$6:$BP$50,2)),0)","v":0},{"$f":"IF(BE32<>\"\",5,0)","v":0},{"$f":"BF32+BG32","v":0},null,null,{"$f":"IF(ISNUMBER(BJ32),(VLOOKUP(BJ32,$BO$6:$BP$50,2)),0)","v":0},{"$f":"IF(BJ32<>\"\",5,0)","v":0},{"$f":"BK32+BL32","v":0},null,27,4,0,{"$f":"IF($F26=7,1,0)","v":0},{"$f":"IF($F26=6,1,0)","v":0},{"$f":"IF($F26=5,1,0)","v":1},{"$f":"IF($F26=4,1,0)","v":0},{"$f":"IF($F26=3,1,0)","v":0},{"$f":"IF($F26=2,1,0)","v":0},{"$f":"IF($F26=1,1,0)","v":0}]
[{"$f":"IF(E33<E32,BO34,A32)","v":29},"Gaarder","Oskar Jølle","HSIL",{"$f":"IF(F33<=4,Q33,(Q33-SUM(SMALL(R33:Y33,{1;2;3;4}))))","v":66},{"$f":"(IF(AC33=5,1,0)+IF(AH33=5,1,0)+IF(AM33=5,1,0)+IF(AR33=5,1,0)+IF(AW33=5,1,0)+IF(BB33=5,1,0)+IF(BG33=5,1,0)+IF(BL33=5,1,0))","v":4},null,{"$f":"IF(AA33=\"\",\"\",AA33)","v":""},{"$f":"IF(AF33=\"\",\"\",AF33)","v":""},{"$f":"IF(AK33=\"\",\"\",AK33)","v":20},{"$f":"IF(AP33=\"\",\"\",AP33)","v":""},{"$f":"IF(AU33=\"\",\"\",AU33)","v":29},{"$f":"IF(AZ33=\"\",\"\",AZ33)","v":14},{"$f":"IF(BE33=\"\",\"\",BE33)","v":16},{"$f":"IF(BJ33=\"\",\"\",BJ33)","v":""},null,{"$f":"AD33+AI33+AN33+AS33+AX33+BC33+BH33","v":66},{"$f":"IF($F33>=5,IF(AB33=\"\",\"\",AB33),\"\")","v":""},{"$f":"IF($F33>=5,IF(AG33=\"\",\"\",AG33),\"\")","v":""},{"$f":"IF($F33>=5,IF(AL33=\"\",\"\",AL33),\"\")","v":""},{"$f":"IF($F33>=5,IF(AQ33=\"\",\"\",AQ33),\"\")","v":""},{"$f":"IF($F33>=5,IF(AV33=\"\",\"\",AV33),\"\")","v":""},{"$f":"IF($F33>=5,IF(BA33=\"\",\"\",BA33),\"\")","v":""},{"$f":"IF($F33>=5,IF(BF33=\"\",\"\",BF33),\"\")","v":""},{"$f":"IF($F33>=5,IF(BK33=\"\",\"\",BK33),\"\")","v":""},null,null,{"$f":"IF(ISNUMBER(AA33),(VLOOKUP(AA33,$BO$6:$BP$50,2)),0)","v":0},{"$f":"IF(AA33<>\"\",5,0)","v":0},{"$f":"AB33+AC33","v":0},null,null,{"$f":"IF(ISNUMBER(AF33),(VLOOKUP(AF33,$BO$6:$BP$50,2)),0)","v":0},{"$f":"IF(AF33<>\"\",5,0)","v":0},{"$f":"AG33+AH33","v":0},null,20,{"$f":"IF(ISNUMBER(AK33),(VLOOKUP(AK33,$BO$6:$BP$50,2)),0)","v":11},{"$f":"IF(AK33<>\"\",5,0)","v":5},{"$f":"AL33+AM33","v":16},null,null,{"$f":"IF(ISNUMBER(AP33),(VLOOKUP(AP33,$BO$6:$BP$50,2)),0)","v":0},{"$f":"IF(AP33<>\"\",5,0)","v":0},{"$f":"AQ33+AR33","v":0},null,29,{"$f":"IF(ISNUMBER(AU33),(VLOOKUP(AU33,$BO$6:$BP$50,2)),0)","v":2},{"$f":"IF(AU33<>\"\",5,0)","v":5},{"$f":"AV33+AW33","v":7},null,14,{"$f":"IF(ISNUMBER(AZ33),(VLOOKUP(AZ33,$BO$6:$BP$50,2)),0)","v":18},{"$f":"IF(AZ33<>\"\",5,0)","v":5},{"$f":"BA33+BB33","v":23},null,16,{"$f":"IF(ISNUMBER(BE33),(VLOOKUP(BE33,$BO$6:$BP$50,2)),0)","v":15},{"$f":"IF(BE33<>\"\",5,0)","v":5},{"$f":"BF33+BG33","v":20},null,null,{"$f":"IF(ISNUMBER(BJ33),(VLOOKUP(BJ33,$BO$6:$BP$50,2)),0)","v":0},{"$f":"IF(BJ33<>\"\",5,0)","v":0},{"$f":"BK33+BL33","v":0},null,28,3,0,1,0,0,0,0,0,0]
[{"$f":"IF(E34<E33,BO35,A33)","v":30},"Astad","Sjur","Kjelsås",{"$f":"IF(F34<=4,Q34,(Q34-SUM(SMALL(R34:Y34,{1;2;3;4}))))","v":62},{"$f":"(IF(AC34=5,1,0)+IF(AH34=5,1,0)+IF(AM34=5,1,0)+IF(AR34=5,1,0)+IF(AW34=5,1,0)+IF(BB34=5,1,0)+IF(BG34=5,1,0)+IF(BL34=5,1,0))","v":4},null,{"$f":"IF(AA34=\"\",\"\",AA34)","v":""},{"$f":"IF(AF34=\"\",\"\",AF34)","v":10},{"$f":"IF(AK34=\"\",\"\",AK34)","v":25},{"$f":"IF(AP34=\"\",\"\",AP34)","v":21},{"$f":"IF(AU34=\"\",\"\",AU34)","v":""},{"$f":"IF(AZ34=\"\",\"\",AZ34)","v":""},{"$f":"IF(BE34=\"\",\"\",BE34)","v":"dsq"},{"$f":"IF(BJ34=\"\",\"\",BJ34)","v":""},null,{"$f":"AD34+AI34+AN34+AS34+AX34+BC34+BH34","v":62},{"$f":"IF($F34>=5,IF(AB34=\"\",\"\",AB34),\"\")","v":""},{"$f":"IF($F34>=5,IF(AG34=\"\",\"\",AG34),\"\")","v":""},{"$f":"IF($F34>=5,IF(AL34=\"\",\"\",AL34),\"\")","v":""},{"$f":"IF($F34>=5,IF(AQ34=\"\",\"\",AQ34),\"\")","v":""},{"$f":"IF($F34>=5,IF(AV34=\"\",\"\",AV34),\"\")","v":""},{"$f":"IF($F34>=5,IF(BA34=\"\",\"\",BA34),\"\")","v":""},{"$f":"IF($F34>=5,IF(BF34=\"\",\"\",BF34),\"\")","v":""},{"$f":"IF($F34>=5,IF(BK34=\"\",\"\",BK34),\"\")","v":""},null,null,{"$f":"IF(ISNUMBER(AA34),(VLOOKUP(AA34,$BO$6:$BP$50,2)),0)","v":0},{"$f":"IF(AA34<>\"\",5,0)","v":0},{"$f":"AB34+AC34","v":0},null,10,{"$f":"IF(ISNUMBER(AF34),(VLOOKUP(AF34,$BO$6:$BP$50,2)),0)","v":26},{"$f":"IF(AF34<>\"\",5,0)","v":5},{"$f":"AG34+AH34","v":31},null,25,{"$f":"IF(ISNUMBER(AK34),(VLOOKUP(AK34,$BO$6:$BP$50,2)),0)","v":6},{"$f":"IF(AK34<>\"\",5,0)","v":5},{"$f":"AL34+AM34","v":11},null,21,{"$f":"IF(ISNUMBER(AP34),(VLOOKUP(AP34,$BO$6:$BP$50,2)),0)","v":10},{"$f":"IF(AP34<>\"\",5,0)","v":5},{"$f":"AQ34+AR34","v":15},null,null,{"$f":"IF(ISNUMBER(AU34),(VLOOKUP(AU34,$BO$6:$BP$50,2)),0)","v":0},{"$f":"IF(AU34<>\"\",5,0)","v":0},{"$f":"AV34+AW34","v":0},null,null,{"$f":"IF(ISNUMBER(AZ34),(VLOOKUP(AZ34,$BO$6:$BP$50,2)),0)","v":0},{"$f":"IF(AZ34<>\"\",5,0)","v":0},{"$f":"BA34+BB34","v":0},null,"dsq",{"$f":"IF(ISNUMBER(BE34),(VLOOKUP(BE34,$BO$6:$BP$50,2)),0)","v":0},{"$f":"IF(BE34<>\"\",5,0)","v":5},{"$f":"BF34+BG34","v":5},null,null,{"$f":"IF(ISNUMBER(BJ34),(VLOOKUP(BJ34,$BO$6:$BP$50,2)),0)","v":0},{"$f":"IF(BJ34<>\"\",5,0)","v":0},{"$f":"BK34+BL34","v":0},null,29,2,0,1,0,0,0,0,0,0]
[{"$f":"IF(E35<E34,BO36,A34)","v":31},"Skirstad","Jacob","Ready",{"$f":"IF(F35<=4,Q35,(Q35-SUM(SMALL(R35:Y35,{1;2;3;4}))))","v":59},{"$f":"(IF(AC35=5,1,0)+IF(AH35=5,1,0)+IF(AM35=5,1,0)+IF(AR35=5,1,0)+IF(AW35=5,1,0)+IF(BB35=5,1,0)+IF(BG35=5,1,0)+IF(BL35=5,1,0))","v":5},null,{"$f":"IF(AA35=\"\",\"\",AA35)","v":""},{"$f":"IF(AF35=\"\",\"\",AF35)","v":"dsq"},{"$f":"IF(AK35=\"\",\"\",AK35)","v":22},{"$f":"IF(AP35=\"\",\"\",AP35)","v":""},{"$f":"IF(AU35=\"\",\"\",AU35)","v":22},{"$f":"IF(AZ35=\"\",\"\",AZ35)","v":15},{"$f":"IF(BE35=\"\",\"\",BE35)","v":"dsq"},{"$f":"IF(BJ35=\"\",\"\",BJ35)","v":""},null,{"$f":"AD35+AI35+AN35+AS35+AX35+BC35+BH35","v":59},{"$f":"IF($F35>=5,IF(AB35=\"\",\"\",AB35),\"\")","v":0},{"$f":"IF($F35>=5,IF(AG35=\"\",\"\",AG35),\"\")","v":0},{"$f":"IF($F35>=5,IF(AL35=\"\",\"\",AL35),\"\")","v":9},{"$f":"IF($F35>=5,IF(AQ35=\"\",\"\",AQ35),\"\")","v":0},{"$f":"IF($F35>=5,IF(AV35=\"\",\"\",AV35),\"\")","v":9},{"$f":"IF($F35>=5,IF(BA35=\"\",\"\",BA35),\"\")","v":16},{"$f":"IF($F35>=5,IF(BF35=\"\",\"\",BF35),\"\")","v":0},{"$f":"IF($F35>=5,IF(BK35=\"\",\"\",BK35),\"\")","v":0},null,null,{"$f":"IF(ISNUMBER(AA35),(VLOOKUP(AA35,$BO$6:$BP$50,2)),0)","v":0},{"$f":"IF(AA35<>\"\",5,0)","v":0},{"$f":"AB35+AC35","v":0},null,"dsq",{"$f":"IF(ISNUMBER(AF35),(VLOOKUP(AF35,$BO$6:$BP$50,2)),0)","v":0},{"$f":"IF(AF35<>\"\",5,0)","v":5},{"$f":"AG35+AH35","v":5},null,22,{"$f":"IF(ISNUMBER(AK35),(VLOOKUP(AK35,$BO$6:$BP$50,2)),0)","v":9},{"$f":"IF(AK35<>\"\",5,0)","v":5},{"$f":"AL35+AM35","v":14},null,null,{"$f":"IF(ISNUMBER(AP35),(VLOOKUP(AP35,$BO$6:$BP$50,2)),0)","v":0},{"$f":"IF(AP35<>\"\",5,0)","v":0},{"$f":"AQ35+AR35","v":0},null,22,{"$f":"IF(ISNUMBER(AU35),(VLOOKUP(AU35,$BO$6:$BP$50,2)),0)","v":9},{"$f":"IF(AU35<>\"\",5,0)","v":5},{"$f":"AV35+AW35","v":14},null,15,{"$f":"IF(ISNUMBER(AZ35),(VLOOKUP(AZ35,$BO$6:$BP$50,2)),0)","v":16},{"$f":"IF(AZ35<>\"\",5,0)","v":5},{"$f":"BA35+BB35","v":21},null,"dsq",{"$f":"IF(ISNUMBER(BE35),(VLOOKUP(BE35,$BO$6:$BP$50,2)),0)","v":0},{"$f":"IF(BE35<>\"\",5,0)","v":5},{"$f":"BF35+BG35","v":5},null,null,{"$f":"IF(ISNUMBER(BJ35),(VLOOKUP(BJ35,$BO$6:$BP$50,2)),0)","v":0},{"$f":"IF(BJ35<>\"\",5,0)","v":0},{"$f":"BK35+BL35","v":0},null,30,1,0,{"$f":"IF($F26=7,1,0)","v":0},{"$f":"IF($F26=6,1,0)","v":0},{"$f":"IF($F26=5,1,0)","v":1},{"$f":"IF($F26=4,1,0)","v":0},{"$f":"IF($F26=3,1,0)","v":0},{"$f":"IF($F26=2,1,0)","v":0},{"$f":"IF($F26=1,1,0)","v":0}]
[{"$f":"IF(E36<E35,BO37,A35)","v":32},"Sandengen","Falk Willian","Njård",{"$f":"IF(F36<=4,Q36,(Q36-SUM(SMALL(R36:Y36,{1;2;3;4}))))","v":58},{"$f":"(IF(AC36=5,1,0)+IF(AH36=5,1,0)+IF(AM36=5,1,0)+IF(AR36=5,1,0)+IF(AW36=5,1,0)+IF(BB36=5,1,0)+IF(BG36=5,1,0)+IF(BL36=5,1,0))","v":6},null,{"$f":"IF(AA36=\"\",\"\",AA36)","v":22},{"$f":"IF(AF36=\"\",\"\",AF36)","v":16},{"$f":"IF(AK36=\"\",\"\",AK36)","v":31},{"$f":"IF(AP36=\"\",\"\",AP36)","v":31},{"$f":"IF(AU36=\"\",\"\",AU36)","v":""},{"$f":"IF(AZ36=\"\",\"\",AZ36)","v":"dsq"},{"$f":"IF(BE36=\"\",\"\",BE36)","v":27},{"$f":"IF(BJ36=\"\",\"\",BJ36)","v":""},null,{"$f":"AD36+AI36+AN36+AS36+AX36+BC36+BH36","v":58},{"$f":"IF($F36>=5,IF(AB36=\"\",\"\",AB36),\"\")","v":9},{"$f":"IF($F36>=5,IF(AG36=\"\",\"\",AG36),\"\")","v":15},{"$f":"IF($F36>=5,IF(AL36=\"\",\"\",AL36),\"\")","v":0},{"$f":"IF($F36>=5,IF(AQ36=\"\",\"\",AQ36),\"\")","v":0},{"$f":"IF($F36>=5,IF(AV36=\"\",\"\",AV36),\"\")","v":0},{"$f":"IF($F36>=5,IF(BA36=\"\",\"\",BA36),\"\")","v":0},{"$f":"IF($F36>=5,IF(BF36=\"\",\"\",BF36),\"\")","v":4},{"$f":"IF($F36>=5,IF(BK36=\"\",\"\",BK36),\"\")","v":0},null,22,{"$f":"IF(ISNUMBER(AA36),(VLOOKUP(AA36,$BO$6:$BP$50,2)),0)","v":9},{"$f":"IF(AA36<>\"\",5,0)","v":5},{"$f":"AB36+AC36","v":14},null,16,{"$f":"IF(ISNUMBER(AF36),(VLOOKUP(AF36,$BO$6:$BP$50,2)),0)","v":15},{"$f":"IF(AF36<>\"\",5,0)","v":5},{"$f":"AG36+AH36","v":20},null,31,{"$f":"IF(ISNUMBER(AK36),(VLOOKUP(AK36,$BO$6:$BP$50,2)),0)","v":0},{"$f":"IF(AK36<>\"\",5,0)","v":5},{"$f":"AL36+AM36","v":5},null,31,{"$f":"IF(ISNUMBER(AP36),(VLOOKUP(AP36,$BO$6:$BP$50,2)),0)","v":0},{"$f":"IF(AP36<>\"\",5,0)","v":5},{"$f":"AQ36+AR36","v":5},null,null,{"$f":"IF(ISNUMBER(AU36),(VLOOKUP(AU36,$BO$6:$BP$50,2)),0)","v":0},{"$f":"IF(AU36<>\"\",5,0)","v":0},{"$f":"AV36+AW36","v":0},null,"dsq",{"$f":"IF(ISNUMBER(AZ36),(VLOOKUP(AZ36,$BO$6:$BP$50,2)),0)","v":0},{"$f":"IF(AZ36<>\"\",5,0)","v":5},{"$f":"BA36+BB36","v":5},null,27,{"$f":"IF(ISNUMBER(BE36),(VLOOKUP(BE36,$BO$6:$BP$50,2)),0)","v":4},{"$f":"IF(BE36<>\"\",5,0)","v":5},{"$f":"BF36+BG36","v":9},null,null,{"$f":"IF(ISNUMBER(BJ36),(VLOOKUP(BJ36,$BO$6:$BP$50,2)),0)","v":0},{"$f":"IF(BJ36<>\"\",5,0)","v":0},{"$f":"BK36+BL36","v":0},null,31,0,0,1,0,0,0,0,0,0]
[{"$f":"IF(E37<E36,BO38,A36)","v":33},"Lydersen","Morten Dyrstad","Kjelsås",{"$f":"IF(F37<=4,Q37,(Q37-SUM(SMALL(R37:Y37,{1;2;3;4}))))","v":50},{"$f":"(IF(AC37=5,1,0)+IF(AH37=5,1,0)+IF(AM37=5,1,0)+IF(AR37=5,1,0)+IF(AW37=5,1,0)+IF(BB37=5,1,0)+IF(BG37=5,1,0)+IF(BL37=5,1,0))","v":3},null,{"$f":"IF(AA37=\"\",\"\",AA37)","v":""},{"$f":"IF(AF37=\"\",\"\",AF37)","v":""},{"$f":"IF(AK37=\"\",\"\",AK37)","v":""},{"$f":"IF(AP37=\"\",\"\",AP37)","v":""},{"$f":"IF(AU37=\"\",\"\",AU37)","v":25},{"$f":"IF(AZ37=\"\",\"\",AZ37)","v":18},{"$f":"IF(BE37=\"\",\"\",BE37)","v":15},{"$f":"IF(BJ37=\"\",\"\",BJ37)","v":""},null,{"$f":"AD37+AI37+AN37+AS37+AX37+BC37+BH37","v":50},{"$f":"IF($F37>=5,IF(AB37=\"\",\"\",AB37),\"\")","v":""},{"$f":"IF($F37>=5,IF(AG37=\"\",\"\",AG37),\"\")","v":""},{"$f":"IF($F37>=5,IF(AL37=\"\",\"\",AL37),\"\")","v":""},{"$f":"IF($F37>=5,IF(AQ37=\"\",\"\",AQ37),\"\")","v":""},{"$f":"IF($F37>=5,IF(AV37=\"\",\"\",AV37),\"\")","v":""},{"$f":"IF($F37>=5,IF(BA37=\"\",\"\",BA37),\"\")","v":""},{"$f":"IF($F37>=5,IF(BF37=\"\",\"\",BF37),\"\")","v":""},{"$f":"IF($F37>=5,IF(BK37=\"\",\"\",BK37),\"\")","v":""},null,null,{"$f":"IF(ISNUMBER(AA37),(VLOOKUP(AA37,$BO$6:$BP$50,2)),0)","v":0},{"$f":"IF(AA37<>\"\",5,0)","v":0},{"$f":"AB37+AC37","v":0},null,null,{"$f":"IF(ISNUMBER(AF37),(VLOOKUP(AF37,$BO$6:$BP$50,2)),0)","v":0},{"$f":"IF(AF37<>\"\",5,0)","v":0},{"$f":"AG37+AH37","v":0},null,null,{"$f":"IF(ISNUMBER(AK37),(VLOOKUP(AK37,$BO$6:$BP$50,2)),0)","v":0},{"$f":"IF(AK37<>\"\",5,0)","v":0},{"$f":"AL37+AM37","v":0},null,null,{"$f":"IF(ISNUMBER(AP37),(VLOOKUP(AP37,$BO$6:$BP$50,2)),0)","v":0},{"$f":"IF(AP37<>\"\",5,0)","v":0},{"$f":"AQ37+AR37","v":0},null,25,{"$f":"IF(ISNUMBER(AU37),(VLOOKUP(AU37,$BO$6:$BP$50,2)),0)","v":6},{"$f":"IF(AU37<>\"\",5,0)","v":5},{"$f":"AV37+AW37","v":11},null,18,{"$f":"IF(ISNUMBER(AZ37),(VLOOKUP(AZ37,$BO$6:$BP$50,2)),0)","v":13},{"$f":"IF(AZ37<>\"\",5,0)","v":5},{"$f":"BA37+BB37","v":18},null,15,{"$f":"IF(ISNUMBER(BE37),(VLOOKUP(BE37,$BO$6:$BP$50,2)),0)","v":16},{"$f":"IF(BE37<>\"\",5,0)","v":5},{"$f":"BF37+BG37","v":21},null,null,{"$f":"IF(ISNUMBER(BJ37),(VLOOKUP(BJ37,$BO$6:$BP$50,2)),0)","v":0},{"$f":"IF(BJ37<>\"\",5,0)","v":0},{"$f":"BK37+BL37","v":0},null,32,0,0,1,0,0,0,0,0,0]
[{"$f":"IF(E38<E37,BO39,A37)","v":34},"Hellerud","Lars","Ullensaker",{"$f":"IF(F38<=4,Q38,(Q38-SUM(SMALL(R38:Y38,{1;2;3;4}))))","v":49},{"$f":"(IF(AC38=5,1,0)+IF(AH38=5,1,0)+IF(AM38=5,1,0)+IF(AR38=5,1,0)+IF(AW38=5,1,0)+IF(BB38=5,1,0)+IF(BG38=5,1,0)+IF(BL38=5,1,0))","v":5},null,{"$f":"IF(AA38=\"\",\"\",AA38)","v":23},{"$f":"IF(AF38=\"\",\"\",AF38)","v":"dsq"},{"$f":"IF(AK38=\"\",\"\",AK38)","v":""},{"$f":"IF(AP38=\"\",\"\",AP38)","v":26},{"$f":"IF(AU38=\"\",\"\",AU38)","v":28},{"$f":"IF(AZ38=\"\",\"\",AZ38)","v":23},{"$f":"IF(BE38=\"\",\"\",BE38)","v":""},{"$f":"IF(BJ38=\"\",\"\",BJ38)","v":""},null,{"$f":"AD38+AI38+AN38+AS38+AX38+BC38+BH38","v":49},{"$f":"IF($F38>=5,IF(AB38=\"\",\"\",AB38),\"\")","v":8},{"$f":"IF($F38>=5,IF(AG38=\"\",\"\",AG38),\"\")","v":0},{"$f":"IF($F38>=5,IF(AL38=\"\",\"\",AL38),\"\")","v":0},{"$f":"IF($F38>=5,IF(AQ38=\"\",\"\",AQ38),\"\")","v":5},{"$f":"IF($F38>=5,IF(AV38=\"\",\"\",AV38),\"\")","v":3},{"$f":"IF($F38>=5,IF(BA38=\"\",\"\",BA38),\"\")","v":8},{"$f":"IF($F38>=5,IF(BF38=\"\",\"\",BF38),\"\")","v":0},{"$f":"IF($F38>=5,IF(BK38=\"\",\"\",BK38),\"\")","v":0},null,23,{"$f":"IF(ISNUMBER(AA38),(VLOOKUP(AA38,$BO$6:$BP$50,2)),0)","v":8},{"$f":"IF(AA38<>\"\",5,0)","v":5},{"$f":"AB38+AC38","v":13},null,"dsq",{"$f":"IF(ISNUMBER(AF38),(VLOOKUP(AF38,$BO$6:$BP$50,2)),0)","v":0},{"$f":"IF(AF38<>\"\",5,0)","v":5},{"$f":"AG38+AH38","v":5},null,null,{"$f":"IF(ISNUMBER(AK38),(VLOOKUP(AK38,$BO$6:$BP$50,2)),0)","v":0},{"$f":"IF(AK38<>\"\",5,0)","v":0},{"$f":"AL38+AM38","v":0},null,26,{"$f":"IF(ISNUMBER(AP38),(VLOOKUP(AP38,$BO$6:$BP$50,2)),0)","v":5},{"$f":"IF(AP38<>\"\",5,0)","v":5},{"$f":"AQ38+AR38","v":10},null,28,{"$f":"IF(ISNUMBER(AU38),(VLOOKUP(AU38,$BO$6:$BP$50,2)),0)","v":3},{"$f":"IF(AU38<>\"\",5,0)","v":5},{"$f":"AV38+AW38","v":8},null,23,{"$f":"IF(ISNUMBER(AZ38),(VLOOKUP(AZ38,$BO$6:$BP$50,2)),0)","v":8},{"$f":"IF(AZ38<>\"\",5,0)","v":5},{"$f":"BA38+BB38","v":13},null,null,{"$f":"IF(ISNUMBER(BE38),(VLOOKUP(BE38,$BO$6:$BP$50,2)),0)","v":0},{"$f":"IF(BE38<>\"\",5,0)","v":0},{"$f":"BF38+BG38","v":0},null,null,{"$f":"IF(ISNUMBER(BJ38),(VLOOKUP(BJ38,$BO$6:$BP$50,2)),0)","v":0},{"$f":"IF(BJ38<>\"\",5,0)","v":0},{"$f":"BK38+BL38","v":0},null,33,0,0,0,0,1,0,0,0,0]
[{"$f":"IF(E39<E38,BO40,A38)","v":35},"Trondsen","Kristian Arnstad","Heming",{"$f":"IF(F39<=4,Q39,(Q39-SUM(SMALL(R39:Y39,{1;2;3;4}))))","v":46},{"$f":"(IF(AC39=5,1,0)+IF(AH39=5,1,0)+IF(AM39=5,1,0)+IF(AR39=5,1,0)+IF(AW39=5,1,0)+IF(BB39=5,1,0)+IF(BG39=5,1,0)+IF(BL39=5,1,0))","v":2},null,{"$f":"IF(AA39=\"\",\"\",AA39)","v":""},{"$f":"IF(AF39=\"\",\"\",AF39)","v":""},{"$f":"IF(AK39=\"\",\"\",AK39)","v":21},{"$f":"IF(AP39=\"\",\"\",AP39)","v":""},{"$f":"IF(AU39=\"\",\"\",AU39)","v":""},{"$f":"IF(AZ39=\"\",\"\",AZ39)","v":10},{"$f":"IF(BE39=\"\",\"\",BE39)","v":""},{"$f":"IF(BJ39=\"\",\"\",BJ39)","v":""},null,{"$f":"AD39+AI39+AN39+AS39+AX39+BC39+BH39","v":46},{"$f":"IF($F39>=5,IF(AB39=\"\",\"\",AB39),\"\")","v":""},{"$f":"IF($F39>=5,IF(AG39=\"\",\"\",AG39),\"\")","v":""},{"$f":"IF($F39>=5,IF(AL39=\"\",\"\",AL39),\"\")","v":""},{"$f":"IF($F39>=5,IF(AQ39=\"\",\"\",AQ39),\"\")","v":""},{"$f":"IF($F39>=5,IF(AV39=\"\",\"\",AV39),\"\")","v":""},{"$f":"IF($F39>=5,IF(BA39=\"\",\"\",BA39),\"\")","v":""},{"$f":"IF($F39>=5,IF(BF39=\"\",\"\",BF39),\"\")","v":""},{"$f":"IF($F39>=5,IF(BK39=\"\",\"\",BK39),\"\")","v":""},null,null,{"$f":"IF(ISNUMBER(AA39),(VLOOKUP(AA39,$BO$6:$BP$50,2)),0)","v":0},{"$f":"IF(AA39<>\"\",5,0)","v":0},{"$f":"AB39+AC39","v":0},null,null,{"$f":"IF(ISNUMBER(AF39),(VLOOKUP(AF39,$BO$6:$BP$50,2)),0)","v":0},{"$f":"IF(AF39<>\"\",5,0)","v":0},{"$f":"AG39+AH39","v":0},null,21,{"$f":"IF(ISNUMBER(AK39),(VLOOKUP(AK39,$BO$6:$BP$50,2)),0)","v":10},{"$f":"IF(AK39<>\"\",5,0)","v":5},{"$f":"AL39+AM39","v":15},null,null,{"$f":"IF(ISNUMBER(AP39),(VLOOKUP(AP39,$BO$6:$BP$50,2)),0)","v":0},{"$f":"IF(AP39<>\"\",5,0)","v":0},{"$f":"AQ39+AR39","v":0},null,null,{"$f":"IF(ISNUMBER(AU39),(VLOOKUP(AU39,$BO$6:$BP$50,2)),0)","v":0},{"$f":"IF(AU39<>\"\",5,0)","v":0},{"$f":"AV39+AW39","v":0},null,10,{"$f":"IF(ISNUMBER(AZ39),(VLOOKUP(AZ39,$BO$6:$BP$50,2)),0)","v":26},{"$f":"IF(AZ39<>\"\",5,0)","v":5},{"$f":"BA39+BB39","v":31},null,null,{"$f":"IF(ISNUMBER(BE39),(VLOOKUP(BE39,$BO$6:$BP$50,2)),0)","v":0},{"$f":"IF(BE39<>\"\",5,0)","v":0},{"$f":"BF39+BG39","v":0},null,null,{"$f":"IF(ISNUMBER(BJ39),(VLOOKUP(BJ39,$BO$6:$BP$50,2)),0)","v":0},{"$f":"IF(BJ39<>\"\",5,0)","v":0},{"$f":"BK39+BL39","v":0},null,34,0,0,0,0,1,0,0,0,0]
[{"$f":"IF(E40<E39,BO41,A39)","v":36},"Yngland","Teo Borge","Stabæk",{"$f":"IF(F40<=4,Q40,(Q40-SUM(SMALL(R40:Y40,{1;2;3;4}))))","v":41},{"$f":"(IF(AC40=5,1,0)+IF(AH40=5,1,0)+IF(AM40=5,1,0)+IF(AR40=5,1,0)+IF(AW40=5,1,0)+IF(BB40=5,1,0)+IF(BG40=5,1,0)+IF(BL40=5,1,0))","v":1},null,{"$f":"IF(AA40=\"\",\"\",AA40)","v":""},{"$f":"IF(AF40=\"\",\"\",AF40)","v":""},{"$f":"IF(AK40=\"\",\"\",AK40)","v":""},{"$f":"IF(AP40=\"\",\"\",AP40)","v":""},{"$f":"IF(AU40=\"\",\"\",AU40)","v":7},{"$f":"IF(AZ40=\"\",\"\",AZ40)","v":""},{"$f":"IF(BE40=\"\",\"\",BE40)","v":""},{"$f":"IF(BJ40=\"\",\"\",BJ40)","v":""},null,{"$f":"AD40+AI40+AN40+AS40+AX40+BC40+BH40","v":41},{"$f":"IF($F40>=5,IF(AB40=\"\",\"\",AB40),\"\")","v":""},{"$f":"IF($F40>=5,IF(AG40=\"\",\"\",AG40),\"\")","v":""},{"$f":"IF($F40>=5,IF(AL40=\"\",\"\",AL40),\"\")","v":""},{"$f":"IF($F40>=5,IF(AQ40=\"\",\"\",AQ40),\"\")","v":""},{"$f":"IF($F40>=5,IF(AV40=\"\",\"\",AV40),\"\")","v":""},{"$f":"IF($F40>=5,IF(BA40=\"\",\"\",BA40),\"\")","v":""},{"$f":"IF($F40>=5,IF(BF40=\"\",\"\",BF40),\"\")","v":""},{"$f":"IF($F40>=5,IF(BK40=\"\",\"\",BK40),\"\")","v":""},null,null,{"$f":"IF(ISNUMBER(AA40),(VLOOKUP(AA40,$BO$6:$BP$50,2)),0)","v":0},{"$f":"IF(AA40<>\"\",5,0)","v":0},{"$f":"AB40+AC40","v":0},null,null,{"$f":"IF(ISNUMBER(AF40),(VLOOKUP(AF40,$BO$6:$BP$50,2)),0)","v":0},{"$f":"IF(AF40<>\"\",5,0)","v":0},{"$f":"AG40+AH40","v":0},null,null,{"$f":"IF(ISNUMBER(AK40),(VLOOKUP(AK40,$BO$6:$BP$50,2)),0)","v":0},{"$f":"IF(AK40<>\"\",5,0)","v":0},{"$f":"AL40+AM40","v":0},null,null,{"$f":"IF(ISNUMBER(AP40),(VLOOKUP(AP40,$BO$6:$BP$50,2)),0)","v":0},{"$f":"IF(AP40<>\"\",5,0)","v":0},{"$f":"AQ40+AR40","v":0},null,7,{"$f":"IF(ISNUMBER(AU40),(VLOOKUP(AU40,$BO$6:$BP$50,2)),0)","v":36},{"$f":"IF(AU40<>\"\",5,0)","v":5},{"$f":"AV40+AW40","v":41},null,null,{"$f":"IF(ISNUMBER(AZ40),(VLOOKUP(AZ40,$BO$6:$BP$50,2)),0)","v":0},{"$f":"IF(AZ40<>\"\",5,0)","v":0},{"$f":"BA40+BB40","v":0},null,null,{"$f":"IF(ISNUMBER(BE40),(VLOOKUP(BE40,$BO$6:$BP$50,2)),0)","v":0},{"$f":"IF(BE40<>\"\",5,0)","v":0},{"$f":"BF40+BG40","v":0},null,null,{"$f":"IF(ISNUMBER(BJ40),(VLOOKUP(BJ40,$BO$6:$BP$50,2)),0)","v":0},{"$f":"IF(BJ40<>\"\",5,0)","v":0},{"$f":"BK40+BL40","v":0},null,35,0,0,0,0,0,0,1,0,0]
[{"$f":"IF(E41<E40,BO42,A40)","v":37},"Horntvedt","Oliver Ragnar","Ljan",{"$f":"IF(F41<=4,Q41,(Q41-SUM(SMALL(R41:Y41,{1;2;3;4}))))","v":40},{"$f":"(IF(AC41=5,1,0)+IF(AH41=5,1,0)+IF(AM41=5,1,0)+IF(AR41=5,1,0)+IF(AW41=5,1,0)+IF(BB41=5,1,0)+IF(BG41=5,1,0)+IF(BL41=5,1,0))","v":4},null,{"$f":"IF(AA41=\"\",\"\",AA41)","v":20},{"$f":"IF(AF41=\"\",\"\",AF41)","v":"dsq"},{"$f":"IF(AK41=\"\",\"\",AK41)","v":""},{"$f":"IF(AP41=\"\",\"\",AP41)","v":""},{"$f":"IF(AU41=\"\",\"\",AU41)","v":"dnf"},{"$f":"IF(AZ41=\"\",\"\",AZ41)","v":""},{"$f":"IF(BE41=\"\",\"\",BE41)","v":22},{"$f":"IF(BJ41=\"\",\"\",BJ41)","v":""},null,{"$f":"AD41+AI41+AN41+AS41+AX41+BC41+BH41","v":40},{"$f":"IF($F41>=5,IF(AB41=\"\",\"\",AB41),\"\")","v":""},{"$f":"IF($F41>=5,IF(AG41=\"\",\"\",AG41),\"\")","v":""},{"$f":"IF($F41>=5,IF(AL41=\"\",\"\",AL41),\"\")","v":""},{"$f":"IF($F41>=5,IF(AQ41=\"\",\"\",AQ41),\"\")","v":""},{"$f":"IF($F41>=5,IF(AV41=\"\",\"\",AV41),\"\")","v":""},{"$f":"IF($F41>=5,IF(BA41=\"\",\"\",BA41),\"\")","v":""},{"$f":"IF($F41>=5,IF(BF41=\"\",\"\",BF41),\"\")","v":""},{"$f":"IF($F41>=5,IF(BK41=\"\",\"\",BK41),\"\")","v":""},null,20,{"$f":"IF(ISNUMBER(AA41),(VLOOKUP(AA41,$BO$6:$BP$50,2)),0)","v":11},{"$f":"IF(AA41<>\"\",5,0)","v":5},{"$f":"AB41+AC41","v":16},null,"dsq",{"$f":"IF(ISNUMBER(AF41),(VLOOKUP(AF41,$BO$6:$BP$50,2)),0)","v":0},{"$f":"IF(AF41<>\"\",5,0)","v":5},{"$f":"AG41+AH41","v":5},null,null,{"$f":"IF(ISNUMBER(AK41),(VLOOKUP(AK41,$BO$6:$BP$50,2)),0)","v":0},{"$f":"IF(AK41<>\"\",5,0)","v":0},{"$f":"AL41+AM41","v":0},null,null,{"$f":"IF(ISNUMBER(AP41),(VLOOKUP(AP41,$BO$6:$BP$50,2)),0)","v":0},{"$f":"IF(AP41<>\"\",5,0)","v":0},{"$f":"AQ41+AR41","v":0},null,"dnf",{"$f":"IF(ISNUMBER(AU41),(VLOOKUP(AU41,$BO$6:$BP$50,2)),0)","v":0},{"$f":"IF(AU41<>\"\",5,0)","v":5},{"$f":"AV41+AW41","v":5},null,null,{"$f":"IF(ISNUMBER(AZ41),(VLOOKUP(AZ41,$BO$6:$BP$50,2)),0)","v":0},{"$f":"IF(AZ41<>\"\",5,0)","v":0},{"$f":"BA41+BB41","v":0},null,22,{"$f":"IF(ISNUMBER(BE41),(VLOOKUP(BE41,$BO$6:$BP$50,2)),0)","v":9},{"$f":"IF(BE41<>\"\",5,0)","v":5},{"$f":"BF41+BG41","v":14},null,null,{"$f":"IF(ISNUMBER(BJ41),(VLOOKUP(BJ41,$BO$6:$BP$50,2)),0)","v":0},{"$f":"IF(BJ41<>\"\",5,0)","v":0},{"$f":"BK41+BL41","v":0},null,36,0,0,0,1,0,0,0,0,0]
[{"$f":"IF(E42<E41,BO43,A41)","v":38},"Linna","Simon","Heming",{"$f":"IF(F42<=4,Q42,(Q42-SUM(SMALL(R42:Y42,{1;2;3;4}))))","v":38},{"$f":"(IF(AC42=5,1,0)+IF(AH42=5,1,0)+IF(AM42=5,1,0)+IF(AR42=5,1,0)+IF(AW42=5,1,0)+IF(BB42=5,1,0)+IF(BG42=5,1,0)+IF(BL42=5,1,0))","v":2},null,{"$f":"IF(AA42=\"\",\"\",AA42)","v":""},{"$f":"IF(AF42=\"\",\"\",AF42)","v":""},{"$f":"IF(AK42=\"\",\"\",AK42)","v":19},{"$f":"IF(AP42=\"\",\"\",AP42)","v":15},{"$f":"IF(AU42=\"\",\"\",AU42)","v":""},{"$f":"IF(AZ42=\"\",\"\",AZ42)","v":""},{"$f":"IF(BE42=\"\",\"\",BE42)","v":""},{"$f":"IF(BJ42=\"\",\"\",BJ42)","v":""},null,{"$f":"AD42+AI42+AN42+AS42+AX42+BC42+BH42","v":38},{"$f":"IF($F42>=5,IF(AB42=\"\",\"\",AB42),\"\")","v":""},{"$f":"IF($F42>=5,IF(AG42=\"\",\"\",AG42),\"\")","v":""},{"$f":"IF($F42>=5,IF(AL42=\"\",\"\",AL42),\"\")","v":""},{"$f":"IF($F42>=5,IF(AQ42=\"\",\"\",AQ42),\"\")","v":""},{"$f":"IF($F42>=5,IF(AV42=\"\",\"\",AV42),\"\")","v":""},{"$f":"IF($F42>=5,IF(BA42=\"\",\"\",BA42),\"\")","v":""},{"$f":"IF($F42>=5,IF(BF42=\"\",\"\",BF42),\"\")","v":""},{"$f":"IF($F42>=5,IF(BK42=\"\",\"\",BK42),\"\")","v":""},null,null,{"$f":"IF(ISNUMBER(AA42),(VLOOKUP(AA42,$BO$6:$BP$50,2)),0)","v":0},{"$f":"IF(AA42<>\"\",5,0)","v":0},{"$f":"AB42+AC42","v":0},null,null,{"$f":"IF(ISNUMBER(AF42),(VLOOKUP(AF42,$BO$6:$BP$50,2)),0)","v":0},{"$f":"IF(AF42<>\"\",5,0)","v":0},{"$f":"AG42+AH42","v":0},null,19,{"$f":"IF(ISNUMBER(AK42),(VLOOKUP(AK42,$BO$6:$BP$50,2)),0)","v":12},{"$f":"IF(AK42<>\"\",5,0)","v":5},{"$f":"AL42+AM42","v":17},null,15,{"$f":"IF(ISNUMBER(AP42),(VLOOKUP(AP42,$BO$6:$BP$50,2)),0)","v":16},{"$f":"IF(AP42<>\"\",5,0)","v":5},{"$f":"AQ42+AR42","v":21},null,null,{"$f":"IF(ISNUMBER(AU42),(VLOOKUP(AU42,$BO$6:$BP$50,2)),0)","v":0},{"$f":"IF(AU42<>\"\",5,0)","v":0},{"$f":"AV42+AW42","v":0},null,null,{"$f":"IF(ISNUMBER(AZ42),(VLOOKUP(AZ42,$BO$6:$BP$50,2)),0)","v":0},{"$f":"IF(AZ42<>\"\",5,0)","v":0},{"$f":"BA42+BB42","v":0},null,null,{"$f":"IF(ISNUMBER(BE42),(VLOOKUP(BE42,$BO$6:$BP$50,2)),0)","v":0},{"$f":"IF(BE42<>\"\",5,0)","v":0},{"$f":"BF42+BG42","v":0},null,null,{"$f":"IF(ISNUMBER(BJ42),(VLOOKUP(BJ42,$BO$6:$BP$50,2)),0)","v":0},{"$f":"IF(BJ42<>\"\",5,0)","v":0},{"$f":"BK42+BL42","v":0},null,37,0,0,0,0,0,1,0,0,0]
[{"$f":"IF(E43<E42,BO44,A42)","v":38},"Ulrichsen","Daniel Krüger","Ready",{"$f":"IF(F43<=4,Q43,(Q43-SUM(SMALL(R43:Y43,{1;2;3;4}))))","v":38},{"$f":"(IF(AC43=5,1,0)+IF(AH43=5,1,0)+IF(AM43=5,1,0)+IF(AR43=5,1,0)+IF(AW43=5,1,0)+IF(BB43=5,1,0)+IF(BG43=5,1,0)+IF(BL43=5,1,0))","v":3},null,{"$f":"IF(AA43=\"\",\"\",AA43)","v":""},{"$f":"IF(AF43=\"\",\"\",AF43)","v":""},{"$f":"IF(AK43=\"\",\"\",AK43)","v":29},{"$f":"IF(AP43=\"\",\"\",AP43)","v":22},{"$f":"IF(AU43=\"\",\"\",AU43)","v":""},{"$f":"IF(AZ43=\"\",\"\",AZ43)","v":""},{"$f":"IF(BE43=\"\",\"\",BE43)","v":19},{"$f":"IF(BJ43=\"\",\"\",BJ43)","v":""},null,{"$f":"AD43+AI43+AN43+AS43+AX43+BC43+BH43","v":38},{"$f":"IF($F43>=5,IF(AB43=\"\",\"\",AB43),\"\")","v":""},{"$f":"IF($F43>=5,IF(AG43=\"\",\"\",AG43),\"\")","v":""},{"$f":"IF($F43>=5,IF(AL43=\"\",\"\",AL43),\"\")","v":""},{"$f":"IF($F43>=5,IF(AQ43=\"\",\"\",AQ43),\"\")","v":""},{"$f":"IF($F43>=5,IF(AV43=\"\",\"\",AV43),\"\")","v":""},{"$f":"IF($F43>=5,IF(BA43=\"\",\"\",BA43),\"\")","v":""},{"$f":"IF($F43>=5,IF(BF43=\"\",\"\",BF43),\"\")","v":""},{"$f":"IF($F43>=5,IF(BK43=\"\",\"\",BK43),\"\")","v":""},null,null,{"$f":"IF(ISNUMBER(AA43),(VLOOKUP(AA43,$BO$6:$BP$50,2)),0)","v":0},{"$f":"IF(AA43<>\"\",5,0)","v":0},{"$f":"AB43+AC43","v":0},null,null,{"$f":"IF(ISNUMBER(AF43),(VLOOKUP(AF43,$BO$6:$BP$50,2)),0)","v":0},{"$f":"IF(AF43<>\"\",5,0)","v":0},{"$f":"AG43+AH43","v":0},null,29,{"$f":"IF(ISNUMBER(AK43),(VLOOKUP(AK43,$BO$6:$BP$50,2)),0)","v":2},{"$f":"IF(AK43<>\"\",5,0)","v":5},{"$f":"AL43+AM43","v":7},null,22,{"$f":"IF(ISNUMBER(AP43),(VLOOKUP(AP43,$BO$6:$BP$50,2)),0)","v":9},{"$f":"IF(AP43<>\"\",5,0)","v":5},{"$f":"AQ43+AR43","v":14},null,null,{"$f":"IF(ISNUMBER(AU43),(VLOOKUP(AU43,$BO$6:$BP$50,2)),0)","v":0},{"$f":"IF(AU43<>\"\",5,0)","v":0},{"$f":"AV43+AW43","v":0},null,null,{"$f":"IF(ISNUMBER(AZ43),(VLOOKUP(AZ43,$BO$6:$BP$50,2)),0)","v":0},{"$f":"IF(AZ43<>\"\",5,0)","v":0},{"$f":"BA43+BB43","v":0},null,19,{"$f":"IF(ISNUMBER(BE43),(VLOOKUP(BE43,$BO$6:$BP$50,2)),0)","v":12},{"$f":"IF(BE43<>\"\",5,0)","v":5},{"$f":"BF43+BG43","v":17},null,null,{"$f":"IF(ISNUMBER(BJ43),(VLOOKUP(BJ43,$BO$6:$BP$50,2)),0)","v":0},{"$f":"IF(BJ43<>\"\",5,0)","v":0},{"$f":"BK43+BL43","v":0},null,38,0,0,0,0,0,1,0,0,0]
[{"$f":"IF(E44<E43,BO45,A43)","v":40},"Dyrstad","Morten","Kjelsås",{"$f":"IF(F44<=4,Q44,(Q44-SUM(SMALL(R44:Y44,{1;2;3;4}))))","v":37},{"$f":"(IF(AC44=5,1,0)+IF(AH44=5,1,0)+IF(AM44=5,1,0)+IF(AR44=5,1,0)+IF(AW44=5,1,0)+IF(BB44=5,1,0)+IF(BG44=5,1,0)+IF(BL44=5,1,0))","v":1},null,{"$f":"IF(AA44=\"\",\"\",AA44)","v":""},{"$f":"IF(AF44=\"\",\"\",AF44)","v":8},{"$f":"IF(AK44=\"\",\"\",AK44)","v":""},{"$f":"IF(AP44=\"\",\"\",AP44)","v":""},{"$f":"IF(AU44=\"\",\"\",AU44)","v":""},{"$f":"IF(AZ44=\"\",\"\",AZ44)","v":""},{"$f":"IF(BE44=\"\",\"\",BE44)","v":""},{"$f":"IF(BJ44=\"\",\"\",BJ44)","v":""},null,{"$f":"AD44+AI44+AN44+AS44+AX44+BC44+BH44","v":37},{"$f":"IF($F44>=5,IF(AB44=\"\",\"\",AB44),\"\")","v":""},{"$f":"IF($F44>=5,IF(AG44=\"\",\"\",AG44),\"\")","v":""},{"$f":"IF($F44>=5,IF(AL44=\"\",\"\",AL44),\"\")","v":""},{"$f":"IF($F44>=5,IF(AQ44=\"\",\"\",AQ44),\"\")","v":""},{"$f":"IF($F44>=5,IF(AV44=\"\",\"\",AV44),\"\")","v":""},{"$f":"IF($F44>=5,IF(BA44=\"\",\"\",BA44),\"\")","v":""},{"$f":"IF($F44>=5,IF(BF44=\"\",\"\",BF44),\"\")","v":""},{"$f":"IF($F44>=5,IF(BK44=\"\",\"\",BK44),\"\")","v":""},null,null,{"$f":"IF(ISNUMBER(AA44),(VLOOKUP(AA44,$BO$6:$BP$50,2)),0)","v":0},{"$f":"IF(AA44<>\"\",5,0)","v":0},{"$f":"AB44+AC44","v":0},null,8,{"$f":"IF(ISNUMBER(AF44),(VLOOKUP(AF44,$BO$6:$BP$50,2)),0)","v":32},{"$f":"IF(AF44<>\"\",5,0)","v":5},{"$f":"AG44+AH44","v":37},null,null,{"$f":"IF(ISNUMBER(AK44),(VLOOKUP(AK44,$BO$6:$BP$50,2)),0)","v":0},{"$f":"IF(AK44<>\"\",5,0)","v":0},{"$f":"AL44+AM44","v":0},null,null,{"$f":"IF(ISNUMBER(AP44),(VLOOKUP(AP44,$BO$6:$BP$50,2)),0)","v":0},{"$f":"IF(AP44<>\"\",5,0)","v":0},{"$f":"AQ44+AR44","v":0},null,null,{"$f":"IF(ISNUMBER(AU44),(VLOOKUP(AU44,$BO$6:$BP$50,2)),0)","v":0},{"$f":"IF(AU44<>\"\",5,0)","v":0},{"$f":"AV44+AW44","v":0},null,null,{"$f":"IF(ISNUMBER(AZ44),(VLOOKUP(AZ44,$BO$6:$BP$50,2)),0)","v":0},{"$f":"IF(AZ44<>\"\",5,0)","v":0},{"$f":"BA44+BB44","v":0},null,null,{"$f":"IF(ISNUMBER(BE44),(VLOOKUP(BE44,$BO$6:$BP$50,2)),0)","v":0},{"$f":"IF(BE44<>\"\",5,0)","v":0},{"$f":"BF44+BG44","v":0},null,null,{"$f":"IF(ISNUMBER(BJ44),(VLOOKUP(BJ44,$BO$6:$BP$50,2)),0)","v":0},{"$f":"IF(BJ44<>\"\",5,0)","v":0},{"$f":"BK44+BL44","v":0},null,39,0,0,0,0,1,0,0,0,0]
[{"$f":"IF(E45<E44,BO46,A44)","v":40},"Noer","Kristoffer","Rælingen",{"$f":"IF(F45<=4,Q45,(Q45-SUM(SMALL(R45:Y45,{1;2;3;4}))))","v":37},{"$f":"(IF(AC45=5,1,0)+IF(AH45=5,1,0)+IF(AM45=5,1,0)+IF(AR45=5,1,0)+IF(AW45=5,1,0)+IF(BB45=5,1,0)+IF(BG45=5,1,0)+IF(BL45=5,1,0))","v":1},null,{"$f":"IF(AA45=\"\",\"\",AA45)","v":""},{"$f":"IF(AF45=\"\",\"\",AF45)","v":""},{"$f":"IF(AK45=\"\",\"\",AK45)","v":""},{"$f":"IF(AP45=\"\",\"\",AP45)","v":""},{"$f":"IF(AU45=\"\",\"\",AU45)","v":8},{"$f":"IF(AZ45=\"\",\"\",AZ45)","v":""},{"$f":"IF(BE45=\"\",\"\",BE45)","v":""},{"$f":"IF(BJ45=\"\",\"\",BJ45)","v":""},null,{"$f":"AD45+AI45+AN45+AS45+AX45+BC45+BH45","v":37},{"$f":"IF($F45>=5,IF(AB45=\"\",\"\",AB45),\"\")","v":""},{"$f":"IF($F45>=5,IF(AG45=\"\",\"\",AG45),\"\")","v":""},{"$f":"IF($F45>=5,IF(AL45=\"\",\"\",AL45),\"\")","v":""},{"$f":"IF($F45>=5,IF(AQ45=\"\",\"\",AQ45),\"\")","v":""},{"$f":"IF($F45>=5,IF(AV45=\"\",\"\",AV45),\"\")","v":""},{"$f":"IF($F45>=5,IF(BA45=\"\",\"\",BA45),\"\")","v":""},{"$f":"IF($F45>=5,IF(BF45=\"\",\"\",BF45),\"\")","v":""},{"$f":"IF($F45>=5,IF(BK45=\"\",\"\",BK45),\"\")","v":""},null,null,{"$f":"IF(ISNUMBER(AA45),(VLOOKUP(AA45,$BO$6:$BP$50,2)),0)","v":0},{"$f":"IF(AA45<>\"\",5,0)","v":0},{"$f":"AB45+AC45","v":0},null,null,{"$f":"IF(ISNUMBER(AF45),(VLOOKUP(AF45,$BO$6:$BP$50,2)),0)","v":0},{"$f":"IF(AF45<>\"\",5,0)","v":0},{"$f":"AG45+AH45","v":0},null,null,{"$f":"IF(ISNUMBER(AK45),(VLOOKUP(AK45,$BO$6:$BP$50,2)),0)","v":0},{"$f":"IF(AK45<>\"\",5,0)","v":0},{"$f":"AL45+AM45","v":0},null,null,{"$f":"IF(ISNUMBER(AP45),(VLOOKUP(AP45,$BO$6:$BP$50,2)),0)","v":0},{"$f":"IF(AP45<>\"\",5,0)","v":0},{"$f":"AQ45+AR45","v":0},null,8,{"$f":"IF(ISNUMBER(AU45),(VLOOKUP(AU45,$BO$6:$BP$50,2)),0)","v":32},{"$f":"IF(AU45<>\"\",5,0)","v":5},{"$f":"AV45+AW45","v":37},null,null,{"$f":"IF(ISNUMBER(AZ45),(VLOOKUP(AZ45,$BO$6:$BP$50,2)),0)","v":0},{"$f":"IF(AZ45<>\"\",5,0)","v":0},{"$f":"BA45+BB45","v":0},null,null,{"$f":"IF(ISNUMBER(BE45),(VLOOKUP(BE45,$BO$6:$BP$50,2)),0)","v":0},{"$f":"IF(BE45<>\"\",5,0)","v":0},{"$f":"BF45+BG45","v":0},null,null,{"$f":"IF(ISNUMBER(BJ45),(VLOOKUP(BJ45,$BO$6:$BP$50,2)),0)","v":0},{"$f":"IF(BJ45<>\"\",5,0)","v":0},{"$f":"BK45+BL45","v":0},null,40,0,0,0,1,0,0,0,0,0]
[{"$f":"IF(E46<E45,BO47,A45)","v":40},"Enoksen","Elias","IRS",{"$f":"IF(F46<=4,Q46,(Q46-SUM(SMALL(R46:Y46,{1;2;3;4}))))","v":37},{"$f":"(IF(AC46=5,1,0)+IF(AH46=5,1,0)+IF(AM46=5,1,0)+IF(AR46=5,1,0)+IF(AW46=5,1,0)+IF(BB46=5,1,0)+IF(BG46=5,1,0)+IF(BL46=5,1,0))","v":3},null,{"$f":"IF(AA46=\"\",\"\",AA46)","v":15},{"$f":"IF(AF46=\"\",\"\",AF46)","v":""},{"$f":"IF(AK46=\"\",\"\",AK46)","v":""},{"$f":"IF(AP46=\"\",\"\",AP46)","v":25},{"$f":"IF(AU46=\"\",\"\",AU46)","v":""},{"$f":"IF(AZ46=\"\",\"\",AZ46)","v":""},{"$f":"IF(BE46=\"\",\"\",BE46)","v":"dsq"},{"$f":"IF(BJ46=\"\",\"\",BJ46)","v":""},null,{"$f":"AD46+AI46+AN46+AS46+AX46+BC46+BH46","v":37},{"$f":"IF($F46>=5,IF(AB46=\"\",\"\",AB46),\"\")","v":""},{"$f":"IF($F46>=5,IF(AG46=\"\",\"\",AG46),\"\")","v":""},{"$f":"IF($F46>=5,IF(AL46=\"\",\"\",AL46),\"\")","v":""},{"$f":"IF($F46>=5,IF(AQ46=\"\",\"\",AQ46),\"\")","v":""},{"$f":"IF($F46>=5,IF(AV46=\"\",\"\",AV46),\"\")","v":""},{"$f":"IF($F46>=5,IF(BA46=\"\",\"\",BA46),\"\")","v":""},{"$f":"IF($F46>=5,IF(BF46=\"\",\"\",BF46),\"\")","v":""},{"$f":"IF($F46>=5,IF(BK46=\"\",\"\",BK46),\"\")","v":""},null,15,{"$f":"IF(ISNUMBER(AA46),(VLOOKUP(AA46,$BO$6:$BP$50,2)),0)","v":16},{"$f":"IF(AA46<>\"\",5,0)","v":5},{"$f":"AB46+AC46","v":21},null,null,{"$f":"IF(ISNUMBER(AF46),(VLOOKUP(AF46,$BO$6:$BP$50,2)),0)","v":0},{"$f":"IF(AF46<>\"\",5,0)","v":0},{"$f":"AG46+AH46","v":0},null,null,{"$f":"IF(ISNUMBER(AK46),(VLOOKUP(AK46,$BO$6:$BP$50,2)),0)","v":0},{"$f":"IF(AK46<>\"\",5,0)","v":0},{"$f":"AL46+AM46","v":0},null,25,{"$f":"IF(ISNUMBER(AP46),(VLOOKUP(AP46,$BO$6:$BP$50,2)),0)","v":6},{"$f":"IF(AP46<>\"\",5,0)","v":5},{"$f":"AQ46+AR46","v":11},null,null,{"$f":"IF(ISNUMBER(AU46),(VLOOKUP(AU46,$BO$6:$BP$50,2)),0)","v":0},{"$f":"IF(AU46<>\"\",5,0)","v":0},{"$f":"AV46+AW46","v":0},null,null,{"$f":"IF(ISNUMBER(AZ46),(VLOOKUP(AZ46,$BO$6:$BP$50,2)),0)","v":0},{"$f":"IF(AZ46<>\"\",5,0)","v":0},{"$f":"BA46+BB46","v":0},null,"dsq",{"$f":"IF(ISNUMBER(BE46),(VLOOKUP(BE46,$BO$6:$BP$50,2)),0)","v":0},{"$f":"IF(BE46<>\"\",5,0)","v":5},{"$f":"BF46+BG46","v":5},null,null,{"$f":"IF(ISNUMBER(BJ46),(VLOOKUP(BJ46,$BO$6:$BP$50,2)),0)","v":0},{"$f":"IF(BJ46<>\"\",5,0)","v":0},{"$f":"BK46+BL46","v":0},null,41,0,0,0,0,0,0,1,0,0]
[{"$f":"IF(E47<E46,BO48,A46)","v":40},"Espe","Alexander","Heming",{"$f":"IF(F47<=4,Q47,(Q47-SUM(SMALL(R47:Y47,{1;2;3;4}))))","v":37},{"$f":"(IF(AC47=5,1,0)+IF(AH47=5,1,0)+IF(AM47=5,1,0)+IF(AR47=5,1,0)+IF(AW47=5,1,0)+IF(BB47=5,1,0)+IF(BG47=5,1,0)+IF(BL47=5,1,0))","v":2},null,{"$f":"IF(AA47=\"\",\"\",AA47)","v":""},{"$f":"IF(AF47=\"\",\"\",AF47)","v":""},{"$f":"IF(AK47=\"\",\"\",AK47)","v":""},{"$f":"IF(AP47=\"\",\"\",AP47)","v":""},{"$f":"IF(AU47=\"\",\"\",AU47)","v":17},{"$f":"IF(AZ47=\"\",\"\",AZ47)","v":""},{"$f":"IF(BE47=\"\",\"\",BE47)","v":18},{"$f":"IF(BJ47=\"\",\"\",BJ47)","v":""},null,{"$f":"AD47+AI47+AN47+AS47+AX47+BC47+BH47","v":37},{"$f":"IF($F47>=5,IF(AB47=\"\",\"\",AB47),\"\")","v":""},{"$f":"IF($F47>=5,IF(AG47=\"\",\"\",AG47),\"\")","v":""},{"$f":"IF($F47>=5,IF(AL47=\"\",\"\",AL47),\"\")","v":""},{"$f":"IF($F47>=5,IF(AQ47=\"\",\"\",AQ47),\"\")","v":""},{"$f":"IF($F47>=5,IF(AV47=\"\",\"\",AV47),\"\")","v":""},{"$f":"IF($F47>=5,IF(BA47=\"\",\"\",BA47),\"\")","v":""},{"$f":"IF($F47>=5,IF(BF47=\"\",\"\",BF47),\"\")","v":""},{"$f":"IF($F47>=5,IF(BK47=\"\",\"\",BK47),\"\")","v":""},null,null,{"$f":"IF(ISNUMBER(AA47),(VLOOKUP(AA47,$BO$6:$BP$50,2)),0)","v":0},{"$f":"IF(AA47<>\"\",5,0)","v":0},{"$f":"AB47+AC47","v":0},null,null,{"$f":"IF(ISNUMBER(AF47),(VLOOKUP(AF47,$BO$6:$BP$50,2)),0)","v":0},{"$f":"IF(AF47<>\"\",5,0)","v":0},{"$f":"AG47+AH47","v":0},null,null,{"$f":"IF(ISNUMBER(AK47),(VLOOKUP(AK47,$BO$6:$BP$50,2)),0)","v":0},{"$f":"IF(AK47<>\"\",5,0)","v":0},{"$f":"AL47+AM47","v":0},null,null,{"$f":"IF(ISNUMBER(AP47),(VLOOKUP(AP47,$BO$6:$BP$50,2)),0)","v":0},{"$f":"IF(AP47<>\"\",5,0)","v":0},{"$f":"AQ47+AR47","v":0},null,17,{"$f":"IF(ISNUMBER(AU47),(VLOOKUP(AU47,$BO$6:$BP$50,2)),0)","v":14},{"$f":"IF(AU47<>\"\",5,0)","v":5},{"$f":"AV47+AW47","v":19},null,null,{"$f":"IF(ISNUMBER(AZ47),(VLOOKUP(AZ47,$BO$6:$BP$50,2)),0)","v":0},{"$f":"IF(AZ47<>\"\",5,0)","v":0},{"$f":"BA47+BB47","v":0},null,18,{"$f":"IF(ISNUMBER(BE47),(VLOOKUP(BE47,$BO$6:$BP$50,2)),0)","v":13},{"$f":"IF(BE47<>\"\",5,0)","v":5},{"$f":"BF47+BG47","v":18},null,null,{"$f":"IF(ISNUMBER(BJ47),(VLOOKUP(BJ47,$BO$6:$BP$50,2)),0)","v":0},{"$f":"IF(BJ47<>\"\",5,0)","v":0},{"$f":"BK47+BL47","v":0},null,42,0,0,0,0,1,0,0,0,0]
[{"$f":"IF(E48<E47,BO49,A47)","v":44},"Christiansen","Arthur Åstasund","IRS",{"$f":"IF(F48<=4,Q48,(Q48-SUM(SMALL(R48:Y48,{1;2;3;4}))))","v":34},{"$f":"(IF(AC48=5,1,0)+IF(AH48=5,1,0)+IF(AM48=5,1,0)+IF(AR48=5,1,0)+IF(AW48=5,1,0)+IF(BB48=5,1,0)+IF(BG48=5,1,0)+IF(BL48=5,1,0))","v":2},null,{"$f":"IF(AA48=\"\",\"\",AA48)","v":18},{"$f":"IF(AF48=\"\",\"\",AF48)","v":""},{"$f":"IF(AK48=\"\",\"\",AK48)","v":""},{"$f":"IF(AP48=\"\",\"\",AP48)","v":""},{"$f":"IF(AU48=\"\",\"\",AU48)","v":""},{"$f":"IF(AZ48=\"\",\"\",AZ48)","v":""},{"$f":"IF(BE48=\"\",\"\",BE48)","v":20},{"$f":"IF(BJ48=\"\",\"\",BJ48)","v":""},null,{"$f":"AD48+AI48+AN48+AS48+AX48+BC48+BH48","v":34},{"$f":"IF($F48>=5,IF(AB48=\"\",\"\",AB48),\"\")","v":""},{"$f":"IF($F48>=5,IF(AG48=\"\",\"\",AG48),\"\")","v":""},{"$f":"IF($F48>=5,IF(AL48=\"\",\"\",AL48),\"\")","v":""},{"$f":"IF($F48>=5,IF(AQ48=\"\",\"\",AQ48),\"\")","v":""},{"$f":"IF($F48>=5,IF(AV48=\"\",\"\",AV48),\"\")","v":""},{"$f":"IF($F48>=5,IF(BA48=\"\",\"\",BA48),\"\")","v":""},{"$f":"IF($F48>=5,IF(BF48=\"\",\"\",BF48),\"\")","v":""},{"$f":"IF($F48>=5,IF(BK48=\"\",\"\",BK48),\"\")","v":""},null,18,{"$f":"IF(ISNUMBER(AA48),(VLOOKUP(AA48,$BO$6:$BP$50,2)),0)","v":13},{"$f":"IF(AA48<>\"\",5,0)","v":5},{"$f":"AB48+AC48","v":18},null,null,{"$f":"IF(ISNUMBER(AF48),(VLOOKUP(AF48,$BO$6:$BP$50,2)),0)","v":0},{"$f":"IF(AF48<>\"\",5,0)","v":0},{"$f":"AG48+AH48","v":0},null,null,{"$f":"IF(ISNUMBER(AK48),(VLOOKUP(AK48,$BO$6:$BP$50,2)),0)","v":0},{"$f":"IF(AK48<>\"\",5,0)","v":0},{"$f":"AL48+AM48","v":0},null,null,{"$f":"IF(ISNUMBER(AP48),(VLOOKUP(AP48,$BO$6:$BP$50,2)),0)","v":0},{"$f":"IF(AP48<>\"\",5,0)","v":0},{"$f":"AQ48+AR48","v":0},null,null,{"$f":"IF(ISNUMBER(AU48),(VLOOKUP(AU48,$BO$6:$BP$50,2)),0)","v":0},{"$f":"IF(AU48<>\"\",5,0)","v":0},{"$f":"AV48+AW48","v":0},null,null,{"$f":"IF(ISNUMBER(AZ48),(VLOOKUP(AZ48,$BO$6:$BP$50,2)),0)","v":0},{"$f":"IF(AZ48<>\"\",5,0)","v":0},{"$f":"BA48+BB48","v":0},null,20,{"$f":"IF(ISNUMBER(BE48),(VLOOKUP(BE48,$BO$6:$BP$50,2)),0)","v":11},{"$f":"IF(BE48<>\"\",5,0)","v":5},{"$f":"BF48+BG48","v":16},null,null,{"$f":"IF(ISNUMBER(BJ48),(VLOOKUP(BJ48,$BO$6:$BP$50,2)),0)","v":0},{"$f":"IF(BJ48<>\"\",5,0)","v":0},{"$f":"BK48+BL48","v":0},null,43,0,0,0,0,0,0,0,1,0]
[{"$f":"IF(E49<E48,BO50,A48)","v":45},"Meland","Jonas","HSIL",{"$f":"IF(F49<=4,Q49,(Q49-SUM(SMALL(R49:Y49,{1;2;3;4}))))","v":33},{"$f":"(IF(AC49=5,1,0)+IF(AH49=5,1,0)+IF(AM49=5,1,0)+IF(AR49=5,1,0)+IF(AW49=5,1,0)+IF(BB49=5,1,0)+IF(BG49=5,1,0)+IF(BL49=5,1,0))","v":2},null,{"$f":"IF(AA49=\"\",\"\",AA49)","v":""},{"$f":"IF(AF49=\"\",\"\",AF49)","v":""},{"$f":"IF(AK49=\"\",\"\",AK49)","v":""},{"$f":"IF(AP49=\"\",\"\",AP49)","v":""},{"$f":"IF(AU49=\"\",\"\",AU49)","v":30},{"$f":"IF(AZ49=\"\",\"\",AZ49)","v":12},{"$f":"IF(BE49=\"\",\"\",BE49)","v":""},{"$f":"IF(BJ49=\"\",\"\",BJ49)","v":""},null,{"$f":"AD49+AI49+AN49+AS49+AX49+BC49+BH49","v":33},{"$f":"IF($F49>=5,IF(AB49=\"\",\"\",AB49),\"\")","v":""},{"$f":"IF($F49>=5,IF(AG49=\"\",\"\",AG49),\"\")","v":""},{"$f":"IF($F49>=5,IF(AL49=\"\",\"\",AL49),\"\")","v":""},{"$f":"IF($F49>=5,IF(AQ49=\"\",\"\",AQ49),\"\")","v":""},{"$f":"IF($F49>=5,IF(AV49=\"\",\"\",AV49),\"\")","v":""},{"$f":"IF($F49>=5,IF(BA49=\"\",\"\",BA49),\"\")","v":""},{"$f":"IF($F49>=5,IF(BF49=\"\",\"\",BF49),\"\")","v":""},{"$f":"IF($F49>=5,IF(BK49=\"\",\"\",BK49),\"\")","v":""},null,null,{"$f":"IF(ISNUMBER(AA49),(VLOOKUP(AA49,$BO$6:$BP$50,2)),0)","v":0},{"$f":"IF(AA49<>\"\",5,0)","v":0},{"$f":"AB49+AC49","v":0},null,null,{"$f":"IF(ISNUMBER(AF49),(VLOOKUP(AF49,$BO$6:$BP$50,2)),0)","v":0},{"$f":"IF(AF49<>\"\",5,0)","v":0},{"$f":"AG49+AH49","v":0},null,null,{"$f":"IF(ISNUMBER(AK49),(VLOOKUP(AK49,$BO$6:$BP$50,2)),0)","v":0},{"$f":"IF(AK49<>\"\",5,0)","v":0},{"$f":"AL49+AM49","v":0},null,null,{"$f":"IF(ISNUMBER(AP49),(VLOOKUP(AP49,$BO$6:$BP$50,2)),0)","v":0},{"$f":"IF(AP49<>\"\",5,0)","v":0},{"$f":"AQ49+AR49","v":0},null,30,{"$f":"IF(ISNUMBER(AU49),(VLOOKUP(AU49,$BO$6:$BP$50,2)),0)","v":1},{"$f":"IF(AU49<>\"\",5,0)","v":5},{"$f":"AV49+AW49","v":6},null,12,{"$f":"IF(ISNUMBER(AZ49),(VLOOKUP(AZ49,$BO$6:$BP$50,2)),0)","v":22},{"$f":"IF(AZ49<>\"\",5,0)","v":5},{"$f":"BA49+BB49","v":27},null,null,{"$f":"IF(ISNUMBER(BE49),(VLOOKUP(BE49,$BO$6:$BP$50,2)),0)","v":0},{"$f":"IF(BE49<>\"\",5,0)","v":0},{"$f":"BF49+BG49","v":0},null,null,{"$f":"IF(ISNUMBER(BJ49),(VLOOKUP(BJ49,$BO$6:$BP$50,2)),0)","v":0},{"$f":"IF(BJ49<>\"\",5,0)","v":0},{"$f":"BK49+BL49","v":0},null,44,0,0,0,0,0,0,0,0,1]
[{"$f":"IF(E50<E49,BO51,A49)","v":46},"Andersen","Oscar","IRS",{"$f":"IF(F50<=4,Q50,(Q50-SUM(SMALL(R50:Y50,{1;2;3;4}))))","v":30},{"$f":"(IF(AC50=5,1,0)+IF(AH50=5,1,0)+IF(AM50=5,1,0)+IF(AR50=5,1,0)+IF(AW50=5,1,0)+IF(BB50=5,1,0)+IF(BG50=5,1,0)+IF(BL50=5,1,0))","v":3},null,{"$f":"IF(AA50=\"\",\"\",AA50)","v":21},{"$f":"IF(AF50=\"\",\"\",AF50)","v":""},{"$f":"IF(AK50=\"\",\"\",AK50)","v":""},{"$f":"IF(AP50=\"\",\"\",AP50)","v":29},{"$f":"IF(AU50=\"\",\"\",AU50)","v":""},{"$f":"IF(AZ50=\"\",\"\",AZ50)","v":""},{"$f":"IF(BE50=\"\",\"\",BE50)","v":28},{"$f":"IF(BJ50=\"\",\"\",BJ50)","v":""},null,{"$f":"AD50+AI50+AN50+AS50+AX50+BC50+BH50","v":30},{"$f":"IF($F50>=5,IF(AB50=\"\",\"\",AB50),\"\")","v":""},{"$f":"IF($F50>=5,IF(AG50=\"\",\"\",AG50),\"\")","v":""},{"$f":"IF($F50>=5,IF(AL50=\"\",\"\",AL50),\"\")","v":""},{"$f":"IF($F50>=5,IF(AQ50=\"\",\"\",AQ50),\"\")","v":""},{"$f":"IF($F50>=5,IF(AV50=\"\",\"\",AV50),\"\")","v":""},{"$f":"IF($F50>=5,IF(BA50=\"\",\"\",BA50),\"\")","v":""},{"$f":"IF($F50>=5,IF(BF50=\"\",\"\",BF50),\"\")","v":""},{"$f":"IF($F50>=5,IF(BK50=\"\",\"\",BK50),\"\")","v":""},null,21,{"$f":"IF(ISNUMBER(AA50),(VLOOKUP(AA50,$BO$6:$BP$50,2)),0)","v":10},{"$f":"IF(AA50<>\"\",5,0)","v":5},{"$f":"AB50+AC50","v":15},null,null,{"$f":"IF(ISNUMBER(AF50),(VLOOKUP(AF50,$BO$6:$BP$50,2)),0)","v":0},{"$f":"IF(AF50<>\"\",5,0)","v":0},{"$f":"AG50+AH50","v":0},null,null,{"$f":"IF(ISNUMBER(AK50),(VLOOKUP(AK50,$BO$6:$BP$50,2)),0)","v":0},{"$f":"IF(AK50<>\"\",5,0)","v":0},{"$f":"AL50+AM50","v":0},null,29,{"$f":"IF(ISNUMBER(AP50),(VLOOKUP(AP50,$BO$6:$BP$50,2)),0)","v":2},{"$f":"IF(AP50<>\"\",5,0)","v":5},{"$f":"AQ50+AR50","v":7},null,null,{"$f":"IF(ISNUMBER(AU50),(VLOOKUP(AU50,$BO$6:$BP$50,2)),0)","v":0},{"$f":"IF(AU50<>\"\",5,0)","v":0},{"$f":"AV50+AW50","v":0},null,null,{"$f":"IF(ISNUMBER(AZ50),(VLOOKUP(AZ50,$BO$6:$BP$50,2)),0)","v":0},{"$f":"IF(AZ50<>\"\",5,0)","v":0},{"$f":"BA50+BB50","v":0},null,28,{"$f":"IF(ISNUMBER(BE50),(VLOOKUP(BE50,$BO$6:$BP$50,2)),0)","v":3},{"$f":"IF(BE50<>\"\",5,0)","v":5},{"$f":"BF50+BG50","v":8},null,null,{"$f":"IF(ISNUMBER(BJ50),(VLOOKUP(BJ50,$BO$6:$BP$50,2)),0)","v":0},{"$f":"IF(BJ50<>\"\",5,0)","v":0},{"$f":"BK50+BL50","v":0},null,45,0,0,0,0,0,1,0,0,0]
[{"$f":"IF(E51<E50,BO52,A50)","v":47},"Sundal","Nicolay Neuberth","HSIL",{"$f":"IF(F51<=4,Q51,(Q51-SUM(SMALL(R51:Y51,{1;2;3;4}))))","v":28},{"$f":"(IF(AC51=5,1,0)+IF(AH51=5,1,0)+IF(AM51=5,1,0)+IF(AR51=5,1,0)+IF(AW51=5,1,0)+IF(BB51=5,1,0)+IF(BG51=5,1,0)+IF(BL51=5,1,0))","v":4},null,{"$f":"IF(AA51=\"\",\"\",AA51)","v":""},{"$f":"IF(AF51=\"\",\"\",AF51)","v":""},{"$f":"IF(AK51=\"\",\"\",AK51)","v":28},{"$f":"IF(AP51=\"\",\"\",AP51)","v":""},{"$f":"IF(AU51=\"\",\"\",AU51)","v":32},{"$f":"IF(AZ51=\"\",\"\",AZ51)","v":26},{"$f":"IF(BE51=\"\",\"\",BE51)","v":"dsq"},{"$f":"IF(BJ51=\"\",\"\",BJ51)","v":""},null,{"$f":"AD51+AI51+AN51+AS51+AX51+BC51+BH51","v":28},{"$f":"IF($F51>=5,IF(AB51=\"\",\"\",AB51),\"\")","v":""},{"$f":"IF($F51>=5,IF(AG51=\"\",\"\",AG51),\"\")","v":""},{"$f":"IF($F51>=5,IF(AL51=\"\",\"\",AL51),\"\")","v":""},{"$f":"IF($F51>=5,IF(AQ51=\"\",\"\",AQ51),\"\")","v":""},{"$f":"IF($F51>=5,IF(AV51=\"\",\"\",AV51),\"\")","v":""},{"$f":"IF($F51>=5,IF(BA51=\"\",\"\",BA51),\"\")","v":""},{"$f":"IF($F51>=5,IF(BF51=\"\",\"\",BF51),\"\")","v":""},{"$f":"IF($F51>=5,IF(BK51=\"\",\"\",BK51),\"\")","v":""},null,null,{"$f":"IF(ISNUMBER(AA51),(VLOOKUP(AA51,$BO$6:$BP$50,2)),0)","v":0},{"$f":"IF(AA51<>\"\",5,0)","v":0},{"$f":"AB51+AC51","v":0},null,null,{"$f":"IF(ISNUMBER(AF51),(VLOOKUP(AF51,$BO$6:$BP$50,2)),0)","v":0},{"$f":"IF(AF51<>\"\",5,0)","v":0},{"$f":"AG51+AH51","v":0},null,28,{"$f":"IF(ISNUMBER(AK51),(VLOOKUP(AK51,$BO$6:$BP$50,2)),0)","v":3},{"$f":"IF(AK51<>\"\",5,0)","v":5},{"$f":"AL51+AM51","v":8},null,null,{"$f":"IF(ISNUMBER(AP51),(VLOOKUP(AP51,$BO$6:$BP$50,2)),0)","v":0},{"$f":"IF(AP51<>\"\",5,0)","v":0},{"$f":"AQ51+AR51","v":0},null,32,{"$f":"IF(ISNUMBER(AU51),(VLOOKUP(AU51,$BO$6:$BP$50,2)),0)","v":0},{"$f":"IF(AU51<>\"\",5,0)","v":5},{"$f":"AV51+AW51","v":5},null,26,{"$f":"IF(ISNUMBER(AZ51),(VLOOKUP(AZ51,$BO$6:$BP$50,2)),0)","v":5},{"$f":"IF(AZ51<>\"\",5,0)","v":5},{"$f":"BA51+BB51","v":10},null,"dsq",{"$f":"IF(ISNUMBER(BE51),(VLOOKUP(BE51,$BO$6:$BP$50,2)),0)","v":0},{"$f":"IF(BE51<>\"\",5,0)","v":5},{"$f":"BF51+BG51","v":5},null,null,{"$f":"IF(ISNUMBER(BJ51),(VLOOKUP(BJ51,$BO$6:$BP$50,2)),0)","v":0},{"$f":"IF(BJ51<>\"\",5,0)","v":0},{"$f":"BK51+BL51","v":0},null,46,0,0,0,0,0,0,0,1,0]
[{"$f":"IF(E52<E51,BO53,A51)","v":48},"Pavolas","Paulius","HSIL",{"$f":"IF(F52<=4,Q52,(Q52-SUM(SMALL(R52:Y52,{1;2;3;4}))))","v":27},{"$f":"(IF(AC52=5,1,0)+IF(AH52=5,1,0)+IF(AM52=5,1,0)+IF(AR52=5,1,0)+IF(AW52=5,1,0)+IF(BB52=5,1,0)+IF(BG52=5,1,0)+IF(BL52=5,1,0))","v":3},null,{"$f":"IF(AA52=\"\",\"\",AA52)","v":""},{"$f":"IF(AF52=\"\",\"\",AF52)","v":""},{"$f":"IF(AK52=\"\",\"\",AK52)","v":""},{"$f":"IF(AP52=\"\",\"\",AP52)","v":""},{"$f":"IF(AU52=\"\",\"\",AU52)","v":37},{"$f":"IF(AZ52=\"\",\"\",AZ52)","v":24},{"$f":"IF(BE52=\"\",\"\",BE52)","v":26},{"$f":"IF(BJ52=\"\",\"\",BJ52)","v":""},null,{"$f":"AD52+AI52+AN52+AS52+AX52+BC52+BH52","v":27},{"$f":"IF($F52>=5,IF(AB52=\"\",\"\",AB52),\"\")","v":""},{"$f":"IF($F52>=5,IF(AG52=\"\",\"\",AG52),\"\")","v":""},{"$f":"IF($F52>=5,IF(AL52=\"\",\"\",AL52),\"\")","v":""},{"$f":"IF($F52>=5,IF(AQ52=\"\",\"\",AQ52),\"\")","v":""},{"$f":"IF($F52>=5,IF(AV52=\"\",\"\",AV52),\"\")","v":""},{"$f":"IF($F52>=5,IF(BA52=\"\",\"\",BA52),\"\")","v":""},{"$f":"IF($F52>=5,IF(BF52=\"\",\"\",BF52),\"\")","v":""},{"$f":"IF($F52>=5,IF(BK52=\"\",\"\",BK52),\"\")","v":""},null,null,{"$f":"IF(ISNUMBER(AA52),(VLOOKUP(AA52,$BO$6:$BP$50,2)),0)","v":0},{"$f":"IF(AA52<>\"\",5,0)","v":0},{"$f":"AB52+AC52","v":0},null,null,{"$f":"IF(ISNUMBER(AF52),(VLOOKUP(AF52,$BO$6:$BP$50,2)),0)","v":0},{"$f":"IF(AF52<>\"\",5,0)","v":0},{"$f":"AG52+AH52","v":0},null,null,{"$f":"IF(ISNUMBER(AK52),(VLOOKUP(AK52,$BO$6:$BP$50,2)),0)","v":0},{"$f":"IF(AK52<>\"\",5,0)","v":0},{"$f":"AL52+AM52","v":0},null,null,{"$f":"IF(ISNUMBER(AP52),(VLOOKUP(AP52,$BO$6:$BP$50,2)),0)","v":0},{"$f":"IF(AP52<>\"\",5,0)","v":0},{"$f":"AQ52+AR52","v":0},null,37,{"$f":"IF(ISNUMBER(AU52),(VLOOKUP(AU52,$BO$6:$BP$50,2)),0)","v":0},{"$f":"IF(AU52<>\"\",5,0)","v":5},{"$f":"AV52+AW52","v":5},null,24,{"$f":"IF(ISNUMBER(AZ52),(VLOOKUP(AZ52,$BO$6:$BP$50,2)),0)","v":7},{"$f":"IF(AZ52<>\"\",5,0)","v":5},{"$f":"BA52+BB52","v":12},null,26,{"$f":"IF(ISNUMBER(BE52),(VLOOKUP(BE52,$BO$6:$BP$50,2)),0)","v":5},{"$f":"IF(BE52<>\"\",5,0)","v":5},{"$f":"BF52+BG52","v":10},null,null,{"$f":"IF(ISNUMBER(BJ52),(VLOOKUP(BJ52,$BO$6:$BP$50,2)),0)","v":0},{"$f":"IF(BJ52<>\"\",5,0)","v":0},{"$f":"BK52+BL52","v":0},null,47,0,0,0,0,0,0,1,0,0]
[{"$f":"IF(E53<E52,BO54,A52)","v":49},"Heide","William Weedon","Heming",{"$f":"IF(F53<=4,Q53,(Q53-SUM(SMALL(R53:Y53,{1;2;3;4}))))","v":26},{"$f":"(IF(AC53=5,1,0)+IF(AH53=5,1,0)+IF(AM53=5,1,0)+IF(AR53=5,1,0)+IF(AW53=5,1,0)+IF(BB53=5,1,0)+IF(BG53=5,1,0)+IF(BL53=5,1,0))","v":2},null,{"$f":"IF(AA53=\"\",\"\",AA53)","v":""},{"$f":"IF(AF53=\"\",\"\",AF53)","v":""},{"$f":"IF(AK53=\"\",\"\",AK53)","v":15},{"$f":"IF(AP53=\"\",\"\",AP53)","v":""},{"$f":"IF(AU53=\"\",\"\",AU53)","v":"dnf"},{"$f":"IF(AZ53=\"\",\"\",AZ53)","v":""},{"$f":"IF(BE53=\"\",\"\",BE53)","v":""},{"$f":"IF(BJ53=\"\",\"\",BJ53)","v":""},null,{"$f":"AD53+AI53+AN53+AS53+AX53+BC53+BH53","v":26},{"$f":"IF($F53>=5,IF(AB53=\"\",\"\",AB53),\"\")","v":""},{"$f":"IF($F53>=5,IF(AG53=\"\",\"\",AG53),\"\")","v":""},{"$f":"IF($F53>=5,IF(AL53=\"\",\"\",AL53),\"\")","v":""},{"$f":"IF($F53>=5,IF(AQ53=\"\",\"\",AQ53),\"\")","v":""},{"$f":"IF($F53>=5,IF(AV53=\"\",\"\",AV53),\"\")","v":""},{"$f":"IF($F53>=5,IF(BA53=\"\",\"\",BA53),\"\")","v":""},{"$f":"IF($F53>=5,IF(BF53=\"\",\"\",BF53),\"\")","v":""},{"$f":"IF($F53>=5,IF(BK53=\"\",\"\",BK53),\"\")","v":""},null,null,{"$f":"IF(ISNUMBER(AA53),(VLOOKUP(AA53,$BO$6:$BP$50,2)),0)","v":0},{"$f":"IF(AA53<>\"\",5,0)","v":0},{"$f":"AB53+AC53","v":0},null,null,{"$f":"IF(ISNUMBER(AF53),(VLOOKUP(AF53,$BO$6:$BP$50,2)),0)","v":0},{"$f":"IF(AF53<>\"\",5,0)","v":0},{"$f":"AG53+AH53","v":0},null,15,{"$f":"IF(ISNUMBER(AK53),(VLOOKUP(AK53,$BO$6:$BP$50,2)),0)","v":16},{"$f":"IF(AK53<>\"\",5,0)","v":5},{"$f":"AL53+AM53","v":21},null,null,{"$f":"IF(ISNUMBER(AP53),(VLOOKUP(AP53,$BO$6:$BP$50,2)),0)","v":0},{"$f":"IF(AP53<>\"\",5,0)","v":0},{"$f":"AQ53+AR53","v":0},null,"dnf",{"$f":"IF(ISNUMBER(AU53),(VLOOKUP(AU53,$BO$6:$BP$50,2)),0)","v":0},{"$f":"IF(AU53<>\"\",5,0)","v":5},{"$f":"AV53+AW53","v":5},null,null,{"$f":"IF(ISNUMBER(AZ53),(VLOOKUP(AZ53,$BO$6:$BP$50,2)),0)","v":0},{"$f":"IF(AZ53<>\"\",5,0)","v":0},{"$f":"BA53+BB53","v":0},null,null,{"$f":"IF(ISNUMBER(BE53),(VLOOKUP(BE53,$BO$6:$BP$50,2)),0)","v":0},{"$f":"IF(BE53<>\"\",5,0)","v":0},{"$f":"BF53+BG53","v":0},null,null,{"$f":"IF(ISNUMBER(BJ53),(VLOOKUP(BJ53,$BO$6:$BP$50,2)),0)","v":0},{"$f":"IF(BJ53<>\"\",5,0)","v":0},{"$f":"BK53+BL53","v":0},null,48,0,0,0,0,0,0,0,0,1]
[{"$f":"IF(E54<E53,BO55,A53)","v":50},"Nyman","Carl Axel","Kjelsås",{"$f":"IF(F54<=4,Q54,(Q54-SUM(SMALL(R54:Y54,{1;2;3;4}))))","v":19},{"$f":"(IF(AC54=5,1,0)+IF(AH54=5,1,0)+IF(AM54=5,1,0)+IF(AR54=5,1,0)+IF(AW54=5,1,0)+IF(BB54=5,1,0)+IF(BG54=5,1,0)+IF(BL54=5,1,0))","v":1},null,{"$f":"IF(AA54=\"\",\"\",AA54)","v":""},{"$f":"IF(AF54=\"\",\"\",AF54)","v":17},{"$f":"IF(AK54=\"\",\"\",AK54)","v":""},{"$f":"IF(AP54=\"\",\"\",AP54)","v":""},{"$f":"IF(AU54=\"\",\"\",AU54)","v":""},{"$f":"IF(AZ54=\"\",\"\",AZ54)","v":""},{"$f":"IF(BE54=\"\",\"\",BE54)","v":""},{"$f":"IF(BJ54=\"\",\"\",BJ54)","v":""},null,{"$f":"AD54+AI54+AN54+AS54+AX54+BC54+BH54","v":19},{"$f":"IF($F54>=5,IF(AB54=\"\",\"\",AB54),\"\")","v":""},{"$f":"IF($F54>=5,IF(AG54=\"\",\"\",AG54),\"\")","v":""},{"$f":"IF($F54>=5,IF(AL54=\"\",\"\",AL54),\"\")","v":""},{"$f":"IF($F54>=5,IF(AQ54=\"\",\"\",AQ54),\"\")","v":""},{"$f":"IF($F54>=5,IF(AV54=\"\",\"\",AV54),\"\")","v":""},{"$f":"IF($F54>=5,IF(BA54=\"\",\"\",BA54),\"\")","v":""},{"$f":"IF($F54>=5,IF(BF54=\"\",\"\",BF54),\"\")","v":""},{"$f":"IF($F54>=5,IF(BK54=\"\",\"\",BK54),\"\")","v":""},null,null,{"$f":"IF(ISNUMBER(AA54),(VLOOKUP(AA54,$BO$6:$BP$50,2)),0)","v":0},{"$f":"IF(AA54<>\"\",5,0)","v":0},{"$f":"AB54+AC54","v":0},null,17,{"$f":"IF(ISNUMBER(AF54),(VLOOKUP(AF54,$BO$6:$BP$50,2)),0)","v":14},{"$f":"IF(AF54<>\"\",5,0)","v":5},{"$f":"AG54+AH54","v":19},null,null,{"$f":"IF(ISNUMBER(AK54),(VLOOKUP(AK54,$BO$6:$BP$50,2)),0)","v":0},{"$f":"IF(AK54<>\"\",5,0)","v":0},{"$f":"AL54+AM54","v":0},null,null,{"$f":"IF(ISNUMBER(AP54),(VLOOKUP(AP54,$BO$6:$BP$50,2)),0)","v":0},{"$f":"IF(AP54<>\"\",5,0)","v":0},{"$f":"AQ54+AR54","v":0},null,null,{"$f":"IF(ISNUMBER(AU54),(VLOOKUP(AU54,$BO$6:$BP$50,2)),0)","v":0},{"$f":"IF(AU54<>\"\",5,0)","v":0},{"$f":"AV54+AW54","v":0},null,null,{"$f":"IF(ISNUMBER(AZ54),(VLOOKUP(AZ54,$BO$6:$BP$50,2)),0)","v":0},{"$f":"IF(AZ54<>\"\",5,0)","v":0},{"$f":"BA54+BB54","v":0},null,null,{"$f":"IF(ISNUMBER(BE54),(VLOOKUP(BE54,$BO$6:$BP$50,2)),0)","v":0},{"$f":"IF(BE54<>\"\",5,0)","v":0},{"$f":"BF54+BG54","v":0},null,null,{"$f":"IF(ISNUMBER(BJ54),(VLOOKUP(BJ54,$BO$6:$BP$50,2)),0)","v":0},{"$f":"IF(BJ54<>\"\",5,0)","v":0},{"$f":"BK54+BL54","v":0},null,49,0,0,0,0,0,0,0,0,1]
[{"$f":"IF(E55<E54,BO56,A54)","v":51},"Ring","Simon Lae","Njård",{"$f":"IF(F55<=4,Q55,(Q55-SUM(SMALL(R55:Y55,{1;2;3;4}))))","v":16},{"$f":"(IF(AC55=5,1,0)+IF(AH55=5,1,0)+IF(AM55=5,1,0)+IF(AR55=5,1,0)+IF(AW55=5,1,0)+IF(BB55=5,1,0)+IF(BG55=5,1,0)+IF(BL55=5,1,0))","v":3},null,{"$f":"IF(AA55=\"\",\"\",AA55)","v":""},{"$f":"IF(AF55=\"\",\"\",AF55)","v":""},{"$f":"IF(AK55=\"\",\"\",AK55)","v":38},{"$f":"IF(AP55=\"\",\"\",AP55)","v":30},{"$f":"IF(AU55=\"\",\"\",AU55)","v":36},{"$f":"IF(AZ55=\"\",\"\",AZ55)","v":""},{"$f":"IF(BE55=\"\",\"\",BE55)","v":""},{"$f":"IF(BJ55=\"\",\"\",BJ55)","v":""},null,{"$f":"AD55+AI55+AN55+AS55+AX55+BC55+BH55","v":16},{"$f":"IF($F55>=5,IF(AB55=\"\",\"\",AB55),\"\")","v":""},{"$f":"IF($F55>=5,IF(AG55=\"\",\"\",AG55),\"\")","v":""},{"$f":"IF($F55>=5,IF(AL55=\"\",\"\",AL55),\"\")","v":""},{"$f":"IF($F55>=5,IF(AQ55=\"\",\"\",AQ55),\"\")","v":""},{"$f":"IF($F55>=5,IF(AV55=\"\",\"\",AV55),\"\")","v":""},{"$f":"IF($F55>=5,IF(BA55=\"\",\"\",BA55),\"\")","v":""},{"$f":"IF($F55>=5,IF(BF55=\"\",\"\",BF55),\"\")","v":""},{"$f":"IF($F55>=5,IF(BK55=\"\",\"\",BK55),\"\")","v":""},null,null,{"$f":"IF(ISNUMBER(AA55),(VLOOKUP(AA55,$BO$6:$BP$50,2)),0)","v":0},{"$f":"IF(AA55<>\"\",5,0)","v":0},{"$f":"AB55+AC55","v":0},null,null,{"$f":"IF(ISNUMBER(AF55),(VLOOKUP(AF55,$BO$6:$BP$50,2)),0)","v":0},{"$f":"IF(AF55<>\"\",5,0)","v":0},{"$f":"AG55+AH55","v":0},null,38,{"$f":"IF(ISNUMBER(AK55),(VLOOKUP(AK55,$BO$6:$BP$50,2)),0)","v":0},{"$f":"IF(AK55<>\"\",5,0)","v":5},{"$f":"AL55+AM55","v":5},null,30,{"$f":"IF(ISNUMBER(AP55),(VLOOKUP(AP55,$BO$6:$BP$50,2)),0)","v":1},{"$f":"IF(AP55<>\"\",5,0)","v":5},{"$f":"AQ55+AR55","v":6},null,36,{"$f":"IF(ISNUMBER(AU55),(VLOOKUP(AU55,$BO$6:$BP$50,2)),0)","v":0},{"$f":"IF(AU55<>\"\",5,0)","v":5},{"$f":"AV55+AW55","v":5},null,null,{"$f":"IF(ISNUMBER(AZ55),(VLOOKUP(AZ55,$BO$6:$BP$50,2)),0)","v":0},{"$f":"IF(AZ55<>\"\",5,0)","v":0},{"$f":"BA55+BB55","v":0},null,null,{"$f":"IF(ISNUMBER(BE55),(VLOOKUP(BE55,$BO$6:$BP$50,2)),0)","v":0},{"$f":"IF(BE55<>\"\",5,0)","v":0},{"$f":"BF55+BG55","v":0},null,null,{"$f":"IF(ISNUMBER(BJ55),(VLOOKUP(BJ55,$BO$6:$BP$50,2)),0)","v":0},{"$f":"IF(BJ55<>\"\",5,0)","v":0},{"$f":"BK55+BL55","v":0},null,50,0,0,0,0,0,0,1,0,0]
[{"$f":"IF(E56<E55,BO57,A55)","v":51},"Skinningsrud","Kristoffer","Kjelsås",{"$f":"IF(F56<=4,Q56,(Q56-SUM(SMALL(R56:Y56,{1;2;3;4}))))","v":16},{"$f":"(IF(AC56=5,1,0)+IF(AH56=5,1,0)+IF(AM56=5,1,0)+IF(AR56=5,1,0)+IF(AW56=5,1,0)+IF(BB56=5,1,0)+IF(BG56=5,1,0)+IF(BL56=5,1,0))","v":2},null,{"$f":"IF(AA56=\"\",\"\",AA56)","v":""},{"$f":"IF(AF56=\"\",\"\",AF56)","v":""},{"$f":"IF(AK56=\"\",\"\",AK56)","v":""},{"$f":"IF(AP56=\"\",\"\",AP56)","v":""},{"$f":"IF(AU56=\"\",\"\",AU56)","v":""},{"$f":"IF(AZ56=\"\",\"\",AZ56)","v":27},{"$f":"IF(BE56=\"\",\"\",BE56)","v":29},{"$f":"IF(BJ56=\"\",\"\",BJ56)","v":""},null,{"$f":"AD56+AI56+AN56+AS56+AX56+BC56+BH56","v":16},{"$f":"IF($F56>=5,IF(AB56=\"\",\"\",AB56),\"\")","v":""},{"$f":"IF($F56>=5,IF(AG56=\"\",\"\",AG56),\"\")","v":""},{"$f":"IF($F56>=5,IF(AL56=\"\",\"\",AL56),\"\")","v":""},{"$f":"IF($F56>=5,IF(AQ56=\"\",\"\",AQ56),\"\")","v":""},{"$f":"IF($F56>=5,IF(AV56=\"\",\"\",AV56),\"\")","v":""},{"$f":"IF($F56>=5,IF(BA56=\"\",\"\",BA56),\"\")","v":""},{"$f":"IF($F56>=5,IF(BF56=\"\",\"\",BF56),\"\")","v":""},{"$f":"IF($F56>=5,IF(BK56=\"\",\"\",BK56),\"\")","v":""},null,null,{"$f":"IF(ISNUMBER(AA56),(VLOOKUP(AA56,$BO$6:$BP$50,2)),0)","v":0},{"$f":"IF(AA56<>\"\",5,0)","v":0},{"$f":"AB56+AC56","v":0},null,null,{"$f":"IF(ISNUMBER(AF56),(VLOOKUP(AF56,$BO$6:$BP$50,2)),0)","v":0},{"$f":"IF(AF56<>\"\",5,0)","v":0},{"$f":"AG56+AH56","v":0},null,null,{"$f":"IF(ISNUMBER(AK56),(VLOOKUP(AK56,$BO$6:$BP$50,2)),0)","v":0},{"$f":"IF(AK56<>\"\",5,0)","v":0},{"$f":"AL56+AM56","v":0},null,null,{"$f":"IF(ISNUMBER(AP56),(VLOOKUP(AP56,$BO$6:$BP$50,2)),0)","v":0},{"$f":"IF(AP56<>\"\",5,0)","v":0},{"$f":"AQ56+AR56","v":0},null,null,{"$f":"IF(ISNUMBER(AU56),(VLOOKUP(AU56,$BO$6:$BP$50,2)),0)","v":0},{"$f":"IF(AU56<>\"\",5,0)","v":0},{"$f":"AV56+AW56","v":0},null,27,{"$f":"IF(ISNUMBER(AZ56),(VLOOKUP(AZ56,$BO$6:$BP$50,2)),0)","v":4},{"$f":"IF(AZ56<>\"\",5,0)","v":5},{"$f":"BA56+BB56","v":9},null,29,{"$f":"IF(ISNUMBER(BE56),(VLOOKUP(BE56,$BO$6:$BP$50,2)),0)","v":2},{"$f":"IF(BE56<>\"\",5,0)","v":5},{"$f":"BF56+BG56","v":7},null,null,{"$f":"IF(ISNUMBER(BJ56),(VLOOKUP(BJ56,$BO$6:$BP$50,2)),0)","v":0},{"$f":"IF(BJ56<>\"\",5,0)","v":0},{"$f":"BK56+BL56","v":0},null,51,0,0,0,0,0,0,0,1,0]
[{"$f":"IF(E57<E56,BO58,A56)","v":51},"Aase","Sondre Lia","HSIL",{"$f":"IF(F57<=4,Q57,(Q57-SUM(SMALL(R57:Y57,{1;2;3;4}))))","v":16},{"$f":"(IF(AC57=5,1,0)+IF(AH57=5,1,0)+IF(AM57=5,1,0)+IF(AR57=5,1,0)+IF(AW57=5,1,0)+IF(BB57=5,1,0)+IF(BG57=5,1,0)+IF(BL57=5,1,0))","v":2},null,{"$f":"IF(AA57=\"\",\"\",AA57)","v":""},{"$f":"IF(AF57=\"\",\"\",AF57)","v":""},{"$f":"IF(AK57=\"\",\"\",AK57)","v":""},{"$f":"IF(AP57=\"\",\"\",AP57)","v":""},{"$f":"IF(AU57=\"\",\"\",AU57)","v":""},{"$f":"IF(AZ57=\"\",\"\",AZ57)","v":"dsq"},{"$f":"IF(BE57=\"\",\"\",BE57)","v":25},{"$f":"IF(BJ57=\"\",\"\",BJ57)","v":""},null,{"$f":"AD57+AI57+AN57+AS57+AX57+BC57+BH57","v":16},{"$f":"IF($F57>=5,IF(AB57=\"\",\"\",AB57),\"\")","v":""},{"$f":"IF($F57>=5,IF(AG57=\"\",\"\",AG57),\"\")","v":""},{"$f":"IF($F57>=5,IF(AL57=\"\",\"\",AL57),\"\")","v":""},{"$f":"IF($F57>=5,IF(AQ57=\"\",\"\",AQ57),\"\")","v":""},{"$f":"IF($F57>=5,IF(AV57=\"\",\"\",AV57),\"\")","v":""},{"$f":"IF($F57>=5,IF(BA57=\"\",\"\",BA57),\"\")","v":""},{"$f":"IF($F57>=5,IF(BF57=\"\",\"\",BF57),\"\")","v":""},{"$f":"IF($F57>=5,IF(BK57=\"\",\"\",BK57),\"\")","v":""},null,null,{"$f":"IF(ISNUMBER(AA57),(VLOOKUP(AA57,$BO$6:$BP$50,2)),0)","v":0},{"$f":"IF(AA57<>\"\",5,0)","v":0},{"$f":"AB57+AC57","v":0},null,null,{"$f":"IF(ISNUMBER(AF57),(VLOOKUP(AF57,$BO$6:$BP$50,2)),0)","v":0},{"$f":"IF(AF57<>\"\",5,0)","v":0},{"$f":"AG57+AH57","v":0},null,null,{"$f":"IF(ISNUMBER(AK57),(VLOOKUP(AK57,$BO$6:$BP$50,2)),0)","v":0},{"$f":"IF(AK57<>\"\",5,0)","v":0},{"$f":"AL57+AM57","v":0},null,null,{"$f":"IF(ISNUMBER(AP57),(VLOOKUP(AP57,$BO$6:$BP$50,2)),0)","v":0},{"$f":"IF(AP57<>\"\",5,0)","v":0},{"$f":"AQ57+AR57","v":0},null,null,{"$f":"IF(ISNUMBER(AU57),(VLOOKUP(AU57,$BO$6:$BP$50,2)),0)","v":0},{"$f":"IF(AU57<>\"\",5,0)","v":0},{"$f":"AV57+AW57","v":0},null,"dsq",{"$f":"IF(ISNUMBER(AZ57),(VLOOKUP(AZ57,$BO$6:$BP$50,2)),0)","v":0},{"$f":"IF(AZ57<>\"\",5,0)","v":5},{"$f":"BA57+BB57","v":5},null,25,{"$f":"IF(ISNUMBER(BE57),(VLOOKUP(BE57,$BO$6:$BP$50,2)),0)","v":6},{"$f":"IF(BE57<>\"\",5,0)","v":5},{"$f":"BF57+BG57","v":11},null,null,{"$f":"IF(ISNUMBER(BJ57),(VLOOKUP(BJ57,$BO$6:$BP$50,2)),0)","v":0},{"$f":"IF(BJ57<>\"\",5,0)","v":0},{"$f":"BK57+BL57","v":0},null,52,0,0,0,0,0,0,0,1,0]
[{"$f":"IF(E58<E57,BO59,A57)","v":54},"Eriksson","Peder","Try",{"$f":"IF(F58<=4,Q58,(Q58-SUM(SMALL(R58:Y58,{1;2;3;4}))))","v":14},{"$f":"(IF(AC58=5,1,0)+IF(AH58=5,1,0)+IF(AM58=5,1,0)+IF(AR58=5,1,0)+IF(AW58=5,1,0)+IF(BB58=5,1,0)+IF(BG58=5,1,0)+IF(BL58=5,1,0))","v":2},null,{"$f":"IF(AA58=\"\",\"\",AA58)","v":""},{"$f":"IF(AF58=\"\",\"\",AF58)","v":"dsq"},{"$f":"IF(AK58=\"\",\"\",AK58)","v":""},{"$f":"IF(AP58=\"\",\"\",AP58)","v":27},{"$f":"IF(AU58=\"\",\"\",AU58)","v":""},{"$f":"IF(AZ58=\"\",\"\",AZ58)","v":""},{"$f":"IF(BE58=\"\",\"\",BE58)","v":""},{"$f":"IF(BJ58=\"\",\"\",BJ58)","v":""},null,{"$f":"AD58+AI58+AN58+AS58+AX58+BC58+BH58","v":14},{"$f":"IF($F58>=5,IF(AB58=\"\",\"\",AB58),\"\")","v":""},{"$f":"IF($F58>=5,IF(AG58=\"\",\"\",AG58),\"\")","v":""},{"$f":"IF($F58>=5,IF(AL58=\"\",\"\",AL58),\"\")","v":""},{"$f":"IF($F58>=5,IF(AQ58=\"\",\"\",AQ58),\"\")","v":""},{"$f":"IF($F58>=5,IF(AV58=\"\",\"\",AV58),\"\")","v":""},{"$f":"IF($F58>=5,IF(BA58=\"\",\"\",BA58),\"\")","v":""},{"$f":"IF($F58>=5,IF(BF58=\"\",\"\",BF58),\"\")","v":""},{"$f":"IF($F58>=5,IF(BK58=\"\",\"\",BK58),\"\")","v":""},null,null,{"$f":"IF(ISNUMBER(AA58),(VLOOKUP(AA58,$BO$6:$BP$50,2)),0)","v":0},{"$f":"IF(AA58<>\"\",5,0)","v":0},{"$f":"AB58+AC58","v":0},null,"dsq",{"$f":"IF(ISNUMBER(AF58),(VLOOKUP(AF58,$BO$6:$BP$50,2)),0)","v":0},{"$f":"IF(AF58<>\"\",5,0)","v":5},{"$f":"AG58+AH58","v":5},null,null,{"$f":"IF(ISNUMBER(AK58),(VLOOKUP(AK58,$BO$6:$BP$50,2)),0)","v":0},{"$f":"IF(AK58<>\"\",5,0)","v":0},{"$f":"AL58+AM58","v":0},null,27,{"$f":"IF(ISNUMBER(AP58),(VLOOKUP(AP58,$BO$6:$BP$50,2)),0)","v":4},{"$f":"IF(AP58<>\"\",5,0)","v":5},{"$f":"AQ58+AR58","v":9},null,null,{"$f":"IF(ISNUMBER(AU58),(VLOOKUP(AU58,$BO$6:$BP$50,2)),0)","v":0},{"$f":"IF(AU58<>\"\",5,0)","v":0},{"$f":"AV58+AW58","v":0},null,null,{"$f":"IF(ISNUMBER(AZ58),(VLOOKUP(AZ58,$BO$6:$BP$50,2)),0)","v":0},{"$f":"IF(AZ58<>\"\",5,0)","v":0},{"$f":"BA58+BB58","v":0},null,null,{"$f":"IF(ISNUMBER(BE58),(VLOOKUP(BE58,$BO$6:$BP$50,2)),0)","v":0},{"$f":"IF(BE58<>\"\",5,0)","v":0},{"$f":"BF58+BG58","v":0},null,null,{"$f":"IF(ISNUMBER(BJ58),(VLOOKUP(BJ58,$BO$6:$BP$50,2)),0)","v":0},{"$f":"IF(BJ58<>\"\",5,0)","v":0},{"$f":"BK58+BL58","v":0},null,53,0,0,0,0,0,0,0,1,0]
[{"$f":"IF(E59<E58,BO60,A58)","v":55},"Bjørge","Sander Sebastian","Rælingen",{"$f":"IF(F59<=4,Q59,(Q59-SUM(SMALL(R59:Y59,{1;2;3;4}))))","v":13},{"$f":"(IF(AC59=5,1,0)+IF(AH59=5,1,0)+IF(AM59=5,1,0)+IF(AR59=5,1,0)+IF(AW59=5,1,0)+IF(BB59=5,1,0)+IF(BG59=5,1,0)+IF(BL59=5,1,0))","v":1},null,{"$f":"IF(AA59=\"\",\"\",AA59)","v":""},{"$f":"IF(AF59=\"\",\"\",AF59)","v":""},{"$f":"IF(AK59=\"\",\"\",AK59)","v":""},{"$f":"IF(AP59=\"\",\"\",AP59)","v":""},{"$f":"IF(AU59=\"\",\"\",AU59)","v":23},{"$f":"IF(AZ59=\"\",\"\",AZ59)","v":""},{"$f":"IF(BE59=\"\",\"\",BE59)","v":""},{"$f":"IF(BJ59=\"\",\"\",BJ59)","v":""},null,{"$f":"AD59+AI59+AN59+AS59+AX59+BC59+BH59","v":13},{"$f":"IF($F59>=5,IF(AB59=\"\",\"\",AB59),\"\")","v":""},{"$f":"IF($F59>=5,IF(AG59=\"\",\"\",AG59),\"\")","v":""},{"$f":"IF($F59>=5,IF(AL59=\"\",\"\",AL59),\"\")","v":""},{"$f":"IF($F59>=5,IF(AQ59=\"\",\"\",AQ59),\"\")","v":""},{"$f":"IF($F59>=5,IF(AV59=\"\",\"\",AV59),\"\")","v":""},{"$f":"IF($F59>=5,IF(BA59=\"\",\"\",BA59),\"\")","v":""},{"$f":"IF($F59>=5,IF(BF59=\"\",\"\",BF59),\"\")","v":""},{"$f":"IF($F59>=5,IF(BK59=\"\",\"\",BK59),\"\")","v":""},null,null,{"$f":"IF(ISNUMBER(AA59),(VLOOKUP(AA59,$BO$6:$BP$50,2)),0)","v":0},{"$f":"IF(AA59<>\"\",5,0)","v":0},{"$f":"AB59+AC59","v":0},null,null,{"$f":"IF(ISNUMBER(AF59),(VLOOKUP(AF59,$BO$6:$BP$50,2)),0)","v":0},{"$f":"IF(AF59<>\"\",5,0)","v":0},{"$f":"AG59+AH59","v":0},null,null,{"$f":"IF(ISNUMBER(AK59),(VLOOKUP(AK59,$BO$6:$BP$50,2)),0)","v":0},{"$f":"IF(AK59<>\"\",5,0)","v":0},{"$f":"AL59+AM59","v":0},null,null,{"$f":"IF(ISNUMBER(AP59),(VLOOKUP(AP59,$BO$6:$BP$50,2)),0)","v":0},{"$f":"IF(AP59<>\"\",5,0)","v":0},{"$f":"AQ59+AR59","v":0},null,23,{"$f":"IF(ISNUMBER(AU59),(VLOOKUP(AU59,$BO$6:$BP$50,2)),0)","v":8},{"$f":"IF(AU59<>\"\",5,0)","v":5},{"$f":"AV59+AW59","v":13},null,null,{"$f":"IF(ISNUMBER(AZ59),(VLOOKUP(AZ59,$BO$6:$BP$50,2)),0)","v":0},{"$f":"IF(AZ59<>\"\",5,0)","v":0},{"$f":"BA59+BB59","v":0},null,null,{"$f":"IF(ISNUMBER(BE59),(VLOOKUP(BE59,$BO$6:$BP$50,2)),0)","v":0},{"$f":"IF(BE59<>\"\",5,0)","v":0},{"$f":"BF59+BG59","v":0},null,null,{"$f":"IF(ISNUMBER(BJ59),(VLOOKUP(BJ59,$BO$6:$BP$50,2)),0)","v":0},{"$f":"IF(BJ59<>\"\",5,0)","v":0},{"$f":"BK59+BL59","v":0},null,54,0,0,0,0,0,0,1,0,0]
[{"$f":"IF(E60<E59,BO61,A59)","v":56},"Vodal","Christian Folkenborg","Heming",{"$f":"IF(F60<=4,Q60,(Q60-SUM(SMALL(R60:Y60,{1;2;3;4}))))","v":12},{"$f":"(IF(AC60=5,1,0)+IF(AH60=5,1,0)+IF(AM60=5,1,0)+IF(AR60=5,1,0)+IF(AW60=5,1,0)+IF(BB60=5,1,0)+IF(BG60=5,1,0)+IF(BL60=5,1,0))","v":1},null,{"$f":"IF(AA60=\"\",\"\",AA60)","v":""},{"$f":"IF(AF60=\"\",\"\",AF60)","v":""},{"$f":"IF(AK60=\"\",\"\",AK60)","v":24},{"$f":"IF(AP60=\"\",\"\",AP60)","v":""},{"$f":"IF(AU60=\"\",\"\",AU60)","v":""},{"$f":"IF(AZ60=\"\",\"\",AZ60)","v":""},{"$f":"IF(BE60=\"\",\"\",BE60)","v":""},{"$f":"IF(BJ60=\"\",\"\",BJ60)","v":""},null,{"$f":"AD60+AI60+AN60+AS60+AX60+BC60+BH60","v":12},{"$f":"IF($F60>=5,IF(AB60=\"\",\"\",AB60),\"\")","v":""},{"$f":"IF($F60>=5,IF(AG60=\"\",\"\",AG60),\"\")","v":""},{"$f":"IF($F60>=5,IF(AL60=\"\",\"\",AL60),\"\")","v":""},{"$f":"IF($F60>=5,IF(AQ60=\"\",\"\",AQ60),\"\")","v":""},{"$f":"IF($F60>=5,IF(AV60=\"\",\"\",AV60),\"\")","v":""},{"$f":"IF($F60>=5,IF(BA60=\"\",\"\",BA60),\"\")","v":""},{"$f":"IF($F60>=5,IF(BF60=\"\",\"\",BF60),\"\")","v":""},{"$f":"IF($F60>=5,IF(BK60=\"\",\"\",BK60),\"\")","v":""},null,null,{"$f":"IF(ISNUMBER(AA60),(VLOOKUP(AA60,$BO$6:$BP$50,2)),0)","v":0},{"$f":"IF(AA60<>\"\",5,0)","v":0},{"$f":"AB60+AC60","v":0},null,null,{"$f":"IF(ISNUMBER(AF60),(VLOOKUP(AF60,$BO$6:$BP$50,2)),0)","v":0},{"$f":"IF(AF60<>\"\",5,0)","v":0},{"$f":"AG60+AH60","v":0},null,24,{"$f":"IF(ISNUMBER(AK60),(VLOOKUP(AK60,$BO$6:$BP$50,2)),0)","v":7},{"$f":"IF(AK60<>\"\",5,0)","v":5},{"$f":"AL60+AM60","v":12},null,null,{"$f":"IF(ISNUMBER(AP60),(VLOOKUP(AP60,$BO$6:$BP$50,2)),0)","v":0},{"$f":"IF(AP60<>\"\",5,0)","v":0},{"$f":"AQ60+AR60","v":0},null,null,{"$f":"IF(ISNUMBER(AU60),(VLOOKUP(AU60,$BO$6:$BP$50,2)),0)","v":0},{"$f":"IF(AU60<>\"\",5,0)","v":0},{"$f":"AV60+AW60","v":0},null,null,{"$f":"IF(ISNUMBER(AZ60),(VLOOKUP(AZ60,$BO$6:$BP$50,2)),0)","v":0},{"$f":"IF(AZ60<>\"\",5,0)","v":0},{"$f":"BA60+BB60","v":0},null,null,{"$f":"IF(ISNUMBER(BE60),(VLOOKUP(BE60,$BO$6:$BP$50,2)),0)","v":0},{"$f":"IF(BE60<>\"\",5,0)","v":0},{"$f":"BF60+BG60","v":0},null,null,{"$f":"IF(ISNUMBER(BJ60),(VLOOKUP(BJ60,$BO$6:$BP$50,2)),0)","v":0},{"$f":"IF(BJ60<>\"\",5,0)","v":0},{"$f":"BK60+BL60","v":0},null,55,0,0,0,0,0,1,0,0,0]
[{"$f":"IF(E61<E60,BO62,A60)","v":56},"Amundsen","Axel Røsberg","Heming",{"$f":"IF(F61<=4,Q61,(Q61-SUM(SMALL(R61:Y61,{1;2;3;4}))))","v":12},{"$f":"(IF(AC61=5,1,0)+IF(AH61=5,1,0)+IF(AM61=5,1,0)+IF(AR61=5,1,0)+IF(AW61=5,1,0)+IF(BB61=5,1,0)+IF(BG61=5,1,0)+IF(BL61=5,1,0))","v":1},null,{"$f":"IF(AA61=\"\",\"\",AA61)","v":""},{"$f":"IF(AF61=\"\",\"\",AF61)","v":""},{"$f":"IF(AK61=\"\",\"\",AK61)","v":""},{"$f":"IF(AP61=\"\",\"\",AP61)","v":""},{"$f":"IF(AU61=\"\",\"\",AU61)","v":24},{"$f":"IF(AZ61=\"\",\"\",AZ61)","v":""},{"$f":"IF(BE61=\"\",\"\",BE61)","v":""},{"$f":"IF(BJ61=\"\",\"\",BJ61)","v":""},null,{"$f":"AD61+AI61+AN61+AS61+AX61+BC61+BH61","v":12},{"$f":"IF($F61>=5,IF(AB61=\"\",\"\",AB61),\"\")","v":""},{"$f":"IF($F61>=5,IF(AG61=\"\",\"\",AG61),\"\")","v":""},{"$f":"IF($F61>=5,IF(AL61=\"\",\"\",AL61),\"\")","v":""},{"$f":"IF($F61>=5,IF(AQ61=\"\",\"\",AQ61),\"\")","v":""},{"$f":"IF($F61>=5,IF(AV61=\"\",\"\",AV61),\"\")","v":""},{"$f":"IF($F61>=5,IF(BA61=\"\",\"\",BA61),\"\")","v":""},{"$f":"IF($F61>=5,IF(BF61=\"\",\"\",BF61),\"\")","v":""},{"$f":"IF($F61>=5,IF(BK61=\"\",\"\",BK61),\"\")","v":""},null,null,{"$f":"IF(ISNUMBER(AA61),(VLOOKUP(AA61,$BO$6:$BP$50,2)),0)","v":0},{"$f":"IF(AA61<>\"\",5,0)","v":0},{"$f":"AB61+AC61","v":0},null,null,{"$f":"IF(ISNUMBER(AF61),(VLOOKUP(AF61,$BO$6:$BP$50,2)),0)","v":0},{"$f":"IF(AF61<>\"\",5,0)","v":0},{"$f":"AG61+AH61","v":0},null,null,{"$f":"IF(ISNUMBER(AK61),(VLOOKUP(AK61,$BO$6:$BP$50,2)),0)","v":0},{"$f":"IF(AK61<>\"\",5,0)","v":0},{"$f":"AL61+AM61","v":0},null,null,{"$f":"IF(ISNUMBER(AP61),(VLOOKUP(AP61,$BO$6:$BP$50,2)),0)","v":0},{"$f":"IF(AP61<>\"\",5,0)","v":0},{"$f":"AQ61+AR61","v":0},null,24,{"$f":"IF(ISNUMBER(AU61),(VLOOKUP(AU61,$BO$6:$BP$50,2)),0)","v":7},{"$f":"IF(AU61<>\"\",5,0)","v":5},{"$f":"AV61+AW61","v":12},null,null,{"$f":"IF(ISNUMBER(AZ61),(VLOOKUP(AZ61,$BO$6:$BP$50,2)),0)","v":0},{"$f":"IF(AZ61<>\"\",5,0)","v":0},{"$f":"BA61+BB61","v":0},null,null,{"$f":"IF(ISNUMBER(BE61),(VLOOKUP(BE61,$BO$6:$BP$50,2)),0)","v":0},{"$f":"IF(BE61<>\"\",5,0)","v":0},{"$f":"BF61+BG61","v":0},null,null,{"$f":"IF(ISNUMBER(BJ61),(VLOOKUP(BJ61,$BO$6:$BP$50,2)),0)","v":0},{"$f":"IF(BJ61<>\"\",5,0)","v":0},{"$f":"BK61+BL61","v":0},null,56,0,0,0,0,0,0,1,0,0]
[{"$f":"IF(E62<E61,BO63,A61)","v":56},"Forberg","Ludvig","Heming",{"$f":"IF(F62<=4,Q62,(Q62-SUM(SMALL(R62:Y62,{1;2;3;4}))))","v":12},{"$f":"(IF(AC62=5,1,0)+IF(AH62=5,1,0)+IF(AM62=5,1,0)+IF(AR62=5,1,0)+IF(AW62=5,1,0)+IF(BB62=5,1,0)+IF(BG62=5,1,0)+IF(BL62=5,1,0))","v":1},null,{"$f":"IF(AA62=\"\",\"\",AA62)","v":""},{"$f":"IF(AF62=\"\",\"\",AF62)","v":""},{"$f":"IF(AK62=\"\",\"\",AK62)","v":""},{"$f":"IF(AP62=\"\",\"\",AP62)","v":""},{"$f":"IF(AU62=\"\",\"\",AU62)","v":""},{"$f":"IF(AZ62=\"\",\"\",AZ62)","v":""},{"$f":"IF(BE62=\"\",\"\",BE62)","v":24},{"$f":"IF(BJ62=\"\",\"\",BJ62)","v":""},null,{"$f":"AD62+AI62+AN62+AS62+AX62+BC62+BH62","v":12},{"$f":"IF($F62>=5,IF(AB62=\"\",\"\",AB62),\"\")","v":""},{"$f":"IF($F62>=5,IF(AG62=\"\",\"\",AG62),\"\")","v":""},{"$f":"IF($F62>=5,IF(AL62=\"\",\"\",AL62),\"\")","v":""},{"$f":"IF($F62>=5,IF(AQ62=\"\",\"\",AQ62),\"\")","v":""},{"$f":"IF($F62>=5,IF(AV62=\"\",\"\",AV62),\"\")","v":""},{"$f":"IF($F62>=5,IF(BA62=\"\",\"\",BA62),\"\")","v":""},{"$f":"IF($F62>=5,IF(BF62=\"\",\"\",BF62),\"\")","v":""},{"$f":"IF($F62>=5,IF(BK62=\"\",\"\",BK62),\"\")","v":""},null,null,{"$f":"IF(ISNUMBER(AA62),(VLOOKUP(AA62,$BO$6:$BP$50,2)),0)","v":0},{"$f":"IF(AA62<>\"\",5,0)","v":0},{"$f":"AB62+AC62","v":0},null,null,{"$f":"IF(ISNUMBER(AF62),(VLOOKUP(AF62,$BO$6:$BP$50,2)),0)","v":0},{"$f":"IF(AF62<>\"\",5,0)","v":0},{"$f":"AG62+AH62","v":0},null,null,{"$f":"IF(ISNUMBER(AK62),(VLOOKUP(AK62,$BO$6:$BP$50,2)),0)","v":0},{"$f":"IF(AK62<>\"\",5,0)","v":0},{"$f":"AL62+AM62","v":0},null,null,{"$f":"IF(ISNUMBER(AP62),(VLOOKUP(AP62,$BO$6:$BP$50,2)),0)","v":0},{"$f":"IF(AP62<>\"\",5,0)","v":0},{"$f":"AQ62+AR62","v":0},null,null,{"$f":"IF(ISNUMBER(AU62),(VLOOKUP(AU62,$BO$6:$BP$50,2)),0)","v":0},{"$f":"IF(AU62<>\"\",5,0)","v":0},{"$f":"AV62+AW62","v":0},null,null,{"$f":"IF(ISNUMBER(AZ62),(VLOOKUP(AZ62,$BO$6:$BP$50,2)),0)","v":0},{"$f":"IF(AZ62<>\"\",5,0)","v":0},{"$f":"BA62+BB62","v":0},null,24,{"$f":"IF(ISNUMBER(BE62),(VLOOKUP(BE62,$BO$6:$BP$50,2)),0)","v":7},{"$f":"IF(BE62<>\"\",5,0)","v":5},{"$f":"BF62+BG62","v":12},null,null,{"$f":"IF(ISNUMBER(BJ62),(VLOOKUP(BJ62,$BO$6:$BP$50,2)),0)","v":0},{"$f":"IF(BJ62<>\"\",5,0)","v":0},{"$f":"BK62+BL62","v":0},null,57,0,0,0,0,0,0,0,1,0]
[{"$f":"IF(E63<E62,BO64,A62)","v":59},"Bjørkaa De Riz","Nias","Kjelsås",{"$f":"IF(F63<=4,Q63,(Q63-SUM(SMALL(R63:Y63,{1;2;3;4}))))","v":6},{"$f":"(IF(AC63=5,1,0)+IF(AH63=5,1,0)+IF(AM63=5,1,0)+IF(AR63=5,1,0)+IF(AW63=5,1,0)+IF(BB63=5,1,0)+IF(BG63=5,1,0)+IF(BL63=5,1,0))","v":1},null,{"$f":"IF(AA63=\"\",\"\",AA63)","v":""},{"$f":"IF(AF63=\"\",\"\",AF63)","v":""},{"$f":"IF(AK63=\"\",\"\",AK63)","v":""},{"$f":"IF(AP63=\"\",\"\",AP63)","v":""},{"$f":"IF(AU63=\"\",\"\",AU63)","v":""},{"$f":"IF(AZ63=\"\",\"\",AZ63)","v":""},{"$f":"IF(BE63=\"\",\"\",BE63)","v":30},{"$f":"IF(BJ63=\"\",\"\",BJ63)","v":""},null,{"$f":"AD63+AI63+AN63+AS63+AX63+BC63+BH63","v":6},{"$f":"IF($F63>=5,IF(AB63=\"\",\"\",AB63),\"\")","v":""},{"$f":"IF($F63>=5,IF(AG63=\"\",\"\",AG63),\"\")","v":""},{"$f":"IF($F63>=5,IF(AL63=\"\",\"\",AL63),\"\")","v":""},{"$f":"IF($F63>=5,IF(AQ63=\"\",\"\",AQ63),\"\")","v":""},{"$f":"IF($F63>=5,IF(AV63=\"\",\"\",AV63),\"\")","v":""},{"$f":"IF($F63>=5,IF(BA63=\"\",\"\",BA63),\"\")","v":""},{"$f":"IF($F63>=5,IF(BF63=\"\",\"\",BF63),\"\")","v":""},{"$f":"IF($F63>=5,IF(BK63=\"\",\"\",BK63),\"\")","v":""},null,null,{"$f":"IF(ISNUMBER(AA63),(VLOOKUP(AA63,$BO$6:$BP$50,2)),0)","v":0},{"$f":"IF(AA63<>\"\",5,0)","v":0},{"$f":"AB63+AC63","v":0},null,null,{"$f":"IF(ISNUMBER(AF63),(VLOOKUP(AF63,$BO$6:$BP$50,2)),0)","v":0},{"$f":"IF(AF63<>\"\",5,0)","v":0},{"$f":"AG63+AH63","v":0},null,null,{"$f":"IF(ISNUMBER(AK63),(VLOOKUP(AK63,$BO$6:$BP$50,2)),0)","v":0},{"$f":"IF(AK63<>\"\",5,0)","v":0},{"$f":"AL63+AM63","v":0},null,null,{"$f":"IF(ISNUMBER(AP63),(VLOOKUP(AP63,$BO$6:$BP$50,2)),0)","v":0},{"$f":"IF(AP63<>\"\",5,0)","v":0},{"$f":"AQ63+AR63","v":0},null,null,{"$f":"IF(ISNUMBER(AU63),(VLOOKUP(AU63,$BO$6:$BP$50,2)),0)","v":0},{"$f":"IF(AU63<>\"\",5,0)","v":0},{"$f":"AV63+AW63","v":0},null,null,{"$f":"IF(ISNUMBER(AZ63),(VLOOKUP(AZ63,$BO$6:$BP$50,2)),0)","v":0},{"$f":"IF(AZ63<>\"\",5,0)","v":0},{"$f":"BA63+BB63","v":0},null,30,{"$f":"IF(ISNUMBER(BE63),(VLOOKUP(BE63,$BO$6:$BP$50,2)),0)","v":1},{"$f":"IF(BE63<>\"\",5,0)","v":5},{"$f":"BF63+BG63","v":6},null,null,{"$f":"IF(ISNUMBER(BJ63),(VLOOKUP(BJ63,$BO$6:$BP$50,2)),0)","v":0},{"$f":"IF(BJ63<>\"\",5,0)","v":0},{"$f":"BK63+BL63","v":0},null,58,0,0,0,0,0,0,0,0,1]
[{"$f":"IF(E64<E63,BO65,A63)","v":60},"Bergh","Odin","Ljan",{"$f":"IF(F64<=4,Q64,(Q64-SUM(SMALL(R64:Y64,{1;2;3;4}))))","v":5},{"$f":"(IF(AC64=5,1,0)+IF(AH64=5,1,0)+IF(AM64=5,1,0)+IF(AR64=5,1,0)+IF(AW64=5,1,0)+IF(BB64=5,1,0)+IF(BG64=5,1,0)+IF(BL64=5,1,0))","v":1},null,{"$f":"IF(AA64=\"\",\"\",AA64)","v":""},{"$f":"IF(AF64=\"\",\"\",AF64)","v":"dsq"},{"$f":"IF(AK64=\"\",\"\",AK64)","v":""},{"$f":"IF(AP64=\"\",\"\",AP64)","v":""},{"$f":"IF(AU64=\"\",\"\",AU64)","v":""},{"$f":"IF(AZ64=\"\",\"\",AZ64)","v":""},{"$f":"IF(BE64=\"\",\"\",BE64)","v":""},{"$f":"IF(BJ64=\"\",\"\",BJ64)","v":""},null,{"$f":"AD64+AI64+AN64+AS64+AX64+BC64+BH64","v":5},{"$f":"IF($F64>=5,IF(AB64=\"\",\"\",AB64),\"\")","v":""},{"$f":"IF($F64>=5,IF(AG64=\"\",\"\",AG64),\"\")","v":""},{"$f":"IF($F64>=5,IF(AL64=\"\",\"\",AL64),\"\")","v":""},{"$f":"IF($F64>=5,IF(AQ64=\"\",\"\",AQ64),\"\")","v":""},{"$f":"IF($F64>=5,IF(AV64=\"\",\"\",AV64),\"\")","v":""},{"$f":"IF($F64>=5,IF(BA64=\"\",\"\",BA64),\"\")","v":""},{"$f":"IF($F64>=5,IF(BF64=\"\",\"\",BF64),\"\")","v":""},{"$f":"IF($F64>=5,IF(BK64=\"\",\"\",BK64),\"\")","v":""},null,null,{"$f":"IF(ISNUMBER(AA64),(VLOOKUP(AA64,$BO$6:$BP$50,2)),0)","v":0},{"$f":"IF(AA64<>\"\",5,0)","v":0},{"$f":"AB64+AC64","v":0},null,"dsq",{"$f":"IF(ISNUMBER(AF64),(VLOOKUP(AF64,$BO$6:$BP$50,2)),0)","v":0},{"$f":"IF(AF64<>\"\",5,0)","v":5},{"$f":"AG64+AH64","v":5},null,null,{"$f":"IF(ISNUMBER(AK64),(VLOOKUP(AK64,$BO$6:$BP$50,2)),0)","v":0},{"$f":"IF(AK64<>\"\",5,0)","v":0},{"$f":"AL64+AM64","v":0},null,null,{"$f":"IF(ISNUMBER(AP64),(VLOOKUP(AP64,$BO$6:$BP$50,2)),0)","v":0},{"$f":"IF(AP64<>\"\",5,0)","v":0},{"$f":"AQ64+AR64","v":0},null,null,{"$f":"IF(ISNUMBER(AU64),(VLOOKUP(AU64,$BO$6:$BP$50,2)),0)","v":0},{"$f":"IF(AU64<>\"\",5,0)","v":0},{"$f":"AV64+AW64","v":0},null,null,{"$f":"IF(ISNUMBER(AZ64),(VLOOKUP(AZ64,$BO$6:$BP$50,2)),0)","v":0},{"$f":"IF(AZ64<>\"\",5,0)","v":0},{"$f":"BA64+BB64","v":0},null,null,{"$f":"IF(ISNUMBER(BE64),(VLOOKUP(BE64,$BO$6:$BP$50,2)),0)","v":0},{"$f":"IF(BE64<>\"\",5,0)","v":0},{"$f":"BF64+BG64","v":0},null,null,{"$f":"IF(ISNUMBER(BJ64),(VLOOKUP(BJ64,$BO$6:$BP$50,2)),0)","v":0},{"$f":"IF(BJ64<>\"\",5,0)","v":0},{"$f":"BK64+BL64","v":0},null,59,0,0,0,0,0,0,1,0,0]
[{"$f":"IF(E65<E64,BO66,A64)","v":60},"Ofstad","Lukas","Ljan",{"$f":"IF(F65<=4,Q65,(Q65-SUM(SMALL(R65:Y65,{1;2;3;4}))))","v":5},{"$f":"(IF(AC65=5,1,0)+IF(AH65=5,1,0)+IF(AM65=5,1,0)+IF(AR65=5,1,0)+IF(AW65=5,1,0)+IF(BB65=5,1,0)+IF(BG65=5,1,0)+IF(BL65=5,1,0))","v":1},null,{"$f":"IF(AA65=\"\",\"\",AA65)","v":""},{"$f":"IF(AF65=\"\",\"\",AF65)","v":"dsq"},{"$f":"IF(AK65=\"\",\"\",AK65)","v":""},{"$f":"IF(AP65=\"\",\"\",AP65)","v":""},{"$f":"IF(AU65=\"\",\"\",AU65)","v":""},{"$f":"IF(AZ65=\"\",\"\",AZ65)","v":""},{"$f":"IF(BE65=\"\",\"\",BE65)","v":""},{"$f":"IF(BJ65=\"\",\"\",BJ65)","v":""},null,{"$f":"AD65+AI65+AN65+AS65+AX65+BC65+BH65","v":5},{"$f":"IF($F65>=5,IF(AB65=\"\",\"\",AB65),\"\")","v":""},{"$f":"IF($F65>=5,IF(AG65=\"\",\"\",AG65),\"\")","v":""},{"$f":"IF($F65>=5,IF(AL65=\"\",\"\",AL65),\"\")","v":""},{"$f":"IF($F65>=5,IF(AQ65=\"\",\"\",AQ65),\"\")","v":""},{"$f":"IF($F65>=5,IF(AV65=\"\",\"\",AV65),\"\")","v":""},{"$f":"IF($F65>=5,IF(BA65=\"\",\"\",BA65),\"\")","v":""},{"$f":"IF($F65>=5,IF(BF65=\"\",\"\",BF65),\"\")","v":""},{"$f":"IF($F65>=5,IF(BK65=\"\",\"\",BK65),\"\")","v":""},null,null,{"$f":"IF(ISNUMBER(AA65),(VLOOKUP(AA65,$BO$6:$BP$50,2)),0)","v":0},{"$f":"IF(AA65<>\"\",5,0)","v":0},{"$f":"AB65+AC65","v":0},null,"dsq",{"$f":"IF(ISNUMBER(AF65),(VLOOKUP(AF65,$BO$6:$BP$50,2)),0)","v":0},{"$f":"IF(AF65<>\"\",5,0)","v":5},{"$f":"AG65+AH65","v":5},null,null,{"$f":"IF(ISNUMBER(AK65),(VLOOKUP(AK65,$BO$6:$BP$50,2)),0)","v":0},{"$f":"IF(AK65<>\"\",5,0)","v":0},{"$f":"AL65+AM65","v":0},null,null,{"$f":"IF(ISNUMBER(AP65),(VLOOKUP(AP65,$BO$6:$BP$50,2)),0)","v":0},{"$f":"IF(AP65<>\"\",5,0)","v":0},{"$f":"AQ65+AR65","v":0},null,null,{"$f":"IF(ISNUMBER(AU65),(VLOOKUP(AU65,$BO$6:$BP$50,2)),0)","v":0},{"$f":"IF(AU65<>\"\",5,0)","v":0},{"$f":"AV65+AW65","v":0},null,null,{"$f":"IF(ISNUMBER(AZ65),(VLOOKUP(AZ65,$BO$6:$BP$50,2)),0)","v":0},{"$f":"IF(AZ65<>\"\",5,0)","v":0},{"$f":"BA65+BB65","v":0},null,null,{"$f":"IF(ISNUMBER(BE65),(VLOOKUP(BE65,$BO$6:$BP$50,2)),0)","v":0},{"$f":"IF(BE65<>\"\",5,0)","v":0},{"$f":"BF65+BG65","v":0},null,null,{"$f":"IF(ISNUMBER(BJ65),(VLOOKUP(BJ65,$BO$6:$BP$50,2)),0)","v":0},{"$f":"IF(BJ65<>\"\",5,0)","v":0},{"$f":"BK65+BL65","v":0},null,60,0,0,0,0,0,0,0,1,0]
[{"$f":"IF(E66<E65,BO67,A65)","v":60},"Skard","Edvard","Ljan",{"$f":"IF(F66<=4,Q66,(Q66-SUM(SMALL(R66:Y66,{1;2;3;4}))))","v":5},{"$f":"(IF(AC66=5,1,0)+IF(AH66=5,1,0)+IF(AM66=5,1,0)+IF(AR66=5,1,0)+IF(AW66=5,1,0)+IF(BB66=5,1,0)+IF(BG66=5,1,0)+IF(BL66=5,1,0))","v":1},null,{"$f":"IF(AA66=\"\",\"\",AA66)","v":""},{"$f":"IF(AF66=\"\",\"\",AF66)","v":"dsq"},{"$f":"IF(AK66=\"\",\"\",AK66)","v":""},{"$f":"IF(AP66=\"\",\"\",AP66)","v":""},{"$f":"IF(AU66=\"\",\"\",AU66)","v":""},{"$f":"IF(AZ66=\"\",\"\",AZ66)","v":""},{"$f":"IF(BE66=\"\",\"\",BE66)","v":""},{"$f":"IF(BJ66=\"\",\"\",BJ66)","v":""},null,{"$f":"AD66+AI66+AN66+AS66+AX66+BC66+BH66","v":5},{"$f":"IF($F66>=5,IF(AB66=\"\",\"\",AB66),\"\")","v":""},{"$f":"IF($F66>=5,IF(AG66=\"\",\"\",AG66),\"\")","v":""},{"$f":"IF($F66>=5,IF(AL66=\"\",\"\",AL66),\"\")","v":""},{"$f":"IF($F66>=5,IF(AQ66=\"\",\"\",AQ66),\"\")","v":""},{"$f":"IF($F66>=5,IF(AV66=\"\",\"\",AV66),\"\")","v":""},{"$f":"IF($F66>=5,IF(BA66=\"\",\"\",BA66),\"\")","v":""},{"$f":"IF($F66>=5,IF(BF66=\"\",\"\",BF66),\"\")","v":""},{"$f":"IF($F66>=5,IF(BK66=\"\",\"\",BK66),\"\")","v":""},null,null,{"$f":"IF(ISNUMBER(AA66),(VLOOKUP(AA66,$BO$6:$BP$50,2)),0)","v":0},{"$f":"IF(AA66<>\"\",5,0)","v":0},{"$f":"AB66+AC66","v":0},null,"dsq",{"$f":"IF(ISNUMBER(AF66),(VLOOKUP(AF66,$BO$6:$BP$50,2)),0)","v":0},{"$f":"IF(AF66<>\"\",5,0)","v":5},{"$f":"AG66+AH66","v":5},null,null,{"$f":"IF(ISNUMBER(AK66),(VLOOKUP(AK66,$BO$6:$BP$50,2)),0)","v":0},{"$f":"IF(AK66<>\"\",5,0)","v":0},{"$f":"AL66+AM66","v":0},null,null,{"$f":"IF(ISNUMBER(AP66),(VLOOKUP(AP66,$BO$6:$BP$50,2)),0)","v":0},{"$f":"IF(AP66<>\"\",5,0)","v":0},{"$f":"AQ66+AR66","v":0},null,null,{"$f":"IF(ISNUMBER(AU66),(VLOOKUP(AU66,$BO$6:$BP$50,2)),0)","v":0},{"$f":"IF(AU66<>\"\",5,0)","v":0},{"$f":"AV66+AW66","v":0},null,null,{"$f":"IF(ISNUMBER(AZ66),(VLOOKUP(AZ66,$BO$6:$BP$50,2)),0)","v":0},{"$f":"IF(AZ66<>\"\",5,0)","v":0},{"$f":"BA66+BB66","v":0},null,null,{"$f":"IF(ISNUMBER(BE66),(VLOOKUP(BE66,$BO$6:$BP$50,2)),0)","v":0},{"$f":"IF(BE66<>\"\",5,0)","v":0},{"$f":"BF66+BG66","v":0},null,null,{"$f":"IF(ISNUMBER(BJ66),(VLOOKUP(BJ66,$BO$6:$BP$50,2)),0)","v":0},{"$f":"IF(BJ66<>\"\",5,0)","v":0},{"$f":"BK66+BL66","v":0},null,61,0,0,0,0,0,0,0,1,0]
[{"$f":"IF(E67<E66,BO68,A66)","v":60},"Lad","Lukas Ofstad","Ljan",{"$f":"IF(F67<=4,Q67,(Q67-SUM(SMALL(R67:Y67,{1;2;3;4}))))","v":5},{"$f":"(IF(AC67=5,1,0)+IF(AH67=5,1,0)+IF(AM67=5,1,0)+IF(AR67=5,1,0)+IF(AW67=5,1,0)+IF(BB67=5,1,0)+IF(BG67=5,1,0)+IF(BL67=5,1,0))","v":1},null,{"$f":"IF(AA67=\"\",\"\",AA67)","v":""},{"$f":"IF(AF67=\"\",\"\",AF67)","v":""},{"$f":"IF(AK67=\"\",\"\",AK67)","v":32},{"$f":"IF(AP67=\"\",\"\",AP67)","v":""},{"$f":"IF(AU67=\"\",\"\",AU67)","v":""},{"$f":"IF(AZ67=\"\",\"\",AZ67)","v":""},{"$f":"IF(BE67=\"\",\"\",BE67)","v":""},{"$f":"IF(BJ67=\"\",\"\",BJ67)","v":""},null,{"$f":"AD67+AI67+AN67+AS67+AX67+BC67+BH67","v":5},{"$f":"IF($F67>=5,IF(AB67=\"\",\"\",AB67),\"\")","v":""},{"$f":"IF($F67>=5,IF(AG67=\"\",\"\",AG67),\"\")","v":""},{"$f":"IF($F67>=5,IF(AL67=\"\",\"\",AL67),\"\")","v":""},{"$f":"IF($F67>=5,IF(AQ67=\"\",\"\",AQ67),\"\")","v":""},{"$f":"IF($F67>=5,IF(AV67=\"\",\"\",AV67),\"\")","v":""},{"$f":"IF($F67>=5,IF(BA67=\"\",\"\",BA67),\"\")","v":""},{"$f":"IF($F67>=5,IF(BF67=\"\",\"\",BF67),\"\")","v":""},{"$f":"IF($F67>=5,IF(BK67=\"\",\"\",BK67),\"\")","v":""},null,null,{"$f":"IF(ISNUMBER(AA67),(VLOOKUP(AA67,$BO$6:$BP$50,2)),0)","v":0},{"$f":"IF(AA67<>\"\",5,0)","v":0},{"$f":"AB67+AC67","v":0},null,null,{"$f":"IF(ISNUMBER(AF67),(VLOOKUP(AF67,$BO$6:$BP$50,2)),0)","v":0},{"$f":"IF(AF67<>\"\",5,0)","v":0},{"$f":"AG67+AH67","v":0},null,32,{"$f":"IF(ISNUMBER(AK67),(VLOOKUP(AK67,$BO$6:$BP$50,2)),0)","v":0},{"$f":"IF(AK67<>\"\",5,0)","v":5},{"$f":"AL67+AM67","v":5},null,null,{"$f":"IF(ISNUMBER(AP67),(VLOOKUP(AP67,$BO$6:$BP$50,2)),0)","v":0},{"$f":"IF(AP67<>\"\",5,0)","v":0},{"$f":"AQ67+AR67","v":0},null,null,{"$f":"IF(ISNUMBER(AU67),(VLOOKUP(AU67,$BO$6:$BP$50,2)),0)","v":0},{"$f":"IF(AU67<>\"\",5,0)","v":0},{"$f":"AV67+AW67","v":0},null,null,{"$f":"IF(ISNUMBER(AZ67),(VLOOKUP(AZ67,$BO$6:$BP$50,2)),0)","v":0},{"$f":"IF(AZ67<>\"\",5,0)","v":0},{"$f":"BA67+BB67","v":0},null,null,{"$f":"IF(ISNUMBER(BE67),(VLOOKUP(BE67,$BO$6:$BP$50,2)),0)","v":0},{"$f":"IF(BE67<>\"\",5,0)","v":0},{"$f":"BF67+BG67","v":0},null,null,{"$f":"IF(ISNUMBER(BJ67),(VLOOKUP(BJ67,$BO$6:$BP$50,2)),0)","v":0},{"$f":"IF(BJ67<>\"\",5,0)","v":0},{"$f":"BK67+BL67","v":0},null,62,0,0,0,0,0,0,0,1,0]
[{"$f":"IF(E68<E67,BO69,A67)","v":60},"Vedal","Kristoffer",null,{"$f":"IF(F68<=4,Q68,(Q68-SUM(SMALL(R68:Y68,{1;2;3;4}))))","v":5},{"$f":"(IF(AC68=5,1,0)+IF(AH68=5,1,0)+IF(AM68=5,1,0)+IF(AR68=5,1,0)+IF(AW68=5,1,0)+IF(BB68=5,1,0)+IF(BG68=5,1,0)+IF(BL68=5,1,0))","v":1},null,{"$f":"IF(AA68=\"\",\"\",AA68)","v":""},{"$f":"IF(AF68=\"\",\"\",AF68)","v":""},{"$f":"IF(AK68=\"\",\"\",AK68)","v":""},{"$f":"IF(AP68=\"\",\"\",AP68)","v":""},{"$f":"IF(AU68=\"\",\"\",AU68)","v":31},{"$f":"IF(AZ68=\"\",\"\",AZ68)","v":""},{"$f":"IF(BE68=\"\",\"\",BE68)","v":""},{"$f":"IF(BJ68=\"\",\"\",BJ68)","v":""},null,{"$f":"AD68+AI68+AN68+AS68+AX68+BC68+BH68","v":5},{"$f":"IF($F68>=5,IF(AB68=\"\",\"\",AB68),\"\")","v":""},{"$f":"IF($F68>=5,IF(AG68=\"\",\"\",AG68),\"\")","v":""},{"$f":"IF($F68>=5,IF(AL68=\"\",\"\",AL68),\"\")","v":""},{"$f":"IF($F68>=5,IF(AQ68=\"\",\"\",AQ68),\"\")","v":""},{"$f":"IF($F68>=5,IF(AV68=\"\",\"\",AV68),\"\")","v":""},{"$f":"IF($F68>=5,IF(BA68=\"\",\"\",BA68),\"\")","v":""},{"$f":"IF($F68>=5,IF(BF68=\"\",\"\",BF68),\"\")","v":""},{"$f":"IF($F68>=5,IF(BK68=\"\",\"\",BK68),\"\")","v":""},null,null,{"$f":"IF(ISNUMBER(AA68),(VLOOKUP(AA68,$BO$6:$BP$50,2)),0)","v":0},{"$f":"IF(AA68<>\"\",5,0)","v":0},{"$f":"AB68+AC68","v":0},null,null,{"$f":"IF(ISNUMBER(AF68),(VLOOKUP(AF68,$BO$6:$BP$50,2)),0)","v":0},{"$f":"IF(AF68<>\"\",5,0)","v":0},{"$f":"AG68+AH68","v":0},null,null,{"$f":"IF(ISNUMBER(AK68),(VLOOKUP(AK68,$BO$6:$BP$50,2)),0)","v":0},{"$f":"IF(AK68<>\"\",5,0)","v":0},{"$f":"AL68+AM68","v":0},null,null,{"$f":"IF(ISNUMBER(AP68),(VLOOKUP(AP68,$BO$6:$BP$50,2)),0)","v":0},{"$f":"IF(AP68<>\"\",5,0)","v":0},{"$f":"AQ68+AR68","v":0},null,31,{"$f":"IF(ISNUMBER(AU68),(VLOOKUP(AU68,$BO$6:$BP$50,2)),0)","v":0},{"$f":"IF(AU68<>\"\",5,0)","v":5},{"$f":"AV68+AW68","v":5},null,null,{"$f":"IF(ISNUMBER(AZ68),(VLOOKUP(AZ68,$BO$6:$BP$50,2)),0)","v":0},{"$f":"IF(AZ68<>\"\",5,0)","v":0},{"$f":"BA68+BB68","v":0},null,null,{"$f":"IF(ISNUMBER(BE68),(VLOOKUP(BE68,$BO$6:$BP$50,2)),0)","v":0},{"$f":"IF(BE68<>\"\",5,0)","v":0},{"$f":"BF68+BG68","v":0},null,null,{"$f":"IF(ISNUMBER(BJ68),(VLOOKUP(BJ68,$BO$6:$BP$50,2)),0)","v":0},{"$f":"IF(BJ68<>\"\",5,0)","v":0},{"$f":"BK68+BL68","v":0},null,63,0,0,0,0,0,0,0,0,1]
[{"$f":"IF(E69<E68,BO70,A68)","v":60},"Axelsen","Kristian",null,{"$f":"IF(F69<=4,Q69,(Q69-SUM(SMALL(R69:Y69,{1;2;3;4}))))","v":5},{"$f":"(IF(AC69=5,1,0)+IF(AH69=5,1,0)+IF(AM69=5,1,0)+IF(AR69=5,1,0)+IF(AW69=5,1,0)+IF(BB69=5,1,0)+IF(BG69=5,1,0)+IF(BL69=5,1,0))","v":1},null,{"$f":"IF(AA69=\"\",\"\",AA69)","v":""},{"$f":"IF(AF69=\"\",\"\",AF69)","v":""},{"$f":"IF(AK69=\"\",\"\",AK69)","v":""},{"$f":"IF(AP69=\"\",\"\",AP69)","v":""},{"$f":"IF(AU69=\"\",\"\",AU69)","v":33},{"$f":"IF(AZ69=\"\",\"\",AZ69)","v":""},{"$f":"IF(BE69=\"\",\"\",BE69)","v":""},{"$f":"IF(BJ69=\"\",\"\",BJ69)","v":""},null,{"$f":"AD69+AI69+AN69+AS69+AX69+BC69+BH69","v":5},{"$f":"IF($F69>=5,IF(AB69=\"\",\"\",AB69),\"\")","v":""},{"$f":"IF($F69>=5,IF(AG69=\"\",\"\",AG69),\"\")","v":""},{"$f":"IF($F69>=5,IF(AL69=\"\",\"\",AL69),\"\")","v":""},{"$f":"IF($F69>=5,IF(AQ69=\"\",\"\",AQ69),\"\")","v":""},{"$f":"IF($F69>=5,IF(AV69=\"\",\"\",AV69),\"\")","v":""},{"$f":"IF($F69>=5,IF(BA69=\"\",\"\",BA69),\"\")","v":""},{"$f":"IF($F69>=5,IF(BF69=\"\",\"\",BF69),\"\")","v":""},{"$f":"IF($F69>=5,IF(BK69=\"\",\"\",BK69),\"\")","v":""},null,null,{"$f":"IF(ISNUMBER(AA69),(VLOOKUP(AA69,$BO$6:$BP$50,2)),0)","v":0},{"$f":"IF(AA69<>\"\",5,0)","v":0},{"$f":"AB69+AC69","v":0},null,null,{"$f":"IF(ISNUMBER(AF69),(VLOOKUP(AF69,$BO$6:$BP$50,2)),0)","v":0},{"$f":"IF(AF69<>\"\",5,0)","v":0},{"$f":"AG69+AH69","v":0},null,null,{"$f":"IF(ISNUMBER(AK69),(VLOOKUP(AK69,$BO$6:$BP$50,2)),0)","v":0},{"$f":"IF(AK69<>\"\",5,0)","v":0},{"$f":"AL69+AM69","v":0},null,null,{"$f":"IF(ISNUMBER(AP69),(VLOOKUP(AP69,$BO$6:$BP$50,2)),0)","v":0},{"$f":"IF(AP69<>\"\",5,0)","v":0},{"$f":"AQ69+AR69","v":0},null,33,{"$f":"IF(ISNUMBER(AU69),(VLOOKUP(AU69,$BO$6:$BP$50,2)),0)","v":0},{"$f":"IF(AU69<>\"\",5,0)","v":5},{"$f":"AV69+AW69","v":5},null,null,{"$f":"IF(ISNUMBER(AZ69),(VLOOKUP(AZ69,$BO$6:$BP$50,2)),0)","v":0},{"$f":"IF(AZ69<>\"\",5,0)","v":0},{"$f":"BA69+BB69","v":0},null,null,{"$f":"IF(ISNUMBER(BE69),(VLOOKUP(BE69,$BO$6:$BP$50,2)),0)","v":0},{"$f":"IF(BE69<>\"\",5,0)","v":0},{"$f":"BF69+BG69","v":0},null,null,{"$f":"IF(ISNUMBER(BJ69),(VLOOKUP(BJ69,$BO$6:$BP$50,2)),0)","v":0},{"$f":"IF(BJ69<>\"\",5,0)","v":0},{"$f":"BK69+BL69","v":0},null,64,0,0,0,0,0,0,0,0,1]
[{"$f":"IF(E70<E69,BO71,A69)","v":60},"Bergh-Jørgensen","Jesper","Ullensaker",{"$f":"IF(F70<=4,Q70,(Q70-SUM(SMALL(R70:Y70,{1;2;3;4}))))","v":5},{"$f":"(IF(AC70=5,1,0)+IF(AH70=5,1,0)+IF(AM70=5,1,0)+IF(AR70=5,1,0)+IF(AW70=5,1,0)+IF(BB70=5,1,0)+IF(BG70=5,1,0)+IF(BL70=5,1,0))","v":1},null,{"$f":"IF(AA70=\"\",\"\",AA70)","v":""},{"$f":"IF(AF70=\"\",\"\",AF70)","v":""},{"$f":"IF(AK70=\"\",\"\",AK70)","v":""},{"$f":"IF(AP70=\"\",\"\",AP70)","v":""},{"$f":"IF(AU70=\"\",\"\",AU70)","v":34},{"$f":"IF(AZ70=\"\",\"\",AZ70)","v":""},{"$f":"IF(BE70=\"\",\"\",BE70)","v":""},{"$f":"IF(BJ70=\"\",\"\",BJ70)","v":""},null,{"$f":"AD70+AI70+AN70+AS70+AX70+BC70+BH70","v":5},{"$f":"IF($F70>=5,IF(AB70=\"\",\"\",AB70),\"\")","v":""},{"$f":"IF($F70>=5,IF(AG70=\"\",\"\",AG70),\"\")","v":""},{"$f":"IF($F70>=5,IF(AL70=\"\",\"\",AL70),\"\")","v":""},{"$f":"IF($F70>=5,IF(AQ70=\"\",\"\",AQ70),\"\")","v":""},{"$f":"IF($F70>=5,IF(AV70=\"\",\"\",AV70),\"\")","v":""},{"$f":"IF($F70>=5,IF(BA70=\"\",\"\",BA70),\"\")","v":""},{"$f":"IF($F70>=5,IF(BF70=\"\",\"\",BF70),\"\")","v":""},{"$f":"IF($F70>=5,IF(BK70=\"\",\"\",BK70),\"\")","v":""},null,null,{"$f":"IF(ISNUMBER(AA70),(VLOOKUP(AA70,$BO$6:$BP$50,2)),0)","v":0},{"$f":"IF(AA70<>\"\",5,0)","v":0},{"$f":"AB70+AC70","v":0},null,null,{"$f":"IF(ISNUMBER(AF70),(VLOOKUP(AF70,$BO$6:$BP$50,2)),0)","v":0},{"$f":"IF(AF70<>\"\",5,0)","v":0},{"$f":"AG70+AH70","v":0},null,null,{"$f":"IF(ISNUMBER(AK70),(VLOOKUP(AK70,$BO$6:$BP$50,2)),0)","v":0},{"$f":"IF(AK70<>\"\",5,0)","v":0},{"$f":"AL70+AM70","v":0},null,null,{"$f":"IF(ISNUMBER(AP70),(VLOOKUP(AP70,$BO$6:$BP$50,2)),0)","v":0},{"$f":"IF(AP70<>\"\",5,0)","v":0},{"$f":"AQ70+AR70","v":0},null,34,{"$f":"IF(ISNUMBER(AU70),(VLOOKUP(AU70,$BO$6:$BP$50,2)),0)","v":0},{"$f":"IF(AU70<>\"\",5,0)","v":5},{"$f":"AV70+AW70","v":5},null,null,{"$f":"IF(ISNUMBER(AZ70),(VLOOKUP(AZ70,$BO$6:$BP$50,2)),0)","v":0},{"$f":"IF(AZ70<>\"\",5,0)","v":0},{"$f":"BA70+BB70","v":0},null,null,{"$f":"IF(ISNUMBER(BE70),(VLOOKUP(BE70,$BO$6:$BP$50,2)),0)","v":0},{"$f":"IF(BE70<>\"\",5,0)","v":0},{"$f":"BF70+BG70","v":0},null,null,{"$f":"IF(ISNUMBER(BJ70),(VLOOKUP(BJ70,$BO$6:$BP$50,2)),0)","v":0},{"$f":"IF(BJ70<>\"\",5,0)","v":0},{"$f":"BK70+BL70","v":0},null,65,0,0,0,0,0,0,0,0,1]
[{"$f":"IF(E71<E70,BO72,A70)","v":60},"Furuseth","Nikolai Mathias","Ullensaker",{"$f":"IF(F71<=4,Q71,(Q71-SUM(SMALL(R71:Y71,{1;2;3;4}))))","v":5},{"$f":"(IF(AC71=5,1,0)+IF(AH71=5,1,0)+IF(AM71=5,1,0)+IF(AR71=5,1,0)+IF(AW71=5,1,0)+IF(BB71=5,1,0)+IF(BG71=5,1,0)+IF(BL71=5,1,0))","v":1},null,{"$f":"IF(AA71=\"\",\"\",AA71)","v":""},{"$f":"IF(AF71=\"\",\"\",AF71)","v":""},{"$f":"IF(AK71=\"\",\"\",AK71)","v":""},{"$f":"IF(AP71=\"\",\"\",AP71)","v":""},{"$f":"IF(AU71=\"\",\"\",AU71)","v":"dnf"},{"$f":"IF(AZ71=\"\",\"\",AZ71)","v":""},{"$f":"IF(BE71=\"\",\"\",BE71)","v":""},{"$f":"IF(BJ71=\"\",\"\",BJ71)","v":""},null,{"$f":"AD71+AI71+AN71+AS71+AX71+BC71+BH71","v":5},{"$f":"IF($F71>=5,IF(AB71=\"\",\"\",AB71),\"\")","v":""},{"$f":"IF($F71>=5,IF(AG71=\"\",\"\",AG71),\"\")","v":""},{"$f":"IF($F71>=5,IF(AL71=\"\",\"\",AL71),\"\")","v":""},{"$f":"IF($F71>=5,IF(AQ71=\"\",\"\",AQ71),\"\")","v":""},{"$f":"IF($F71>=5,IF(AV71=\"\",\"\",AV71),\"\")","v":""},{"$f":"IF($F71>=5,IF(BA71=\"\",\"\",BA71),\"\")","v":""},{"$f":"IF($F71>=5,IF(BF71=\"\",\"\",BF71),\"\")","v":""},{"$f":"IF($F71>=5,IF(BK71=\"\",\"\",BK71),\"\")","v":""},null,null,{"$f":"IF(ISNUMBER(AA71),(VLOOKUP(AA71,$BO$6:$BP$50,2)),0)","v":0},{"$f":"IF(AA71<>\"\",5,0)","v":0},{"$f":"AB71+AC71","v":0},null,null,{"$f":"IF(ISNUMBER(AF71),(VLOOKUP(AF71,$BO$6:$BP$50,2)),0)","v":0},{"$f":"IF(AF71<>\"\",5,0)","v":0},{"$f":"AG71+AH71","v":0},null,null,{"$f":"IF(ISNUMBER(AK71),(VLOOKUP(AK71,$BO$6:$BP$50,2)),0)","v":0},{"$f":"IF(AK71<>\"\",5,0)","v":0},{"$f":"AL71+AM71","v":0},null,null,{"$f":"IF(ISNUMBER(AP71),(VLOOKUP(AP71,$BO$6:$BP$50,2)),0)","v":0},{"$f":"IF(AP71<>\"\",5,0)","v":0},{"$f":"AQ71+AR71","v":0},null,"dnf",{"$f":"IF(ISNUMBER(AU71),(VLOOKUP(AU71,$BO$6:$BP$50,2)),0)","v":0},{"$f":"IF(AU71<>\"\",5,0)","v":5},{"$f":"AV71+AW71","v":5},null,null,{"$f":"IF(ISNUMBER(AZ71),(VLOOKUP(AZ71,$BO$6:$BP$50,2)),0)","v":0},{"$f":"IF(AZ71<>\"\",5,0)","v":0},{"$f":"BA71+BB71","v":0},null,null,{"$f":"IF(ISNUMBER(BE71),(VLOOKUP(BE71,$BO$6:$BP$50,2)),0)","v":0},{"$f":"IF(BE71<>\"\",5,0)","v":0},{"$f":"BF71+BG71","v":0},null,null,{"$f":"IF(ISNUMBER(BJ71),(VLOOKUP(BJ71,$BO$6:$BP$50,2)),0)","v":0},{"$f":"IF(BJ71<>\"\",5,0)","v":0},{"$f":"BK71+BL71","v":0},null,66,0,{"$f":"IF($F71=8,1,0)","v":0},0,0,0,0,0,0,1]
[{"$f":"IF(E72<E71,BO73,A71)","v":0},null,null,null,{"$f":"IF(F72<=4,Q72,(Q72-SUM(SMALL(R72:Y72,{1;2;3;4}))))","v":0},{"$f":"(IF(AC72=5,1,0)+IF(AH72=5,1,0)+IF(AM72=5,1,0)+IF(AR72=5,1,0)+IF(AW72=5,1,0)+IF(BB72=5,1,0)+IF(BG72=5,1,0)+IF(BL72=5,1,0))","v":0},null,{"$f":"IF(AA72=\"\",\"\",AA72)","v":""},{"$f":"IF(AF72=\"\",\"\",AF72)","v":""},{"$f":"IF(AK72=\"\",\"\",AK72)","v":""},{"$f":"IF(AP72=\"\",\"\",AP72)","v":""},{"$f":"IF(AU72=\"\",\"\",AU72)","v":""},{"$f":"IF(AZ72=\"\",\"\",AZ72)","v":""},{"$f":"IF(BE72=\"\",\"\",BE72)","v":""},{"$f":"IF(BJ72=\"\",\"\",BJ72)","v":""},null,{"$f":"AD72+AI72+AN72+AS72+AX72+BC72+BH72","v":0},{"$f":"IF($F72>=5,IF(AB72=\"\",\"\",AB72),\"\")","v":""},{"$f":"IF($F72>=5,IF(AG72=\"\",\"\",AG72),\"\")","v":""},{"$f":"IF($F72>=5,IF(AL72=\"\",\"\",AL72),\"\")","v":""},{"$f":"IF($F72>=5,IF(AQ72=\"\",\"\",AQ72),\"\")","v":""},{"$f":"IF($F72>=5,IF(AV72=\"\",\"\",AV72),\"\")","v":""},{"$f":"IF($F72>=5,IF(BA72=\"\",\"\",BA72),\"\")","v":""},{"$f":"IF($F72>=5,IF(BF72=\"\",\"\",BF72),\"\")","v":""},{"$f":"IF($F72>=5,IF(BK72=\"\",\"\",BK72),\"\")","v":""},null,null,{"$f":"IF(ISNUMBER(AA72),(VLOOKUP(AA72,$BO$6:$BP$50,2)),0)","v":0},{"$f":"IF(AA72<>\"\",5,0)","v":0},{"$f":"AB72+AC72","v":0},null,null,{"$f":"IF(ISNUMBER(AF72),(VLOOKUP(AF72,$BO$6:$BP$50,2)),0)","v":0},{"$f":"IF(AF72<>\"\",5,0)","v":0},{"$f":"AG72+AH72","v":0},null,null,{"$f":"IF(ISNUMBER(AK72),(VLOOKUP(AK72,$BO$6:$BP$50,2)),0)","v":0},{"$f":"IF(AK72<>\"\",5,0)","v":0},{"$f":"AL72+AM72","v":0},null,null,{"$f":"IF(ISNUMBER(AP72),(VLOOKUP(AP72,$BO$6:$BP$50,2)),0)","v":0},{"$f":"IF(AP72<>\"\",5,0)","v":0},{"$f":"AQ72+AR72","v":0},null,null,{"$f":"IF(ISNUMBER(AU72),(VLOOKUP(AU72,$BO$6:$BP$50,2)),0)","v":0},{"$f":"IF(AU72<>\"\",5,0)","v":0},{"$f":"AV72+AW72","v":0},null,null,{"$f":"IF(ISNUMBER(AZ72),(VLOOKUP(AZ72,$BO$6:$BP$50,2)),0)","v":0},{"$f":"IF(AZ72<>\"\",5,0)","v":0},{"$f":"BA72+BB72","v":0},null,null,{"$f":"IF(ISNUMBER(BE72),(VLOOKUP(BE72,$BO$6:$BP$50,2)),0)","v":0},{"$f":"IF(BE72<>\"\",5,0)","v":0},{"$f":"BF72+BG72","v":0},null,null,{"$f":"IF(ISNUMBER(BJ72),(VLOOKUP(BJ72,$BO$6:$BP$50,2)),0)","v":0},{"$f":"IF(BJ72<>\"\",5,0)","v":0},{"$f":"BK72+BL72","v":0},null,67,0,0,0,0,0,0,0,0,1]